<?xml version="1.0" encoding="UTF-8"?>
<!-- 
    RTO - Ratio
    Status: draft
-->
<rule xmlns="http://purl.oclc.org/dsdl/schematron"
      abstract="true"
      id="hl7nl-RTO"
      see="https://docs.art-decor.org/documentation/datatypes/DTr1_hl7nl:RTO">
    <extends rule="QTY"/>
</rule>
