<?xml version="1.0" encoding="UTF-8"?>
<!--
Template derived pattern
===========================================
ID: 1.2.40.0.34.11.2.2.23
Name: OP-Bericht
Description: Operationsbericht
-->
<pattern xmlns="http://purl.oclc.org/dsdl/schematron"
         id="template-1.2.40.0.34.11.2.2.23-2013-02-10T000000">
   <title>OP-Bericht</title>
   <!--
Template derived rules for ID: 1.2.40.0.34.11.2.2.23
Context: *[hl7:section[hl7:templateId[@root = '1.2.40.0.34.11.2.2.23']]]
Item: (OPBericht)
-->

   <!--
Template derived rules for ID: 1.2.40.0.34.11.2.2.23
Context: *[hl7:section[hl7:templateId[@root = '1.2.40.0.34.11.2.2.23']]]/hl7:section[hl7:templateId[@root = '1.2.40.0.34.11.2.2.23']]
Item: (OPBericht)
-->

   <rule fpi="RULC-1"
         context="*[hl7:section[hl7:templateId[@root = '1.2.40.0.34.11.2.2.23']]]/hl7:section[hl7:templateId[@root = '1.2.40.0.34.11.2.2.23']]"
         id="d42e4785-false-d56693e0">
      <assert role="error"
              see="http://elga.art-decor.org/elga-html-20250116T123711/tmp-1.2.40.0.34.11.2.2.23-2013-02-10T000000.html"
              test="count(hl7:templateId[@root = '1.2.40.0.34.11.2.2.23']) &gt;= 1">(OPBericht): Element hl7:templateId[@root = '1.2.40.0.34.11.2.2.23'] ist required [min 1x].</assert>
      <assert role="error"
              see="http://elga.art-decor.org/elga-html-20250116T123711/tmp-1.2.40.0.34.11.2.2.23-2013-02-10T000000.html"
              test="count(hl7:templateId[@root = '1.2.40.0.34.11.2.2.23']) &lt;= 1">(OPBericht): Element hl7:templateId[@root = '1.2.40.0.34.11.2.2.23'] kommt zu häufig vor [max 1x].</assert>
      <assert role="error"
              see="http://elga.art-decor.org/elga-html-20250116T123711/tmp-1.2.40.0.34.11.2.2.23-2013-02-10T000000.html"
              test="count(hl7:code[(@code = 'OPBER' and @codeSystem = '1.2.40.0.34.5.40')]) &gt;= 1">(OPBericht): Element hl7:code[(@code = 'OPBER' and @codeSystem = '1.2.40.0.34.5.40')] ist mandatory [min 1x].</assert>
      <assert role="error"
              see="http://elga.art-decor.org/elga-html-20250116T123711/tmp-1.2.40.0.34.11.2.2.23-2013-02-10T000000.html"
              test="count(hl7:code[(@code = 'OPBER' and @codeSystem = '1.2.40.0.34.5.40')]) &lt;= 1">(OPBericht): Element hl7:code[(@code = 'OPBER' and @codeSystem = '1.2.40.0.34.5.40')] kommt zu häufig vor [max 1x].</assert>
      <assert role="error"
              see="http://elga.art-decor.org/elga-html-20250116T123711/tmp-1.2.40.0.34.11.2.2.23-2013-02-10T000000.html"
              test="count(hl7:title[not(@nullFlavor)]) &gt;= 1">(OPBericht): Element hl7:title[not(@nullFlavor)] ist mandatory [min 1x].</assert>
      <assert role="error"
              see="http://elga.art-decor.org/elga-html-20250116T123711/tmp-1.2.40.0.34.11.2.2.23-2013-02-10T000000.html"
              test="count(hl7:title[not(@nullFlavor)]) &lt;= 1">(OPBericht): Element hl7:title[not(@nullFlavor)] kommt zu häufig vor [max 1x].</assert>
      <assert role="error"
              see="http://elga.art-decor.org/elga-html-20250116T123711/tmp-1.2.40.0.34.11.2.2.23-2013-02-10T000000.html"
              test="count(hl7:text[not(@nullFlavor)]) &gt;= 1">(OPBericht): Element hl7:text[not(@nullFlavor)] ist mandatory [min 1x].</assert>
      <assert role="error"
              see="http://elga.art-decor.org/elga-html-20250116T123711/tmp-1.2.40.0.34.11.2.2.23-2013-02-10T000000.html"
              test="count(hl7:text[not(@nullFlavor)]) &lt;= 1">(OPBericht): Element hl7:text[not(@nullFlavor)] kommt zu häufig vor [max 1x].</assert>
   </rule>
   <!--
Template derived rules for ID: 1.2.40.0.34.11.2.2.23
Context: *[hl7:section[hl7:templateId[@root = '1.2.40.0.34.11.2.2.23']]]/hl7:section[hl7:templateId[@root = '1.2.40.0.34.11.2.2.23']]/hl7:templateId[@root = '1.2.40.0.34.11.2.2.23']
Item: (OPBericht)
-->

   <rule fpi="RULC-1"
         context="*[hl7:section[hl7:templateId[@root = '1.2.40.0.34.11.2.2.23']]]/hl7:section[hl7:templateId[@root = '1.2.40.0.34.11.2.2.23']]/hl7:templateId[@root = '1.2.40.0.34.11.2.2.23']"
         id="d42e4787-false-d56736e0">
      <extends rule="II"/>
      <assert role="error"
              see="http://elga.art-decor.org/elga-html-20250116T123711/tmp-1.2.40.0.34.11.2.2.23-2013-02-10T000000.html"
              test="empty(@xsi:type) or resolve-QName(@xsi:type, .) = QName('urn:hl7-org:v3', 'II')">(OPBericht): Wenn eine @xsi:type Instruktion anwesend ist MUSS diese den Wert "{urn:hl7-org:v3}:II" haben. Gefunden "{<value-of select="namespace-uri-from-QName(resolve-QName(@xsi:type,.))"/>}:<value-of select="local-name-from-QName(resolve-QName(@xsi:type,.))"/>"</assert>
      <assert role="error"
              see="http://elga.art-decor.org/elga-html-20250116T123711/tmp-1.2.40.0.34.11.2.2.23-2013-02-10T000000.html"
              test="string(@root) = ('1.2.40.0.34.11.2.2.23')">(OPBericht): Der Wert von root MUSS '1.2.40.0.34.11.2.2.23' sein. Gefunden: "<value-of select="@root"/>"</assert>
   </rule>
   <!--
Template derived rules for ID: 1.2.40.0.34.11.2.2.23
Context: *[hl7:section[hl7:templateId[@root = '1.2.40.0.34.11.2.2.23']]]/hl7:section[hl7:templateId[@root = '1.2.40.0.34.11.2.2.23']]/hl7:code[(@code = 'OPBER' and @codeSystem = '1.2.40.0.34.5.40')]
Item: (OPBericht)
-->

   <rule fpi="RULC-1"
         context="*[hl7:section[hl7:templateId[@root = '1.2.40.0.34.11.2.2.23']]]/hl7:section[hl7:templateId[@root = '1.2.40.0.34.11.2.2.23']]/hl7:code[(@code = 'OPBER' and @codeSystem = '1.2.40.0.34.5.40')]"
         id="d42e4792-false-d56751e0">
      <extends rule="CE"/>
      <assert role="error"
              see="http://elga.art-decor.org/elga-html-20250116T123711/tmp-1.2.40.0.34.11.2.2.23-2013-02-10T000000.html"
              test="empty(@xsi:type) or resolve-QName(@xsi:type, .) = QName('urn:hl7-org:v3', 'CE')">(OPBericht): Wenn eine @xsi:type Instruktion anwesend ist MUSS diese den Wert "{urn:hl7-org:v3}:CE" haben. Gefunden "{<value-of select="namespace-uri-from-QName(resolve-QName(@xsi:type,.))"/>}:<value-of select="local-name-from-QName(resolve-QName(@xsi:type,.))"/>"</assert>
      <assert role="error"
              see="http://elga.art-decor.org/elga-html-20250116T123711/tmp-1.2.40.0.34.11.2.2.23-2013-02-10T000000.html"
              test="@nullFlavor or (@code='OPBER' and @codeSystem='1.2.40.0.34.5.40')">(OPBericht): Der Elementinhalt MUSS einer von 'code 'OPBER' codeSystem '1.2.40.0.34.5.40'' sein.</assert>
   </rule>
   <!--
Template derived rules for ID: 1.2.40.0.34.11.2.2.23
Context: *[hl7:section[hl7:templateId[@root = '1.2.40.0.34.11.2.2.23']]]/hl7:section[hl7:templateId[@root = '1.2.40.0.34.11.2.2.23']]/hl7:title[not(@nullFlavor)]
Item: (OPBericht)
-->

   <rule fpi="RULC-1"
         context="*[hl7:section[hl7:templateId[@root = '1.2.40.0.34.11.2.2.23']]]/hl7:section[hl7:templateId[@root = '1.2.40.0.34.11.2.2.23']]/hl7:title[not(@nullFlavor)]"
         id="d42e4800-false-d56767e0">
      <extends rule="ST"/>
      <assert role="error"
              see="http://elga.art-decor.org/elga-html-20250116T123711/tmp-1.2.40.0.34.11.2.2.23-2013-02-10T000000.html"
              test="empty(@xsi:type) or resolve-QName(@xsi:type, .) = QName('urn:hl7-org:v3', 'ST')">(OPBericht): Wenn eine @xsi:type Instruktion anwesend ist MUSS diese den Wert "{urn:hl7-org:v3}:ST" haben. Gefunden "{<value-of select="namespace-uri-from-QName(resolve-QName(@xsi:type,.))"/>}:<value-of select="local-name-from-QName(resolve-QName(@xsi:type,.))"/>"</assert>
      <assert role="error"
              see="http://elga.art-decor.org/elga-html-20250116T123711/tmp-1.2.40.0.34.11.2.2.23-2013-02-10T000000.html"
              test="text()='Operationsbericht'">(OPBericht): Der Elementinhalt von 'hl7:title[not(@nullFlavor)]' MUSS ''Operationsbericht'' sein. Gefunden: "<value-of select="."/>"</assert>
   </rule>
   <!--
Template derived rules for ID: 1.2.40.0.34.11.2.2.23
Context: *[hl7:section[hl7:templateId[@root = '1.2.40.0.34.11.2.2.23']]]/hl7:section[hl7:templateId[@root = '1.2.40.0.34.11.2.2.23']]/hl7:text[not(@nullFlavor)]
Item: (OPBericht)
-->

   <rule fpi="RULC-1"
         context="*[hl7:section[hl7:templateId[@root = '1.2.40.0.34.11.2.2.23']]]/hl7:section[hl7:templateId[@root = '1.2.40.0.34.11.2.2.23']]/hl7:text[not(@nullFlavor)]"
         id="d42e4806-false-d56781e0">
      <extends rule="SD.TEXT"/>
      <assert role="error"
              see="http://elga.art-decor.org/elga-html-20250116T123711/tmp-1.2.40.0.34.11.2.2.23-2013-02-10T000000.html"
              test="empty(@xsi:type) or resolve-QName(@xsi:type, .) = QName('urn:hl7-org:v3', 'SD.TEXT')">(OPBericht): Wenn eine @xsi:type Instruktion anwesend ist MUSS diese den Wert "{urn:hl7-org:v3}:SD.TEXT" haben. Gefunden "{<value-of select="namespace-uri-from-QName(resolve-QName(@xsi:type,.))"/>}:<value-of select="local-name-from-QName(resolve-QName(@xsi:type,.))"/>"</assert>
   </rule>
</pattern>
