<?xml version="1.0" encoding="UTF-8"?>
<!-- 
    DTR1 CV - Coded Value
    Status: draft
-->
<rule xmlns="http://purl.oclc.org/dsdl/schematron"
      abstract="true"
      id="CV"
      see="https://docs.art-decor.org/documentation/datatypes/DTr1_CV">
    <extends rule="CE"/>
</rule>
