<?xml version="1.0" encoding="UTF-8"?>
<schema xmlns="http://purl.oclc.org/dsdl/schematron" queryBinding="xslt2">
   <title>Schematron file for transaction Entlassungsbrief Pflege v2 (1.2.40.0.34.77.4.100 2023-05-09T07:20:58)</title>
   <ns uri="urn:hl7-org:v3" prefix="hl7"/>
   <ns uri="urn:hl7-org:v3" prefix="cda"/>
   <ns uri="http://www.w3.org/2001/XMLSchema-instance" prefix="xsi"/>
   <ns uri="http://www.w3.org/2001/XMLSchema" prefix="xs"/>
   <!-- Add extra namespaces -->
   <ns uri="urn:ihe:pharm:medication" prefix="pharm"/>
   <ns uri="http://www.w3.org/XML/1998/namespace" prefix="xml"/>
   <!-- Include realm specific schematron -->
   <!-- Include scenario label -->
   <let name="scenariolabel" value="'EntlassungsbriefPflege'"/>
   <include href="include/check-CDA-tables.AT.sch"/>
   <!-- Include datatype abstract schematrons -->
   <pattern>
      <include href="include/DTr1_AD.sch"/>
      <include href="include/DTr1_AD.CA.sch"/>
      <include href="include/DTr1_AD.CA.BASIC.sch"/>
      <include href="include/DTr1_AD.DE.sch"/>
      <include href="include/DTr1_AD.EPSOS.sch"/>
      <include href="include/DTr1_AD.IPS.sch"/>
      <include href="include/DTr1_AD.NL.sch"/>
      <include href="include/DTr1_ADXP.sch"/>
      <include href="include/DTr1_ANY.sch"/>
      <include href="include/DTr1_BIN.sch"/>
      <include href="include/DTr1_BL.sch"/>
      <include href="include/DTr1_BN.sch"/>
      <include href="include/DTr1_BXIT_IVL_PQ.sch"/>
      <include href="include/DTr1_CD.sch"/>
      <include href="include/DTr1_CD.EPSOS.sch"/>
      <include href="include/DTr1_CD.IPS.sch"/>
      <include href="include/DTr1_CD.SDTC.sch"/>
      <include href="include/DTr1_CE.sch"/>
      <include href="include/DTr1_CE.EPSOS.sch"/>
      <include href="include/DTr1_CE.IPS.sch"/>
      <include href="include/DTr1_CO.sch"/>
      <include href="include/DTr1_CO.EPSOS.sch"/>
      <include href="include/DTr1_CR.sch"/>
      <include href="include/DTr1_CS.sch"/>
      <include href="include/DTr1_CS.LANG.sch"/>
      <include href="include/DTr1_CV.sch"/>
      <include href="include/DTr1_CV.EPSOS.sch"/>
      <include href="include/DTr1_CV.IPS.sch"/>
      <include href="include/DTr1_ED.sch"/>
      <include href="include/DTr1_EIVL.event.sch"/>
      <include href="include/DTr1_EIVL_TS.sch"/>
      <include href="include/DTr1_EN.sch"/>
      <include href="include/DTr1_ENXP.sch"/>
      <include href="include/DTr1_GLIST.sch"/>
      <include href="include/DTr1_GLIST_PQ.sch"/>
      <include href="include/DTr1_GLIST_TS.sch"/>
      <include href="include/DTr1_hl7nl-INT.sch"/>
      <include href="include/DTr1_hl7nl-IVL_QTY.sch"/>
      <include href="include/DTr1_hl7nl-IVL_TS.sch"/>
      <include href="include/DTr1_hl7nl-PIVL_TS.sch"/>
      <include href="include/DTr1_hl7nl-PQ.sch"/>
      <include href="include/DTr1_hl7nl-QSET_QTY.sch"/>
      <include href="include/DTr1_hl7nl-RTO.sch"/>
      <include href="include/DTr1_hl7nl-TS.sch"/>
      <include href="include/DTr1_II.sch"/>
      <include href="include/DTr1_II.AT.ATU.sch"/>
      <include href="include/DTr1_II.AT.BLZ.sch"/>
      <include href="include/DTr1_II.AT.DVR.sch"/>
      <include href="include/DTr1_II.AT.KTONR.sch"/>
      <include href="include/DTr1_II.EPSOS.sch"/>
      <include href="include/DTr1_II.NL.AGB.sch"/>
      <include href="include/DTr1_II.NL.BIG.sch"/>
      <include href="include/DTr1_II.NL.BSN.sch"/>
      <include href="include/DTr1_II.NL.URA.sch"/>
      <include href="include/DTr1_II.NL.UZI.sch"/>
      <include href="include/DTr1_INT.sch"/>
      <include href="include/DTr1_INT.NONNEG.sch"/>
      <include href="include/DTr1_INT.POS.sch"/>
      <include href="include/DTr1_IVL_INT.sch"/>
      <include href="include/DTr1_IVL_MO.sch"/>
      <include href="include/DTr1_IVL_PQ.sch"/>
      <include href="include/DTr1_IVL_REAL.sch"/>
      <include href="include/DTr1_IVL_TS.sch"/>
      <include href="include/DTr1_IVL_TS.CH.TZ.sch"/>
      <include href="include/DTr1_IVL_TS.EPSOS.TZ.sch"/>
      <include href="include/DTr1_IVL_TS.EPSOS.TZ.OPT.sch"/>
      <include href="include/DTr1_IVL_TS.IPS.TZ.sch"/>
      <include href="include/DTr1_IVXB_INT.sch"/>
      <include href="include/DTr1_IVXB_MO.sch"/>
      <include href="include/DTr1_IVXB_PQ.sch"/>
      <include href="include/DTr1_IVXB_REAL.sch"/>
      <include href="include/DTr1_IVXB_TS.sch"/>
      <include href="include/DTr1_list_int.sch"/>
      <include href="include/DTr1_MO.sch"/>
      <include href="include/DTr1_ON.sch"/>
      <include href="include/DTr1_PIVL_TS.sch"/>
      <include href="include/DTr1_PN.sch"/>
      <include href="include/DTr1_PN.CA.sch"/>
      <include href="include/DTr1_PN.NL.sch"/>
      <include href="include/DTr1_PQ.sch"/>
      <include href="include/DTr1_PQR.sch"/>
      <include href="include/DTr1_QTY.sch"/>
      <include href="include/DTr1_REAL.sch"/>
      <include href="include/DTr1_REAL.NONNEG.sch"/>
      <include href="include/DTr1_REAL.POS.sch"/>
      <include href="include/DTr1_RTO.sch"/>
      <include href="include/DTr1_RTO_PQ_PQ.sch"/>
      <include href="include/DTr1_RTO_QTY_QTY.sch"/>
      <include href="include/DTr1_SC.sch"/>
      <include href="include/DTr1_SD.TEXT.sch"/>
      <include href="include/DTr1_SLIST.sch"/>
      <include href="include/DTr1_SLIST_PQ.sch"/>
      <include href="include/DTr1_SLIST_TS.sch"/>
      <include href="include/DTr1_ST.sch"/>
      <include href="include/DTr1_SXCM_INT.sch"/>
      <include href="include/DTr1_SXCM_MO.sch"/>
      <include href="include/DTr1_SXCM_PQ.sch"/>
      <include href="include/DTr1_SXCM_REAL.sch"/>
      <include href="include/DTr1_SXCM_TS.sch"/>
      <include href="include/DTr1_SXPR_TS.sch"/>
      <include href="include/DTr1_TEL.sch"/>
      <include href="include/DTr1_TEL.AT.sch"/>
      <include href="include/DTr1_TEL.CA.EMAIL.sch"/>
      <include href="include/DTr1_TEL.CA.PHONE.sch"/>
      <include href="include/DTr1_TEL.EPSOS.sch"/>
      <include href="include/DTr1_TEL.IPS.sch"/>
      <include href="include/DTr1_TEL.NL.EXTENDED.sch"/>
      <include href="include/DTr1_thumbnail.sch"/>
      <include href="include/DTr1_TN.sch"/>
      <include href="include/DTr1_TS.sch"/>
      <include href="include/DTr1_TS.AT.TZ.sch"/>
      <include href="include/DTr1_TS.AT.VAR.sch"/>
      <include href="include/DTr1_TS.CH.TZ.sch"/>
      <include href="include/DTr1_TS.DATE.sch"/>
      <include href="include/DTr1_TS.DATE.FULL.sch"/>
      <include href="include/DTr1_TS.DATE.MIN.sch"/>
      <include href="include/DTr1_TS.DATETIME.MIN.sch"/>
      <include href="include/DTr1_TS.DATETIMETZ.MIN.sch"/>
      <include href="include/DTr1_TS.EPSOS.TZ.sch"/>
      <include href="include/DTr1_TS.EPSOS.TZ.OPT.sch"/>
      <include href="include/DTr1_TS.IPS.TZ.sch"/>
      <include href="include/DTr1_URL.sch"/>
      <include href="include/DTr1_URL.NL.EXTENDED.sch"/>
   </pattern>

   <!-- Include the project schematrons related to scenario EntlassungsbriefPflege -->

   <!-- CDAEntlassbriefPflege -->
   <pattern>
      <title>CDAEntlassbriefPflege</title>
      <rule fpi="RUL-EXPEL" context="/">
         <assert role="warning"
                 test="descendant-or-self::hl7:ClinicalDocument[hl7:templateId[@root = '1.2.40.0.34.11.1'] and hl7:templateId[@root = '1.2.40.0.34.11.3']]"
                 see="http://elga.art-decor.org/elga-html-20250116T123711/tmp-1.2.40.0.34.11.3-2023-05-08T133629.html">(CDAEntlassbriefPflege): Instance is expected to have the following element: descendant-or-self::hl7:ClinicalDocument[hl7:templateId[@root = '1.2.40.0.34.11.1'] and hl7:templateId[@root = '1.2.40.0.34.11.3']]</assert>
      </rule>
   </pattern>
   <include href="include/1.2.40.0.34.11.3-2023-05-08T133629.sch"/>
   <include href="include/1.2.40.0.34.11.3-2023-05-08T133629-closed.sch"/>


   <!-- Create phases for more targeted validation on large instances -->
   <phase id="AllExceptClosed">
      <active pattern="template-1.2.40.0.34.11.3-2023-05-08T133629"/>
      <active pattern="template-1.2.40.0.34.11.1.2.1-2011-12-19T000000"/>
      <active pattern="template-1.2.40.0.34.11.1.2.2-2012-07-14T000000"/>
      <active pattern="template-1.2.40.0.34.11.1.2.3-2015-04-23T000000"/>
      <active pattern="template-1.2.40.0.34.11.1.2.4-2011-12-19T000000"/>
      <active pattern="template-1.2.40.0.34.11.1.2.5-2011-12-19T000000"/>
      <active pattern="template-1.2.40.0.34.11.1.2.6-2011-12-19T000000"/>
      <active pattern="template-1.2.40.0.34.11.1.2.7-2017-02-20T000000"/>
      <active pattern="template-1.2.40.0.34.11.1.2.8-2011-12-19T000000"/>
      <active pattern="template-1.2.40.0.34.11.1.2.9-2011-12-19T000000"/>
      <active pattern="template-1.2.40.0.34.11.1.3.1-2017-05-05T000000"/>
      <active pattern="template-1.2.40.0.34.11.1.3.2-2011-12-19T000000"/>
      <active pattern="template-1.2.40.0.34.11.1.3.3-2011-12-19T000000"/>
      <active pattern="template-1.2.40.0.34.11.1.3.4-2011-12-19T000000"/>
      <active pattern="template-1.2.40.0.34.11.1.3.6-2019-12-05T000000"/>
      <active pattern="template-1.2.40.0.34.11.3.2.1-2013-04-17T000000"/>
      <active pattern="template-1.2.40.0.34.11.3.2.10-2011-12-19T000000"/>
      <active pattern="template-1.2.40.0.34.11.3.2.11-2011-12-19T000000"/>
      <active pattern="template-1.2.40.0.34.11.3.2.12-2013-10-10T000000"/>
      <active pattern="template-1.2.40.0.34.11.3.2.13-2011-12-19T000000"/>
      <active pattern="template-1.2.40.0.34.11.3.2.14-2011-12-19T000000"/>
      <active pattern="template-1.2.40.0.34.11.3.2.15-2011-12-19T000000"/>
      <active pattern="template-1.2.40.0.34.11.3.2.16-2011-12-19T000000"/>
      <active pattern="template-1.2.40.0.34.11.3.2.17-2013-04-17T000000"/>
      <active pattern="template-1.2.40.0.34.11.3.2.18-2015-09-17T000000"/>
      <active pattern="template-1.2.40.0.34.11.3.2.2-2013-04-17T000000"/>
      <active pattern="template-1.2.40.0.34.11.3.2.3-2011-12-19T000000"/>
      <active pattern="template-1.2.40.0.34.11.3.2.4-2011-12-19T000000"/>
      <active pattern="template-1.2.40.0.34.11.3.2.5-2011-12-19T000000"/>
      <active pattern="template-1.2.40.0.34.11.3.2.6-2011-12-19T000000"/>
      <active pattern="template-1.2.40.0.34.11.3.2.7-2011-12-19T000000"/>
      <active pattern="template-1.2.40.0.34.11.3.2.8-2011-12-19T000000"/>
      <active pattern="template-1.2.40.0.34.11.3.2.9-2015-05-06T000000"/>
      <active pattern="template-1.2.40.0.34.11.3.3.1-2020-08-31T154040"/>
      <active pattern="template-1.2.40.0.34.11.3.3.2-2011-12-19T000000"/>
   </phase>
   <phase id="CDAEntlassbriefPflege">
      <active pattern="template-1.2.40.0.34.11.3-2023-05-08T133629"/>
   </phase>
   <phase id="CDAEntlassbriefPflege-closed">
      <active pattern="template-1.2.40.0.34.11.3-2023-05-08T133629-closed"/>
   </phase>
   <phase id="Brieftext">
      <active pattern="template-1.2.40.0.34.11.1.2.1-2011-12-19T000000"/>
   </phase>
   <phase id="AbschliessendeBemerkung">
      <active pattern="template-1.2.40.0.34.11.1.2.2-2012-07-14T000000"/>
   </phase>
   <phase id="Beilagen">
      <active pattern="template-1.2.40.0.34.11.1.2.3-2015-04-23T000000"/>
   </phase>
   <phase id="Patientenverfuegung">
      <active pattern="template-1.2.40.0.34.11.1.2.4-2011-12-19T000000"/>
   </phase>
   <phase id="Anmerkungen">
      <active pattern="template-1.2.40.0.34.11.1.2.5-2011-12-19T000000"/>
   </phase>
   <phase id="VitalparameterEnhanced">
      <active pattern="template-1.2.40.0.34.11.1.2.6-2011-12-19T000000"/>
   </phase>
   <phase id="VitalparameterFull">
      <active pattern="template-1.2.40.0.34.11.1.2.7-2017-02-20T000000"/>
   </phase>
   <phase id="Risiken">
      <active pattern="template-1.2.40.0.34.11.1.2.8-2011-12-19T000000"/>
   </phase>
   <phase id="HilfsmittelRessourcen">
      <active pattern="template-1.2.40.0.34.11.1.2.9-2011-12-19T000000"/>
   </phase>
   <phase id="EingebettetesObjektEntry">
      <active pattern="template-1.2.40.0.34.11.1.3.1-2017-05-05T000000"/>
   </phase>
   <phase id="LogoEntry">
      <active pattern="template-1.2.40.0.34.11.1.3.2-2011-12-19T000000"/>
   </phase>
   <phase id="VitalparameterGruppeEntry">
      <active pattern="template-1.2.40.0.34.11.1.3.3-2011-12-19T000000"/>
   </phase>
   <phase id="VitalparameterEntry">
      <active pattern="template-1.2.40.0.34.11.1.3.4-2011-12-19T000000"/>
   </phase>
   <phase id="ProblemEntry">
      <active pattern="template-1.2.40.0.34.11.1.3.6-2019-12-05T000000"/>
   </phase>
   <phase id="PflegeBetreuungsdiagnosenEnhanced">
      <active pattern="template-1.2.40.0.34.11.3.2.1-2013-04-17T000000"/>
   </phase>
   <phase id="Schmerz">
      <active pattern="template-1.2.40.0.34.11.3.2.10-2011-12-19T000000"/>
   </phase>
   <phase id="OrientierungBewusstseinslage">
      <active pattern="template-1.2.40.0.34.11.3.2.11-2011-12-19T000000"/>
   </phase>
   <phase id="SozialeUmstaendeUndVerhalten">
      <active pattern="template-1.2.40.0.34.11.3.2.12-2013-10-10T000000"/>
   </phase>
   <phase id="Kommunikation">
      <active pattern="template-1.2.40.0.34.11.3.2.13-2011-12-19T000000"/>
   </phase>
   <phase id="RollenwahrnehmungSinnfindung">
      <active pattern="template-1.2.40.0.34.11.3.2.14-2011-12-19T000000"/>
   </phase>
   <phase id="Medikamentenverabreichung">
      <active pattern="template-1.2.40.0.34.11.3.2.15-2011-12-19T000000"/>
   </phase>
   <phase id="EntlassungsmanagementEnhanced">
      <active pattern="template-1.2.40.0.34.11.3.2.16-2011-12-19T000000"/>
   </phase>
   <phase id="EntlassungsmanagementFull">
      <active pattern="template-1.2.40.0.34.11.3.2.17-2013-04-17T000000"/>
   </phase>
   <phase id="Pflegerelevanteinformationenzurmedizinischenbehandlung">
      <active pattern="template-1.2.40.0.34.11.3.2.18-2015-09-17T000000"/>
   </phase>
   <phase id="PflegeBetreuungsdiagnosenFull">
      <active pattern="template-1.2.40.0.34.11.3.2.2-2013-04-17T000000"/>
   </phase>
   <phase id="Mobilitaet">
      <active pattern="template-1.2.40.0.34.11.3.2.3-2011-12-19T000000"/>
   </phase>
   <phase id="KoerperpflegeKleiden">
      <active pattern="template-1.2.40.0.34.11.3.2.4-2011-12-19T000000"/>
   </phase>
   <phase id="Ernaehrung">
      <active pattern="template-1.2.40.0.34.11.3.2.5-2011-12-19T000000"/>
   </phase>
   <phase id="Ausscheidung">
      <active pattern="template-1.2.40.0.34.11.3.2.6-2011-12-19T000000"/>
   </phase>
   <phase id="Hautzustand">
      <active pattern="template-1.2.40.0.34.11.3.2.7-2011-12-19T000000"/>
   </phase>
   <phase id="Atmung">
      <active pattern="template-1.2.40.0.34.11.3.2.8-2011-12-19T000000"/>
   </phase>
   <phase id="Schlaf">
      <active pattern="template-1.2.40.0.34.11.3.2.9-2015-05-06T000000"/>
   </phase>
   <phase id="PflegeBetreuungsdiagnoseEntry">
      <active pattern="template-1.2.40.0.34.11.3.3.1-2020-08-31T154040"/>
   </phase>
   <phase id="EntlassungsmanagementEntry">
      <active pattern="template-1.2.40.0.34.11.3.3.2-2011-12-19T000000"/>
   </phase>

   <!-- Include schematrons from templates with explicit * or ** context (but no representing templates), only those used in scenario template -->

   <!-- Brieftext -->
   <include href="include/1.2.40.0.34.11.1.2.1-2011-12-19T000000.sch"/>
   <!-- AbschliessendeBemerkung -->
   <include href="include/1.2.40.0.34.11.1.2.2-2012-07-14T000000.sch"/>
   <!-- Beilagen -->
   <include href="include/1.2.40.0.34.11.1.2.3-2015-04-23T000000.sch"/>
   <!-- Patientenverfuegung -->
   <include href="include/1.2.40.0.34.11.1.2.4-2011-12-19T000000.sch"/>
   <!-- Anmerkungen -->
   <include href="include/1.2.40.0.34.11.1.2.5-2011-12-19T000000.sch"/>
   <!-- VitalparameterEnhanced -->
   <include href="include/1.2.40.0.34.11.1.2.6-2011-12-19T000000.sch"/>
   <!-- VitalparameterFull -->
   <include href="include/1.2.40.0.34.11.1.2.7-2017-02-20T000000.sch"/>
   <!-- Risiken -->
   <include href="include/1.2.40.0.34.11.1.2.8-2011-12-19T000000.sch"/>
   <!-- HilfsmittelRessourcen -->
   <include href="include/1.2.40.0.34.11.1.2.9-2011-12-19T000000.sch"/>
   <!-- EingebettetesObjektEntry -->
   <include href="include/1.2.40.0.34.11.1.3.1-2017-05-05T000000.sch"/>
   <!-- LogoEntry -->
   <include href="include/1.2.40.0.34.11.1.3.2-2011-12-19T000000.sch"/>
   <!-- VitalparameterGruppeEntry -->
   <include href="include/1.2.40.0.34.11.1.3.3-2011-12-19T000000.sch"/>
   <!-- VitalparameterEntry -->
   <include href="include/1.2.40.0.34.11.1.3.4-2011-12-19T000000.sch"/>
   <!-- ProblemEntry -->
   <include href="include/1.2.40.0.34.11.1.3.6-2019-12-05T000000.sch"/>
   <!-- PflegeBetreuungsdiagnosenEnhanced -->
   <include href="include/1.2.40.0.34.11.3.2.1-2013-04-17T000000.sch"/>
   <!-- Schmerz -->
   <include href="include/1.2.40.0.34.11.3.2.10-2011-12-19T000000.sch"/>
   <!-- OrientierungBewusstseinslage -->
   <include href="include/1.2.40.0.34.11.3.2.11-2011-12-19T000000.sch"/>
   <!-- SozialeUmstaendeUndVerhalten -->
   <include href="include/1.2.40.0.34.11.3.2.12-2013-10-10T000000.sch"/>
   <!-- Kommunikation -->
   <include href="include/1.2.40.0.34.11.3.2.13-2011-12-19T000000.sch"/>
   <!-- RollenwahrnehmungSinnfindung -->
   <include href="include/1.2.40.0.34.11.3.2.14-2011-12-19T000000.sch"/>
   <!-- Medikamentenverabreichung -->
   <include href="include/1.2.40.0.34.11.3.2.15-2011-12-19T000000.sch"/>
   <!-- EntlassungsmanagementEnhanced -->
   <include href="include/1.2.40.0.34.11.3.2.16-2011-12-19T000000.sch"/>
   <!-- EntlassungsmanagementFull -->
   <include href="include/1.2.40.0.34.11.3.2.17-2013-04-17T000000.sch"/>
   <!-- Pflegerelevanteinformationenzurmedizinischenbehandlung -->
   <include href="include/1.2.40.0.34.11.3.2.18-2015-09-17T000000.sch"/>
   <!-- PflegeBetreuungsdiagnosenFull -->
   <include href="include/1.2.40.0.34.11.3.2.2-2013-04-17T000000.sch"/>
   <!-- Mobilitaet -->
   <include href="include/1.2.40.0.34.11.3.2.3-2011-12-19T000000.sch"/>
   <!-- KoerperpflegeKleiden -->
   <include href="include/1.2.40.0.34.11.3.2.4-2011-12-19T000000.sch"/>
   <!-- Ernaehrung -->
   <include href="include/1.2.40.0.34.11.3.2.5-2011-12-19T000000.sch"/>
   <!-- Ausscheidung -->
   <include href="include/1.2.40.0.34.11.3.2.6-2011-12-19T000000.sch"/>
   <!-- Hautzustand -->
   <include href="include/1.2.40.0.34.11.3.2.7-2011-12-19T000000.sch"/>
   <!-- Atmung -->
   <include href="include/1.2.40.0.34.11.3.2.8-2011-12-19T000000.sch"/>
   <!-- Schlaf -->
   <include href="include/1.2.40.0.34.11.3.2.9-2015-05-06T000000.sch"/>
   <!-- PflegeBetreuungsdiagnoseEntry -->
   <include href="include/1.2.40.0.34.11.3.3.1-2020-08-31T154040.sch"/>
   <!-- EntlassungsmanagementEntry -->
   <include href="include/1.2.40.0.34.11.3.3.2-2011-12-19T000000.sch"/>

</schema>
