<?xml version="1.0" encoding="UTF-8"?>
<!-- 
    DTR1 GLIST_PQ - Generated Sequence of Physical Quantity
    Status: draft
-->
<rule xmlns="http://purl.oclc.org/dsdl/schematron"
      abstract="true"
      id="GLIST_PQ"
      see="https://docs.art-decor.org/documentation/datatypes/DTr1_GLIST_PQ">
    <extends rule="GLIST"/>
</rule>
