<?xml version="1.0" encoding="UTF-8"?>
<!-- 
:   A character string token representing a part of a name. May have a type code signifying the role of the part in the whole entity name, and a qualifier code for more detail about the name part type. Typical name parts for person names are given names, and family names, titles, etc.
    Status: draft
-->
<rule xmlns="http://purl.oclc.org/dsdl/schematron"
      abstract="true"
      id="ENXP"
      see="https://docs.art-decor.org/documentation/datatypes/DTr1_ENXP">
    <extends rule="ST"/>
</rule>
