<?xml version="1.0" encoding="UTF-8"?>
<!--
Template derived pattern
===========================================
ID: 1.2.40.0.34.11.1.2.7
Name: Vitalparameter (full)
Description: Informationen zu den Vitalparametern (Körpertemperatur, Puls, Blutdruck …). Diese Sektion wird hauptsächlich bei Verlegungen von Pflegeheimen in Krankenhäusern oder in Notfällen angewandt.
-->
<pattern xmlns="http://purl.oclc.org/dsdl/schematron"
         id="template-1.2.40.0.34.11.1.2.7-2017-02-20T000000">
   <title>Vitalparameter (full)</title>
   <!--
Template derived rules for ID: 1.2.40.0.34.11.1.2.7
Context: *[hl7:section[hl7:templateId[@root = '1.2.40.0.34.11.1.2.7'] and hl7:templateId[@root = '1.3.6.1.4.1.19376.1.5.3.1.1.5.3.2'] and hl7:templateId[@root = '1.3.6.1.4.1.19376.1.5.3.1.3.25'] and hl7:templateId[@root = '2.16.840.1.113883.10.20.1.16']]]
Item: (VitalparameterFull)
-->

   <!--
Template derived rules for ID: 1.2.40.0.34.11.1.2.7
Context: *[hl7:section[hl7:templateId[@root = '1.2.40.0.34.11.1.2.7'] and hl7:templateId[@root = '1.3.6.1.4.1.19376.1.5.3.1.1.5.3.2'] and hl7:templateId[@root = '1.3.6.1.4.1.19376.1.5.3.1.3.25'] and hl7:templateId[@root = '2.16.840.1.113883.10.20.1.16']]]/hl7:section[hl7:templateId[@root = '1.2.40.0.34.11.1.2.7'] and hl7:templateId[@root = '1.3.6.1.4.1.19376.1.5.3.1.1.5.3.2'] and hl7:templateId[@root = '1.3.6.1.4.1.19376.1.5.3.1.3.25'] and hl7:templateId[@root = '2.16.840.1.113883.10.20.1.16']]
Item: (VitalparameterFull)
-->

   <rule fpi="RULC-1"
         context="*[hl7:section[hl7:templateId[@root = '1.2.40.0.34.11.1.2.7'] and hl7:templateId[@root = '1.3.6.1.4.1.19376.1.5.3.1.1.5.3.2'] and hl7:templateId[@root = '1.3.6.1.4.1.19376.1.5.3.1.3.25'] and hl7:templateId[@root = '2.16.840.1.113883.10.20.1.16']]]/hl7:section[hl7:templateId[@root = '1.2.40.0.34.11.1.2.7'] and hl7:templateId[@root = '1.3.6.1.4.1.19376.1.5.3.1.1.5.3.2'] and hl7:templateId[@root = '1.3.6.1.4.1.19376.1.5.3.1.3.25'] and hl7:templateId[@root = '2.16.840.1.113883.10.20.1.16']]"
         id="d42e1600-false-d2021e0">
      <assert role="error"
              see="http://elga.art-decor.org/elga-html-20250116T123711/tmp-1.2.40.0.34.11.1.2.7-2017-02-20T000000.html"
              test="count(hl7:templateId[@root = '1.2.40.0.34.11.1.2.7']) &gt;= 1">(VitalparameterFull): Element hl7:templateId[@root = '1.2.40.0.34.11.1.2.7'] ist required [min 1x].</assert>
      <assert role="error"
              see="http://elga.art-decor.org/elga-html-20250116T123711/tmp-1.2.40.0.34.11.1.2.7-2017-02-20T000000.html"
              test="count(hl7:templateId[@root = '1.2.40.0.34.11.1.2.7']) &lt;= 1">(VitalparameterFull): Element hl7:templateId[@root = '1.2.40.0.34.11.1.2.7'] kommt zu häufig vor [max 1x].</assert>
      <assert role="error"
              see="http://elga.art-decor.org/elga-html-20250116T123711/tmp-1.2.40.0.34.11.1.2.7-2017-02-20T000000.html"
              test="count(hl7:templateId[@root = '1.3.6.1.4.1.19376.1.5.3.1.1.5.3.2']) &gt;= 1">(VitalparameterFull): Element hl7:templateId[@root = '1.3.6.1.4.1.19376.1.5.3.1.1.5.3.2'] ist required [min 1x].</assert>
      <assert role="error"
              see="http://elga.art-decor.org/elga-html-20250116T123711/tmp-1.2.40.0.34.11.1.2.7-2017-02-20T000000.html"
              test="count(hl7:templateId[@root = '1.3.6.1.4.1.19376.1.5.3.1.1.5.3.2']) &lt;= 1">(VitalparameterFull): Element hl7:templateId[@root = '1.3.6.1.4.1.19376.1.5.3.1.1.5.3.2'] kommt zu häufig vor [max 1x].</assert>
      <assert role="error"
              see="http://elga.art-decor.org/elga-html-20250116T123711/tmp-1.2.40.0.34.11.1.2.7-2017-02-20T000000.html"
              test="count(hl7:templateId[@root = '1.3.6.1.4.1.19376.1.5.3.1.3.25']) &gt;= 1">(VitalparameterFull): Element hl7:templateId[@root = '1.3.6.1.4.1.19376.1.5.3.1.3.25'] ist required [min 1x].</assert>
      <assert role="error"
              see="http://elga.art-decor.org/elga-html-20250116T123711/tmp-1.2.40.0.34.11.1.2.7-2017-02-20T000000.html"
              test="count(hl7:templateId[@root = '1.3.6.1.4.1.19376.1.5.3.1.3.25']) &lt;= 1">(VitalparameterFull): Element hl7:templateId[@root = '1.3.6.1.4.1.19376.1.5.3.1.3.25'] kommt zu häufig vor [max 1x].</assert>
      <assert role="error"
              see="http://elga.art-decor.org/elga-html-20250116T123711/tmp-1.2.40.0.34.11.1.2.7-2017-02-20T000000.html"
              test="count(hl7:templateId[@root = '2.16.840.1.113883.10.20.1.16']) &gt;= 1">(VitalparameterFull): Element hl7:templateId[@root = '2.16.840.1.113883.10.20.1.16'] ist required [min 1x].</assert>
      <assert role="error"
              see="http://elga.art-decor.org/elga-html-20250116T123711/tmp-1.2.40.0.34.11.1.2.7-2017-02-20T000000.html"
              test="count(hl7:templateId[@root = '2.16.840.1.113883.10.20.1.16']) &lt;= 1">(VitalparameterFull): Element hl7:templateId[@root = '2.16.840.1.113883.10.20.1.16'] kommt zu häufig vor [max 1x].</assert>
      <assert role="error"
              see="http://elga.art-decor.org/elga-html-20250116T123711/tmp-1.2.40.0.34.11.1.2.7-2017-02-20T000000.html"
              test="count(hl7:code[(@code = '8716-3' and @codeSystem = '2.16.840.1.113883.6.1')]) &gt;= 1">(VitalparameterFull): Element hl7:code[(@code = '8716-3' and @codeSystem = '2.16.840.1.113883.6.1')] ist mandatory [min 1x].</assert>
      <assert role="error"
              see="http://elga.art-decor.org/elga-html-20250116T123711/tmp-1.2.40.0.34.11.1.2.7-2017-02-20T000000.html"
              test="count(hl7:code[(@code = '8716-3' and @codeSystem = '2.16.840.1.113883.6.1')]) &lt;= 1">(VitalparameterFull): Element hl7:code[(@code = '8716-3' and @codeSystem = '2.16.840.1.113883.6.1')] kommt zu häufig vor [max 1x].</assert>
      <assert role="error"
              see="http://elga.art-decor.org/elga-html-20250116T123711/tmp-1.2.40.0.34.11.1.2.7-2017-02-20T000000.html"
              test="count(hl7:title) &gt;= 1">(VitalparameterFull): Element hl7:title ist required [min 1x].</assert>
      <assert role="error"
              see="http://elga.art-decor.org/elga-html-20250116T123711/tmp-1.2.40.0.34.11.1.2.7-2017-02-20T000000.html"
              test="count(hl7:title) &lt;= 1">(VitalparameterFull): Element hl7:title kommt zu häufig vor [max 1x].</assert>
      <assert role="error"
              see="http://elga.art-decor.org/elga-html-20250116T123711/tmp-1.2.40.0.34.11.1.2.7-2017-02-20T000000.html"
              test="count(hl7:text) &gt;= 1">(VitalparameterFull): Element hl7:text ist required [min 1x].</assert>
      <assert role="error"
              see="http://elga.art-decor.org/elga-html-20250116T123711/tmp-1.2.40.0.34.11.1.2.7-2017-02-20T000000.html"
              test="count(hl7:text) &lt;= 1">(VitalparameterFull): Element hl7:text kommt zu häufig vor [max 1x].</assert>
      <assert role="error"
              see="http://elga.art-decor.org/elga-html-20250116T123711/tmp-1.2.40.0.34.11.1.2.7-2017-02-20T000000.html"
              test="count(hl7:entry[hl7:organizer[hl7:templateId[@root = '1.2.40.0.34.11.1.3.3'] and hl7:templateId[@root = '2.16.840.1.113883.10.20.1.32'] and hl7:templateId[@root = '2.16.840.1.113883.10.20.1.35'] and hl7:templateId[@root = '1.3.6.1.4.1.19376.1.5.3.1.4.13.1']]]) &gt;= 1">(VitalparameterFull): Element hl7:entry[hl7:organizer[hl7:templateId[@root = '1.2.40.0.34.11.1.3.3'] and hl7:templateId[@root = '2.16.840.1.113883.10.20.1.32'] and hl7:templateId[@root = '2.16.840.1.113883.10.20.1.35'] and hl7:templateId[@root = '1.3.6.1.4.1.19376.1.5.3.1.4.13.1']]] ist required [min 1x].</assert>
   </rule>
   <!--
Template derived rules for ID: 1.2.40.0.34.11.1.2.7
Context: *[hl7:section[hl7:templateId[@root = '1.2.40.0.34.11.1.2.7'] and hl7:templateId[@root = '1.3.6.1.4.1.19376.1.5.3.1.1.5.3.2'] and hl7:templateId[@root = '1.3.6.1.4.1.19376.1.5.3.1.3.25'] and hl7:templateId[@root = '2.16.840.1.113883.10.20.1.16']]]/hl7:section[hl7:templateId[@root = '1.2.40.0.34.11.1.2.7'] and hl7:templateId[@root = '1.3.6.1.4.1.19376.1.5.3.1.1.5.3.2'] and hl7:templateId[@root = '1.3.6.1.4.1.19376.1.5.3.1.3.25'] and hl7:templateId[@root = '2.16.840.1.113883.10.20.1.16']]/hl7:templateId[@root = '1.2.40.0.34.11.1.2.7']
Item: (VitalparameterFull)
-->

   <rule fpi="RULC-1"
         context="*[hl7:section[hl7:templateId[@root = '1.2.40.0.34.11.1.2.7'] and hl7:templateId[@root = '1.3.6.1.4.1.19376.1.5.3.1.1.5.3.2'] and hl7:templateId[@root = '1.3.6.1.4.1.19376.1.5.3.1.3.25'] and hl7:templateId[@root = '2.16.840.1.113883.10.20.1.16']]]/hl7:section[hl7:templateId[@root = '1.2.40.0.34.11.1.2.7'] and hl7:templateId[@root = '1.3.6.1.4.1.19376.1.5.3.1.1.5.3.2'] and hl7:templateId[@root = '1.3.6.1.4.1.19376.1.5.3.1.3.25'] and hl7:templateId[@root = '2.16.840.1.113883.10.20.1.16']]/hl7:templateId[@root = '1.2.40.0.34.11.1.2.7']"
         id="d42e1605-false-d2112e0">
      <extends rule="II"/>
      <assert role="error"
              see="http://elga.art-decor.org/elga-html-20250116T123711/tmp-1.2.40.0.34.11.1.2.7-2017-02-20T000000.html"
              test="empty(@xsi:type) or resolve-QName(@xsi:type, .) = QName('urn:hl7-org:v3', 'II')">(VitalparameterFull): Wenn eine @xsi:type Instruktion anwesend ist MUSS diese den Wert "{urn:hl7-org:v3}:II" haben. Gefunden "{<value-of select="namespace-uri-from-QName(resolve-QName(@xsi:type,.))"/>}:<value-of select="local-name-from-QName(resolve-QName(@xsi:type,.))"/>"</assert>
      <assert role="error"
              see="http://elga.art-decor.org/elga-html-20250116T123711/tmp-1.2.40.0.34.11.1.2.7-2017-02-20T000000.html"
              test="string(@root) = ('1.2.40.0.34.11.1.2.7')">(VitalparameterFull): Der Wert von root MUSS '1.2.40.0.34.11.1.2.7' sein. Gefunden: "<value-of select="@root"/>"</assert>
   </rule>
   <!--
Template derived rules for ID: 1.2.40.0.34.11.1.2.7
Context: *[hl7:section[hl7:templateId[@root = '1.2.40.0.34.11.1.2.7'] and hl7:templateId[@root = '1.3.6.1.4.1.19376.1.5.3.1.1.5.3.2'] and hl7:templateId[@root = '1.3.6.1.4.1.19376.1.5.3.1.3.25'] and hl7:templateId[@root = '2.16.840.1.113883.10.20.1.16']]]/hl7:section[hl7:templateId[@root = '1.2.40.0.34.11.1.2.7'] and hl7:templateId[@root = '1.3.6.1.4.1.19376.1.5.3.1.1.5.3.2'] and hl7:templateId[@root = '1.3.6.1.4.1.19376.1.5.3.1.3.25'] and hl7:templateId[@root = '2.16.840.1.113883.10.20.1.16']]/hl7:templateId[@root = '1.3.6.1.4.1.19376.1.5.3.1.1.5.3.2']
Item: (VitalparameterFull)
-->

   <rule fpi="RULC-1"
         context="*[hl7:section[hl7:templateId[@root = '1.2.40.0.34.11.1.2.7'] and hl7:templateId[@root = '1.3.6.1.4.1.19376.1.5.3.1.1.5.3.2'] and hl7:templateId[@root = '1.3.6.1.4.1.19376.1.5.3.1.3.25'] and hl7:templateId[@root = '2.16.840.1.113883.10.20.1.16']]]/hl7:section[hl7:templateId[@root = '1.2.40.0.34.11.1.2.7'] and hl7:templateId[@root = '1.3.6.1.4.1.19376.1.5.3.1.1.5.3.2'] and hl7:templateId[@root = '1.3.6.1.4.1.19376.1.5.3.1.3.25'] and hl7:templateId[@root = '2.16.840.1.113883.10.20.1.16']]/hl7:templateId[@root = '1.3.6.1.4.1.19376.1.5.3.1.1.5.3.2']"
         id="d42e1610-false-d2127e0">
      <extends rule="II"/>
      <assert role="error"
              see="http://elga.art-decor.org/elga-html-20250116T123711/tmp-1.2.40.0.34.11.1.2.7-2017-02-20T000000.html"
              test="empty(@xsi:type) or resolve-QName(@xsi:type, .) = QName('urn:hl7-org:v3', 'II')">(VitalparameterFull): Wenn eine @xsi:type Instruktion anwesend ist MUSS diese den Wert "{urn:hl7-org:v3}:II" haben. Gefunden "{<value-of select="namespace-uri-from-QName(resolve-QName(@xsi:type,.))"/>}:<value-of select="local-name-from-QName(resolve-QName(@xsi:type,.))"/>"</assert>
      <assert role="error"
              see="http://elga.art-decor.org/elga-html-20250116T123711/tmp-1.2.40.0.34.11.1.2.7-2017-02-20T000000.html"
              test="string(@root) = ('1.3.6.1.4.1.19376.1.5.3.1.1.5.3.2')">(VitalparameterFull): Der Wert von root MUSS '1.3.6.1.4.1.19376.1.5.3.1.1.5.3.2' sein. Gefunden: "<value-of select="@root"/>"</assert>
   </rule>
   <!--
Template derived rules for ID: 1.2.40.0.34.11.1.2.7
Context: *[hl7:section[hl7:templateId[@root = '1.2.40.0.34.11.1.2.7'] and hl7:templateId[@root = '1.3.6.1.4.1.19376.1.5.3.1.1.5.3.2'] and hl7:templateId[@root = '1.3.6.1.4.1.19376.1.5.3.1.3.25'] and hl7:templateId[@root = '2.16.840.1.113883.10.20.1.16']]]/hl7:section[hl7:templateId[@root = '1.2.40.0.34.11.1.2.7'] and hl7:templateId[@root = '1.3.6.1.4.1.19376.1.5.3.1.1.5.3.2'] and hl7:templateId[@root = '1.3.6.1.4.1.19376.1.5.3.1.3.25'] and hl7:templateId[@root = '2.16.840.1.113883.10.20.1.16']]/hl7:templateId[@root = '1.3.6.1.4.1.19376.1.5.3.1.3.25']
Item: (VitalparameterFull)
-->

   <rule fpi="RULC-1"
         context="*[hl7:section[hl7:templateId[@root = '1.2.40.0.34.11.1.2.7'] and hl7:templateId[@root = '1.3.6.1.4.1.19376.1.5.3.1.1.5.3.2'] and hl7:templateId[@root = '1.3.6.1.4.1.19376.1.5.3.1.3.25'] and hl7:templateId[@root = '2.16.840.1.113883.10.20.1.16']]]/hl7:section[hl7:templateId[@root = '1.2.40.0.34.11.1.2.7'] and hl7:templateId[@root = '1.3.6.1.4.1.19376.1.5.3.1.1.5.3.2'] and hl7:templateId[@root = '1.3.6.1.4.1.19376.1.5.3.1.3.25'] and hl7:templateId[@root = '2.16.840.1.113883.10.20.1.16']]/hl7:templateId[@root = '1.3.6.1.4.1.19376.1.5.3.1.3.25']"
         id="d42e1615-false-d2142e0">
      <extends rule="II"/>
      <assert role="error"
              see="http://elga.art-decor.org/elga-html-20250116T123711/tmp-1.2.40.0.34.11.1.2.7-2017-02-20T000000.html"
              test="empty(@xsi:type) or resolve-QName(@xsi:type, .) = QName('urn:hl7-org:v3', 'II')">(VitalparameterFull): Wenn eine @xsi:type Instruktion anwesend ist MUSS diese den Wert "{urn:hl7-org:v3}:II" haben. Gefunden "{<value-of select="namespace-uri-from-QName(resolve-QName(@xsi:type,.))"/>}:<value-of select="local-name-from-QName(resolve-QName(@xsi:type,.))"/>"</assert>
      <assert role="error"
              see="http://elga.art-decor.org/elga-html-20250116T123711/tmp-1.2.40.0.34.11.1.2.7-2017-02-20T000000.html"
              test="string(@root) = ('1.3.6.1.4.1.19376.1.5.3.1.3.25')">(VitalparameterFull): Der Wert von root MUSS '1.3.6.1.4.1.19376.1.5.3.1.3.25' sein. Gefunden: "<value-of select="@root"/>"</assert>
   </rule>
   <!--
Template derived rules for ID: 1.2.40.0.34.11.1.2.7
Context: *[hl7:section[hl7:templateId[@root = '1.2.40.0.34.11.1.2.7'] and hl7:templateId[@root = '1.3.6.1.4.1.19376.1.5.3.1.1.5.3.2'] and hl7:templateId[@root = '1.3.6.1.4.1.19376.1.5.3.1.3.25'] and hl7:templateId[@root = '2.16.840.1.113883.10.20.1.16']]]/hl7:section[hl7:templateId[@root = '1.2.40.0.34.11.1.2.7'] and hl7:templateId[@root = '1.3.6.1.4.1.19376.1.5.3.1.1.5.3.2'] and hl7:templateId[@root = '1.3.6.1.4.1.19376.1.5.3.1.3.25'] and hl7:templateId[@root = '2.16.840.1.113883.10.20.1.16']]/hl7:templateId[@root = '2.16.840.1.113883.10.20.1.16']
Item: (VitalparameterFull)
-->

   <rule fpi="RULC-1"
         context="*[hl7:section[hl7:templateId[@root = '1.2.40.0.34.11.1.2.7'] and hl7:templateId[@root = '1.3.6.1.4.1.19376.1.5.3.1.1.5.3.2'] and hl7:templateId[@root = '1.3.6.1.4.1.19376.1.5.3.1.3.25'] and hl7:templateId[@root = '2.16.840.1.113883.10.20.1.16']]]/hl7:section[hl7:templateId[@root = '1.2.40.0.34.11.1.2.7'] and hl7:templateId[@root = '1.3.6.1.4.1.19376.1.5.3.1.1.5.3.2'] and hl7:templateId[@root = '1.3.6.1.4.1.19376.1.5.3.1.3.25'] and hl7:templateId[@root = '2.16.840.1.113883.10.20.1.16']]/hl7:templateId[@root = '2.16.840.1.113883.10.20.1.16']"
         id="d42e1620-false-d2157e0">
      <extends rule="II"/>
      <assert role="error"
              see="http://elga.art-decor.org/elga-html-20250116T123711/tmp-1.2.40.0.34.11.1.2.7-2017-02-20T000000.html"
              test="empty(@xsi:type) or resolve-QName(@xsi:type, .) = QName('urn:hl7-org:v3', 'II')">(VitalparameterFull): Wenn eine @xsi:type Instruktion anwesend ist MUSS diese den Wert "{urn:hl7-org:v3}:II" haben. Gefunden "{<value-of select="namespace-uri-from-QName(resolve-QName(@xsi:type,.))"/>}:<value-of select="local-name-from-QName(resolve-QName(@xsi:type,.))"/>"</assert>
      <assert role="error"
              see="http://elga.art-decor.org/elga-html-20250116T123711/tmp-1.2.40.0.34.11.1.2.7-2017-02-20T000000.html"
              test="string(@root) = ('2.16.840.1.113883.10.20.1.16')">(VitalparameterFull): Der Wert von root MUSS '2.16.840.1.113883.10.20.1.16' sein. Gefunden: "<value-of select="@root"/>"</assert>
   </rule>
   <!--
Template derived rules for ID: 1.2.40.0.34.11.30002
Context: *[hl7:section[hl7:templateId[@root = '1.2.40.0.34.11.1.2.7'] and hl7:templateId[@root = '1.3.6.1.4.1.19376.1.5.3.1.1.5.3.2'] and hl7:templateId[@root = '1.3.6.1.4.1.19376.1.5.3.1.3.25'] and hl7:templateId[@root = '2.16.840.1.113883.10.20.1.16']]]/hl7:section[hl7:templateId[@root = '1.2.40.0.34.11.1.2.7'] and hl7:templateId[@root = '1.3.6.1.4.1.19376.1.5.3.1.1.5.3.2'] and hl7:templateId[@root = '1.3.6.1.4.1.19376.1.5.3.1.3.25'] and hl7:templateId[@root = '2.16.840.1.113883.10.20.1.16']]/hl7:code[(@code = '8716-3' and @codeSystem = '2.16.840.1.113883.6.1')]
Item: (VitalparameterAlleEIS)
-->

   <rule fpi="RULC-1"
         context="*[hl7:section[hl7:templateId[@root = '1.2.40.0.34.11.1.2.7'] and hl7:templateId[@root = '1.3.6.1.4.1.19376.1.5.3.1.1.5.3.2'] and hl7:templateId[@root = '1.3.6.1.4.1.19376.1.5.3.1.3.25'] and hl7:templateId[@root = '2.16.840.1.113883.10.20.1.16']]]/hl7:section[hl7:templateId[@root = '1.2.40.0.34.11.1.2.7'] and hl7:templateId[@root = '1.3.6.1.4.1.19376.1.5.3.1.1.5.3.2'] and hl7:templateId[@root = '1.3.6.1.4.1.19376.1.5.3.1.3.25'] and hl7:templateId[@root = '2.16.840.1.113883.10.20.1.16']]/hl7:code[(@code = '8716-3' and @codeSystem = '2.16.840.1.113883.6.1')]"
         id="d2158e75-false-d2173e0">
      <extends rule="CE"/>
      <assert role="error"
              see="http://elga.art-decor.org/elga-html-20250116T123711/tmp-1.2.40.0.34.11.30002-2011-12-19T000000.html"
              test="empty(@xsi:type) or resolve-QName(@xsi:type, .) = QName('urn:hl7-org:v3', 'CE')">(VitalparameterAlleEIS): Wenn eine @xsi:type Instruktion anwesend ist MUSS diese den Wert "{urn:hl7-org:v3}:CE" haben. Gefunden "{<value-of select="namespace-uri-from-QName(resolve-QName(@xsi:type,.))"/>}:<value-of select="local-name-from-QName(resolve-QName(@xsi:type,.))"/>"</assert>
      <assert role="error"
              see="http://elga.art-decor.org/elga-html-20250116T123711/tmp-1.2.40.0.34.11.30002-2011-12-19T000000.html"
              test="@nullFlavor or (@code='8716-3' and @codeSystem='2.16.840.1.113883.6.1')">(VitalparameterAlleEIS): Der Elementinhalt MUSS einer von 'code '8716-3' codeSystem '2.16.840.1.113883.6.1'' sein.</assert>
   </rule>
   <!--
Template derived rules for ID: 1.2.40.0.34.11.30002
Context: *[hl7:section[hl7:templateId[@root = '1.2.40.0.34.11.1.2.7'] and hl7:templateId[@root = '1.3.6.1.4.1.19376.1.5.3.1.1.5.3.2'] and hl7:templateId[@root = '1.3.6.1.4.1.19376.1.5.3.1.3.25'] and hl7:templateId[@root = '2.16.840.1.113883.10.20.1.16']]]/hl7:section[hl7:templateId[@root = '1.2.40.0.34.11.1.2.7'] and hl7:templateId[@root = '1.3.6.1.4.1.19376.1.5.3.1.1.5.3.2'] and hl7:templateId[@root = '1.3.6.1.4.1.19376.1.5.3.1.3.25'] and hl7:templateId[@root = '2.16.840.1.113883.10.20.1.16']]/hl7:title
Item: (VitalparameterAlleEIS)
-->

   <rule fpi="RULC-1"
         context="*[hl7:section[hl7:templateId[@root = '1.2.40.0.34.11.1.2.7'] and hl7:templateId[@root = '1.3.6.1.4.1.19376.1.5.3.1.1.5.3.2'] and hl7:templateId[@root = '1.3.6.1.4.1.19376.1.5.3.1.3.25'] and hl7:templateId[@root = '2.16.840.1.113883.10.20.1.16']]]/hl7:section[hl7:templateId[@root = '1.2.40.0.34.11.1.2.7'] and hl7:templateId[@root = '1.3.6.1.4.1.19376.1.5.3.1.1.5.3.2'] and hl7:templateId[@root = '1.3.6.1.4.1.19376.1.5.3.1.3.25'] and hl7:templateId[@root = '2.16.840.1.113883.10.20.1.16']]/hl7:title"
         id="d2158e84-false-d2189e0">
      <extends rule="ST"/>
      <assert role="error"
              see="http://elga.art-decor.org/elga-html-20250116T123711/tmp-1.2.40.0.34.11.30002-2011-12-19T000000.html"
              test="empty(@xsi:type) or resolve-QName(@xsi:type, .) = QName('urn:hl7-org:v3', 'ST')">(VitalparameterAlleEIS): Wenn eine @xsi:type Instruktion anwesend ist MUSS diese den Wert "{urn:hl7-org:v3}:ST" haben. Gefunden "{<value-of select="namespace-uri-from-QName(resolve-QName(@xsi:type,.))"/>}:<value-of select="local-name-from-QName(resolve-QName(@xsi:type,.))"/>"</assert>
      <assert role="error"
              see="http://elga.art-decor.org/elga-html-20250116T123711/tmp-1.2.40.0.34.11.30002-2011-12-19T000000.html"
              test="text()='Vitalparameter'">(VitalparameterAlleEIS): Der Elementinhalt von 'hl7:title' MUSS ''Vitalparameter'' sein. Gefunden: "<value-of select="."/>"</assert>
   </rule>
   <!--
Template derived rules for ID: 1.2.40.0.34.11.30002
Context: *[hl7:section[hl7:templateId[@root = '1.2.40.0.34.11.1.2.7'] and hl7:templateId[@root = '1.3.6.1.4.1.19376.1.5.3.1.1.5.3.2'] and hl7:templateId[@root = '1.3.6.1.4.1.19376.1.5.3.1.3.25'] and hl7:templateId[@root = '2.16.840.1.113883.10.20.1.16']]]/hl7:section[hl7:templateId[@root = '1.2.40.0.34.11.1.2.7'] and hl7:templateId[@root = '1.3.6.1.4.1.19376.1.5.3.1.1.5.3.2'] and hl7:templateId[@root = '1.3.6.1.4.1.19376.1.5.3.1.3.25'] and hl7:templateId[@root = '2.16.840.1.113883.10.20.1.16']]/hl7:text
Item: (VitalparameterAlleEIS)
-->


   <!--
Template derived rules for ID: 1.2.40.0.34.11.1.2.7
Context: *[hl7:section[hl7:templateId[@root = '1.2.40.0.34.11.1.2.7'] and hl7:templateId[@root = '1.3.6.1.4.1.19376.1.5.3.1.1.5.3.2'] and hl7:templateId[@root = '1.3.6.1.4.1.19376.1.5.3.1.3.25'] and hl7:templateId[@root = '2.16.840.1.113883.10.20.1.16']]]/hl7:section[hl7:templateId[@root = '1.2.40.0.34.11.1.2.7'] and hl7:templateId[@root = '1.3.6.1.4.1.19376.1.5.3.1.1.5.3.2'] and hl7:templateId[@root = '1.3.6.1.4.1.19376.1.5.3.1.3.25'] and hl7:templateId[@root = '2.16.840.1.113883.10.20.1.16']]/hl7:entry[hl7:organizer[hl7:templateId[@root = '1.2.40.0.34.11.1.3.3'] and hl7:templateId[@root = '2.16.840.1.113883.10.20.1.32'] and hl7:templateId[@root = '2.16.840.1.113883.10.20.1.35'] and hl7:templateId[@root = '1.3.6.1.4.1.19376.1.5.3.1.4.13.1']]]
Item: (VitalparameterFull)
-->
   <rule fpi="RULC-1"
         context="*[hl7:section[hl7:templateId[@root = '1.2.40.0.34.11.1.2.7'] and hl7:templateId[@root = '1.3.6.1.4.1.19376.1.5.3.1.1.5.3.2'] and hl7:templateId[@root = '1.3.6.1.4.1.19376.1.5.3.1.3.25'] and hl7:templateId[@root = '2.16.840.1.113883.10.20.1.16']]]/hl7:section[hl7:templateId[@root = '1.2.40.0.34.11.1.2.7'] and hl7:templateId[@root = '1.3.6.1.4.1.19376.1.5.3.1.1.5.3.2'] and hl7:templateId[@root = '1.3.6.1.4.1.19376.1.5.3.1.3.25'] and hl7:templateId[@root = '2.16.840.1.113883.10.20.1.16']]/hl7:entry[hl7:organizer[hl7:templateId[@root = '1.2.40.0.34.11.1.3.3'] and hl7:templateId[@root = '2.16.840.1.113883.10.20.1.32'] and hl7:templateId[@root = '2.16.840.1.113883.10.20.1.35'] and hl7:templateId[@root = '1.3.6.1.4.1.19376.1.5.3.1.4.13.1']]]">
      <assert role="error"
              see="http://elga.art-decor.org/elga-html-20250116T123711/tmp-1.2.40.0.34.11.1.2.7-2017-02-20T000000.html"
              test="string(@typeCode) = ('DRIV') or not(@typeCode)">(VitalparameterFull): Der Wert von typeCode MUSS 'DRIV' sein. Gefunden: "<value-of select="@typeCode"/>"</assert>
   </rule>
</pattern>
