"","t0","t1","t2","t3","t4","t5","t6"
"mean",11.7622640505433,23.6187756724656,66.7041318692267,225.482591948658,666.574706665426,1425.70217310078,2185.78883748911
"sd",0,1.17572256091589,6.86712986510219,29.3412116925429,73.4937632018317,108.565202478214,102.928499887954
