{
    "name": "bsdesign_pof.example_bayesian_pof_with_detection_probability",
    "label": "Example Bayesian PoF with detection probability",
    "description": "",
    "parent": "bsdesign_pof",
    "group_with_parent": true,
    "metadata": {
        "demo": true
    },
    "components": {
        "bsdesign_pof_context": {
            "param": {
                "area_freedom": false,
                "market_access": false,
                "cost_unit": "$",
                "dist_unit": "meters",
                "time_unit": "years",
                "surv_qty_unit": "traps",
                "surveillance_type": "traps"
            }
        },
        "bsdesign_pof_method": {
            "param": {
                "method": { "component:name": "bsdesign_pof_bayesian_freedom" }
            }
        },
        "bsdesign_pof_bayesian_freedom": {
            "param": {
                "pr_freedom": 0.5,
                "method_name": "pof_freedom_design",
                "pr_detect": {
                    "type": "single",
                    "value": 0.9498203
                },
                "pr_persist": 1,
                "iterations": 5,
                "detect_input": "probability",
                "stop_condition": "iterations"
            }
        },
        "bsdesign_pof": {
            "outputs": [
                "genre:DataGenreBSProofOfFreedomEvidence"
            ],
            "job_request_uuid": "2213c6cd-c478-4c33-ab44-4f07b2319cc6"
        }
    }
}