"region_id","establish_pr","sample_sens","design_dens","mgmt_cost_detected","mgmt_cost_undetected","sample_cost"
1,0.001,1,0.0100503358535015,4e+05,2400000,12
2,0.002,1,0.0408219945202552,360000,2160000,14
3,0.003,1,0.0202027073175195,320000,1920000,16
4,0.004,1,0.0304592074847086,280000,1680000,18
5,0.005,1,0.0202027073175195,240000,1440000,20
