{
    "$schema": "http://json-schema.org/draft-07/schema#",
    "title": "Dispersal Models",
    "$id": "https://biosecuritycommons.org.au/bsspread/bsspread_dispersal_model.json",
    "description": "Biosecurity Commons - Dispersal Models",
    "type": "object",
    "properties": {
        "dispersal_models" : {
            "title": "Dispersal Models",
            "description": "A list of Dispersal models defining the dispersal functionality for the different spread vectors to be simulated",
            "type": "array",
            "items": {
                "type": "object",
                "title": "Dispersal",
                "description": "",
                "allOf": [
                    {
                        "if": { 
                            "properties": {
                                "dispersal_type": { 
                                    "enum": [ "diffusion", "radial_diffusion", "reaction_diffusion"]
                                }
                            },
                            "required": [ "dispersal_type" ]
                        },
                        "then": {
                            "title": "Diffusion",
                            "properties": {
                                "diffusion_rate": {
                                    "title": "Diffusion Rate",
                                    "type": "number",
                                    "description": "The speed of diffusion (in m per time step)."
                                }
                            },
                            "required": [ "dispersal_type", "diffusion_rate" ]
                        }
                    },
                    {
                        "if": { 
                            "properties": {
                                "dispersal_type": { "const": "diffusion" },
                                "region_type": { "enum": ["raster"] }
                            },
                            "required": [ "dispersal_type", "region_type" ]
                        },
                        "then": {
                            "properties": {
                                "direction_function": {
                                    "$ref": "#/definitions/direction_function"
                                },
                                "attractors": {
                                    "$ref": "#/definitions/attractors_rast"
                                }
                            }
                        }
                    },
                    {
                        "if": { 
                            "properties": { 
                                "dispersal_type": { "const": "diffusion" },
                                "region_type": { "enum": ["network"] }
                            },
                            "required": [ "dispersal_type", "region_type" ]
                        },
                        "then": {   
                            "properties": {
                                "direction_function": {
                                    "$ref": "#/definitions/direction_function"
                                },
                                "attractors": {
                                    "$ref": "#/definitions/attractors_point"
                                }
                            }
                        }
                    },
                    {
                        "if": { 
                            "properties": { "dispersal_type": { "const": "dispersal" } },
                            "required": [ "dispersal_type" ]
                        },
                        "then": {
                            "title": "Kernel Dispersal",
                            "properties": {
                                "distance_function": {
                                    "allOf": [
                                        {
                                            "$ref": "#/definitions/distance_function"
                                        },
                                        {
                                            "title": "Distance Function",
                                            "description": "Kernels for calculating the (relative) probability of dispersal, used by Dispersal models. The kernel functions include Beta, Cauchy, (negative) Exponential, Gaussian (normal), Lognormal, and Weibull distributions. Also included is a function for defining the probability of distances from a table of values."        
                                        }
                                    ]
                                },
                                "direction_function": {
                                    "$ref": "#/definitions/direction_function"
                                }
                            }
                        }
                    },
                    {
                        "if": {
                            "properties": {
                                "region_type": { "enum": [ "raster" ] },
                                "dispersal_type": { "const": "dispersal" },
                                "distance_function": {
                                    "type": "object",
                                    "properties": {
                                        "function_name": {
                                          "enum": [
                                            "Beta",
                                            "Cauchy",
                                            "Exp",
                                            "Gaussian",
                                            "Lognormal",
                                            "Weibull",
                                            "Lookup"
                                          ]
                                        }
                                    },
                                    "required": ["function_name"]
                                }
                            },
                            "required": [
                                "region_type",
                                "dispersal_type",
                                "distance_function"
                            ]
                        },
                        "then": {
                            "properties": {
                                "distance_function": {
                                    "type": "object",
                                    "properties": {
                                        "distance_adjust": {
                                            "title": "Distance Adjust",
                                            "type": "boolean",
                                            "description": "Indication of whether the (relative) probabilities returned by 'Distance Function' should be distributed across the (approximate) number of grid cells at each distance.",
                                            "default": true
                                        }
                                    },
                                    "required": ["distance_adjust"]
                                }
                            }
                        }
                    },
                    {
                        "if": { 
                            "properties": { 
                                "dispersal_type": { "enum": ["dispersal", "gravity"] },
                                "region_type": { "enum": ["raster"] }
                            },
                            "required": [ "dispersal_type", "region_type" ]
                        },
                        "then": {   
                            "title": "Kernel Dispersal",
                            "properties": {
                                "attractors": {
                                    "$ref": "#/definitions/attractors_rast"
                                }
                            }
                        }
                    },
                    {
                        "if": { 
                            "properties": { 
                                "dispersal_type": { "enum": ["dispersal", "gravity"] },
                                "region_type": { "enum": ["network"] }
                            },
                            "required": [ "dispersal_type", "region_type" ]
                        },
                        "then": {   
                            "title": "Kernel Dispersal",
                            "properties": {
                                "attractors": {
                                    "$ref": "#/definitions/attractors_point"
                                }
                            }
                        }
                    },
                    {
                        "if": { 
                            "properties": { "dispersal_type": { "const": "gravity" } },
                            "required": [ "dispersal_type" ]
                        },
                        "then": {
                            "required": [ "attractors" ]
                        }
                    },
                    {
                        "if": { 
                            "properties": { "dispersal_type": { "const": "gravity" } },
                            "required": [ "dispersal_type" ]
                        },
                        "then": {
                            "title": "Gravity",
                            "required": [
                                "beta", 
                                "distance_scale"
                            ],
                            "properties": {
                                "beta": {
                                    "title": "Beta",
                                    "type": "number",
                                    "description": "Numeric constant for shaping the effect of distance within gravity dispersal, i.e. dispersal = f(attractors)/distance^beta.",
                                    "default": 2
                                },
                                "distance_scale": {
                                    "title": "Distance Unit",
                                    "type": "number",
                                    "description": "Unit for distances used within gravity dispersal, i.e. dispersal = f(attractors)/distance^beta. Default unit is kilometres.",
                                    "default": 1000,
                                    "enum": [
                                        1000,
                                        1
                                    ],
                                    "enumNames": [
                                        "kilometres",
                                        "metres"
                                    ]
                                },
                                "direction_function": {
                                    "$ref": "#/definitions/direction_function"
                                }
                            }
                        }
                    },
                    {
                        "if": { 
                            "properties": { "dispersal_type": { "enum": [ "dispersal", "gravity"] } },
                            "required": [ "dispersal_type" ]
                        },
                        "then": {
                            "properties": {
                                "events_type": {
                                    "title": "Events",
                                    "description": "The mean number of dispersal events generated via a Poisson distribution for each location at each time step. A dispersal destination (location) is selected for each dispersal event. Set values across locations or a single value for all locations.",
                                    "type": "string",
                                    "enum": ["single", "spatial"],
                                    "enumNames": [ "single value", "across locations" ],
                                    "default": "single"
                                }
                            }
                        }
                    },
                    {
                        "if": { 
                            "properties": {
                                "dispersal_type": { "enum": [ "dispersal", "gravity"] },
                                "population_type": { "const": "presence_only" }
                            },
                            "required": [ "dispersal_type", "population_type" ]
                        },
                        "then": {
                            "required": ["events_type"]
                        }
                    },
                    {
                        "if": { 
                            "properties": {
                                "dispersal_type": { "enum": [ "dispersal", "gravity"] },
                                "population_type": { "const": "presence_only" },
                                "events_type": { "const": "single" }
                            },
                            "required": [ 
                                "dispersal_type", 
                                "population_type", 
                                "events_type"
                            ]
                        },
                        "then": {
                            "properties": {
                                "events": {
                                    "title": "Events Value",
                                    "description": "",
                                    "type": "number",
                                    "exclusiveMinimum": 0
                                }
                            },
                            "required": ["events"]
                        }
                    },
                    {
                        "if": { 
                            "properties": {
                                "dispersal_type": { "enum": [ "dispersal", "gravity"] },
                                "population_type": { "enum": [ "unstructured", "stage_structured"] },
                                "events_type": { "const": "single" }
                            },
                            "required": [ 
                                "dispersal_type", 
                                "population_type", 
                                "events_type"
                            ]
                        },
                        "then": {
                            "properties": {
                                "events": {
                                    "title": "Events Value",
                                    "description": "",
                                    "type": ["number", "null"],
                                    "exclusiveMinimum": 0
                                }
                            }
                        }
                    },
                    {
                        "if": { 
                            "properties": {
                                "dispersal_type": { "enum": [ "dispersal", "gravity"] },
                                "events_type": { "const": "spatial" },
                                "region_type": { "const": "raster" }
                            },
                            "required": [ 
                                "dispersal_type", 
                                "events_type", 
                                "region_type"
                            ]
                        },
                        "then": {
                            "properties": {
                                "events": {
                                    "$ref": "#/definitions/events_rast"
                                }
                            }
                        }
                    },
                    {
                        "if": { 
                            "properties": {
                                "dispersal_type": { "enum": [ "dispersal", "gravity"] },
                                "population_type": { "const": "presence_only" },
                                "events_type": { "const": "spatial" },
                                "region_type": { "const": "raster" }
                            },
                            "required": [ 
                                "dispersal_type", 
                                "population_type", 
                                "events_type", 
                                "region_type"
                            ]
                        },
                        "then": {
                            "required": ["events"]
                        }
                    },
                    {
                        "if": { 
                            "properties": {
                                "dispersal_type": { "enum": [ "dispersal", "gravity"] },
                                "events_type": { "const": "spatial" },
                                "region_type": { "const": "network" }
                            },
                            "required": [ "dispersal_type", "events_type", "region_type" ]
                        },
                        "then": {
                            "properties": {
                                "events": {
                                    "$ref": "#/definitions/events_point"
                                }
                            }
                        }
                    },
                    {
                        "if": { 
                            "properties": {
                                "dispersal_type": { "enum": [ "dispersal", "gravity"] },
                                "population_type": { "const": "presence_only" },
                                "events_type": { "const": "spatial" },
                                "region_type": { "const": "network" }
                            },
                            "required": [ 
                                "dispersal_type", 
                                "population_type", 
                                "events_type", 
                                "region_type"
                            ]
                        },
                        "then": {
                            "required": ["events"]
                        }
                    },
                    {
                        "if": { 
                            "properties": {
                                "region_type": { "enum": ["raster", "network"] },
                                "population_type": { "enum": [ "unstructured", "stage_structured"] }
                            },
                            "required": [ "region_type", "population_type" ]
                        },
                        "then": {
                            "properties": {
                                "proportion_type": {
                                    "title": "Proportion",
                                    "description": "The proportion of the population that disperses at each time step. Set values across locations or a single value for all locations.",
                                    "type": "string",
                                    "enum": ["single", "spatial"],
                                    "enumNames": [ "single value", "across locations" ],
                                    "default": "single"
                                }
                            },
                            "required": ["proportion_type"]
                        }
                    },
                    {
                        "if": { 
                            "properties": {
                                "region_type": { "enum": ["raster", "network"] },
                                "population_type": { "enum": [ "unstructured", "stage_structured"] },
                                "proportion_type": { "const": "single" }
                            },
                            "required": [ 
                                "region_type", 
                                "population_type", 
                                "proportion_type"
                            ]
                        },
                        "then": {
                            "properties": {
                                "proportion": {
                                    "title": "Proportion Value",
                                    "description": "",
                                    "type": "number",
                                    "exclusiveMinimum": 0,
                                    "maximum": 1
                                }
                            },
                            "required": ["proportion"]
                        }
                    },
                    {
                        "if": { 
                            "properties": {
                                "region_type": { "enum": ["raster"] },
                                "population_type": { "enum": [ "unstructured", "stage_structured"] },
                                "proportion_type": { "const": "spatial" }
                            },
                            "required": [ 
                                "region_type", 
                                "population_type", 
                                "proportion_type"
                            ]
                        },
                        "then": {
                            "properties": {
                                "proportion": {
                                    "$ref": "#/definitions/proportion_rast"
                                }
                            },
                            "required": ["proportion"]
                        }
                    },
                    {
                        "if": { 
                            "properties": {
                                "region_type": { "enum": ["network"] },
                                "population_type": { "enum": [ "unstructured", "stage_structured"] },
                                "proportion_type": { "const": "spatial" }
                            },
                            "required": [ 
                                "region_type", 
                                "population_type", 
                                "proportion_type"
                            ]
                        },
                        "then": {
                            "properties": {
                                "proportion": {
                                    "$ref": "#/definitions/proportion_point"
                                }
                            },
                            "required": ["proportion"]
                        }
                    },
                    {
                        "if": {
                            "properties": { 
                                "region_type": { "enum": ["raster", "network"] },
                                "population_type": { "const": "stage_structured" } 
                            },
                            "required": [ "region_type", "population_type" ]
                        },
                        "then": {
                            "properties": {
                                "dispersal_stages": {
                                    "title": "Dispersal Stages",
                                    "type": "array",
                                    "items": {
                                        "type" : ["number", "null"]
                                    },
                                    "minItems": 0,
                                    "description": "Numeric vector of population stages (indices) that disperse. Default is all stages."
                                }
                            },
                            "required": ["dispersal_stages"]
                        }
                    },
                    {
                        "if": { 
                            "properties": { 
                                "region_type": { "enum": ["raster"] }
                            },
                            "required": [ "region_type" ]
                        },
                        "then": {
                            "properties": {
                                "permeability_rast": { 
                                    "allOf": [
                                        {
                                            "$ref": "https://schema.biosecuritycommons.org.au/dataset.json#definitions/dataset_spatial_raster"
                                        },
                                        {
                                            "title": "Permeability Raster",
                                            "description": "Represents spatial permeability or constraints"
                                        }
                                    ]
                                }
                            },
                            "required": []
                        }
                    },
                    {
                        "if": { 
                            "properties": { 
                                "region_type": { "enum": ["network"] }
                            },
                            "required": [ "region_type" ]
                        },
                        "then": {
                            "properties": {
                                "permeability_point": { 
                                    "allOf": [
                                        {
                                            "$ref": "https://schema.biosecuritycommons.org.au/dataset.json#definitions/dataset_aspatial"
                                        },
                                        {
                                            "title": "Network Weights",
                                            "description": "The network connections or paths between patch locations are defined via tabular data defining the path weight between locations (indices), loaded via a CSV file.\n\nEach row specifies the bidirectional (relative) weight of moving between patches i and j, indexed in the order defined by the region.",
                                            "properties": {
                                                "fields": {
                                                    "properties": {
                                                        "i": {
                                                            "title": "I",
                                                            "description": "",
                                                            "type": ["array"],
                                                            "items": {
                                                                "type": "integer"
                                                            },
                                                            "default": []
                                                        },
                                                        "j": {
                                                            "title": "J",
                                                            "description": "",
                                                            "type": ["array"],
                                                            "items": {
                                                                "type": "integer"
                                                            },
                                                            "default": []
                                                        },
                                                        "weight": {
                                                            "title": "Weight",
                                                            "description": "",
                                                            "type": ["array"],
                                                            "items": {
                                                                "type": "number"
                                                            },
                                                            "default": []
                                                        }
                                                    }
                                                }
                                            }
                                        }
                                    ]
                                }
                            },
                            "required": []
                        }
                    }
                ],
                "properties": {
                    "region_type": {
                        "readOnly": true,
                        "type": "string",
                        "enum": [ "", "raster", "network", "none" ]
                    },

                    "population_type": {
                        "readOnly": true,
                        "type": "string",
                        "enum": [
                            "", 
                            "presence_only", 
                            "unstructured",
                            "stage_structured"
                        ]
                    },

                    "dispersal_type": {
                        "title": "Dispersal Type",
                        "type": "string",
                        "description": "",
                        "enum": [
                            "dispersal",
                            "diffusion",
                            "radial_diffusion",
                            "area_spread",
                            "reaction_diffusion",
                            "gravity"
                        ]
                    }
                },
                "required": [
                ]
            },
            "minItems": 1
        }
    },
    "definitions" : {

        "events_rast": { 
            "allOf": [
                {
                    "$ref": "https://schema.biosecuritycommons.org.au/dataset.json#definitions/dataset_spatial_raster"
                },
                {
                    "title": "Events Location Values",
                    "description": ""
                }
            ]
        },

        "events_point": { 
            "allOf": [
                {
                    "$ref": "https://schema.biosecuritycommons.org.au/dataset.json#definitions/dataset_spatial"
                },
                {
                    "title": "Events Location Values",
                    "description": "",
                    "properties": {
                        "fields": {
                            "properties": {
                                "lat": {
                                    "title": "Lat",
                                    "description": "",
                                    "type": ["array"],
                                    "items": {
                                        "type": "number"
                                    }
                                },
                                "lon": {
                                    "title": "Lon",
                                    "description": "",
                                    "type": ["array"],
                                    "items": {
                                        "type": "number"
                                    }
                                },
                                "name": {
                                    "title": "Name",
                                    "description": "",
                                    "type": ["array"],
                                    "items": {
                                        "type": "string"
                                    }
                                },
                                "events": {
                                    "title": "Events",
                                    "description": "",
                                    "type": ["array"],
                                    "items": {
                                        "type": "number"
                                    }
                                }
                            }
                        }
                    }
                }
            ]
        },
        
        "proportion_rast": { 
            "allOf": [
                {
                    "$ref": "https://schema.biosecuritycommons.org.au/dataset.json#definitions/dataset_spatial_raster"
                },
                {
                    "title": "Proportion Location Values",
                    "description": ""
                }
            ]
        },

        "proportion_point": { 
            "allOf": [
                {
                    "$ref": "https://schema.biosecuritycommons.org.au/dataset.json#definitions/dataset_spatial"
                },
                {
                    "title": "Proportion Location Values",
                    "description": "",
                    "properties": {
                        "fields": {
                            "properties": {
                                "lat": {
                                    "title": "Lat",
                                    "description": "",
                                    "type": ["array"],
                                    "items": {
                                        "type": "number"
                                    }
                                },
                                "lon": {
                                    "title": "Lon",
                                    "description": "",
                                    "type": ["array"],
                                    "items": {
                                        "type": "number"
                                    }
                                },
                                "name": {
                                    "title": "Name",
                                    "description": "",
                                    "type": ["array"],
                                    "items": {
                                        "type": "string"
                                    }
                                },
                                "proportion": {
                                    "title": "Proportion",
                                    "description": "",
                                    "type": ["array"],
                                    "items": {
                                        "type": "number"
                                    }
                                }
                            }
                        }
                    }
                }
            ]
        },
        
        "kernel_lookup_distance":   {
            "properties": {
                "function_name": { "enum": ["Lookup"] },
                "table": { 
                    "allOf": [
                        {
                            "$ref": "https://schema.biosecuritycommons.org.au/dataset.json#definitions/dataset_aspatial"
                        },
                        {
                            "title": "Lookup table",
                            "description": "",
                            "properties": {
                                "fields": {
                                    "required": ["distance", "probability"],
                                    "properties": {
                                        "distance": {
                                            "title": "Distance",
                                            "description": "Distance",
                                            "type": ["array"],
                                            "items": {
                                                "type": "number"
                                            },
                                            "default": []
                                        },
                                        "probability": {
                                            "title": "Probability",
                                            "description": "Probability",
                                            "type": ["array"],
                                            "items": {
                                                "type": "number"
                                            },
                                            "default": []
                                        }
                                    }
                                }
                            }
                        }
                    ]
                }
            },
            "required": []
        },

        "kernel_lookup_direction": {
            "properties": {
                "function_name": { "enum": ["Lookup"] },
                "table": { 
                    "allOf": [
                        {
                            "$ref": "https://schema.biosecuritycommons.org.au/dataset.json#definitions/dataset_aspatial"
                        },
                        {
                            "title": "Lookup table",
                            "description": "",
                            "properties": {
                                "fields": {
                                    "required": ["direction", "probability"],
                                    "properties": {
                                        "direction": {
                                            "title": "Direction",
                                            "description": "Direction",
                                            "type": ["array"],
                                            "items": {
                                                "type": "number"
                                            },
                                            "default": []
                                        },
                                        "probability": {
                                            "title": "Probability",
                                            "description": "Probability",
                                            "type": ["array"],
                                            "items": {
                                                "type": "number"
                                            },
                                            "default": []
                                        }
                                    }
                                }
                            }
                        }
                    ]
                }
            },
            "required": []
        },

        "direction_function": {
            "type": "object",
            "title": "Direction Function (optional)",
                                "description": "Kernels for calculating the (relative) probability of dispersal direction, used by Dispersal models. The kernel function is Beta or a function for defining the probability of directions from a table of values. If not defined, it is assumed all directions have equal probability.",
            "properties": {
                "function_name": {
                  "title": "Function Name",
                  "type": "string",
                  "enum": [
                    "",
                    "Beta",
                    "Lookup"
                  ]
                }
            },
            "default": {},
            "required": [],
            "dependencies": {
                "function_name": {
                    "oneOf": [
                        {   
                            "properties": {
                                "function_name": { "enum": [""] }
                            },
                            "required": []
                        },
                        {
                            "properties": {
                                "function_name": { "enum": ["Beta"] },
                                "alpha": { "title": "Alpha", "type": "number" },
                                "beta": { "title": "Beta", "type": "number" },
                                "shift": { "title": "Shift", "type": "number", "default": 0 }
                            },
                            "required": []
                        },
                        {
                            "$ref": "#/definitions/kernel_lookup_direction"
                        }
                    ]
                }
            }
        },

        "distance_function": {
            "title": "Distance Function",
            "type": "object",
            "description": "Kernels for calculating the (relative) probability of dispersal, used by Dispersal models. The kernel functions include Beta, Cauchy, (negative) Exponential, Gaussian (normal), Lognormal, and Weibull distributions. Also included is a function for defining the probability of distances from a table of values",
            "properties": {
                "function_name": {
                  "title": "Function Name",
                  "type": "string",
                  "enum": [
                    "Beta",
                    "Cauchy",
                    "Exp",
                    "Gaussian",
                    "Lognormal",
                    "Weibull",
                    "Lookup"
                  ]
                },
                "max_distance": {
                    "title": "Max Distance",
                    "description": "The maximum dispersal distance (in m). Default is none (resulting in no explicit distance limit).",
                    "type": ["null", "number"],
                    "default": null
                }
            },
            "required": [],
            "default": {},
            "dependencies": {
                "function_name": {
                    "oneOf": [
                        {
                            "properties": {
                                "function_name": { "enum": ["Beta"] },
                                "alpha": { "title": "Alpha", "type": "number" },
                                "beta": { "title": "Beta", "type": "number" },
                                "upper": { "title": "Upper", "type": "number" }
                            },
                            "required": []
                        },
                        {
                            "properties": {
                                "function_name": { "enum": ["Cauchy"] },
                                "scale": { 
                                    "title": "Scale",
                                    "type": "number"
                                }
                            },
                            "required": []
                        },
                        {
                            "properties": {
                                "function_name": { "enum": ["Exp"] },
                                "mean": { "title": "Mean", "type": "number" }
                            },
                            "required": []
                        },
                        {
                            "properties": {
                                "function_name": { "enum": ["Gaussian"] },
                                "sd": { "title": "SD", "type": "number" }
                            },
                            "required": []
                        },
                        {
                            "properties": {
                                "function_name": { "enum": ["Lognormal"] },
                                "mean": { "title": "Mean", "type": "number" },
                                "sd": { "title": "SD", "type": "number" }
                            },
                            "required": []
                        },
                        {
                            "properties": {
                                "function_name": { "enum": ["Weibull"] },
                                "shape": { "title": "Shape", "type": "number" },
                                "scale": { "title": "Scale", "type": "number" }
                            },
                            "required": []
                        },
                        {
                            "$ref": "#/definitions/kernel_lookup_distance"
                        }
                    ]
                }
            }
        },

        "attractors_rast": { 
            "title": "Attractors",
            "description": "Attractors for spatially weighted dispersal, whereby values represent the relative weightings given to each location. Multiple attractors are multiplied together at each location",
            "type": "array",
            "items": {
                "$ref": "#/definitions/attractor_rast"
            }
        },

        "attractors_point": { 
            "title": "Attractors",
            "description": "Attractors for spatially weighted dispersal, whereby values represent the relative weightings given to each location. Multiple attractors are multiplied together at each location",
            "type": "array",
            "items": {
                "$ref": "#/definitions/attractor_point"
            }
        },

        "attractor_rast": { 
            "allOf": [
                {
                    "$ref": "https://schema.biosecuritycommons.org.au/dataset.json#definitions/dataset_spatial_raster"
                },
                {
                    "title": "Attractor Rast",
                    "description": "Attractor Raster dataset definition",
                    "required": ["uuid"]
                }
            ]
        },

        "attractor_point": { 
            "allOf": [
                {
                    "$ref": "https://schema.biosecuritycommons.org.au/dataset.json#definitions/dataset_spatial_point"
                },
                {
                    "title": "Attractor Points",
                    "description": "Attractor Points dataset definition",
                    "required": ["uuid"],
                    "properties": {
                        "fields": {
                            "properties": {
                                "lat": {
                                    "title": "Lat",
                                    "description": "",
                                    "type": ["array"],
                                    "items": {
                                        "type": "number"
                                    }
                                },
                                "lon": {
                                    "title": "Lon",
                                    "description": "",
                                    "type": ["array"],
                                    "items": {
                                        "type": "number"
                                    }
                                },
                                "name": {
                                    "title": "Name",
                                    "description": "",
                                    "type": ["array"],
                                    "items": {
                                        "type": "string"
                                    }
                                },
                                "attractor": {
                                    "title": "Attractor",
                                    "description": "",
                                    "type": ["array"],
                                    "items": {
                                        "type": "number"
                                    }
                                }
                            }
                        }
                    }
                }
            ]
        }
    }
}
