{
    "$schema": "http://json-schema.org/draft-07/schema#",
    "$id": "https://schema.biosecuritycommons.org.au/bsimpact/bsimpact_region.json",
    "title": "Impact Analysis Region",
    "description": "Represents a spatial region for an impact analysis, defined via a raster layer with active (non-NA) cells, or via a data frame specifying locations, patches, or sub-regions",
    "type": "object",
    "required": [
        "region_rast"
    ],
    "properties": {
        "region_rast" : {
            "allOf": [
                {
                    "$ref": "https://schema.biosecuritycommons.org.au/dataset.json#definitions/dataset_spatial_raster"
                },
                {
                    "title": "Region",
                    "description": "Represents the spatial region (template) for impact analysis",
                    "required": ["uuid"]
                }
            ]   
        }
    }
}