"lon","lat","name","pop"
144.9,-37.8,"Melbourne",174.3
144.3,-38.2,"Geelong",126.5
143.9,-37.6,"Ballarat",44.5
144.3,-36.8,"Bendigo",22.6
142.5,-38.4,"Warrnambool",8.1
147.1,-38.1,"Sale",9.4
145.5,-36.4,"Shepparton",6
141.5,-38.3,"Portland",3.6
148.4,-37.7,"Orbost",2.9
146,-36.6,"Benalla",7.5
146.9,-36.1,"Albury",5.4
142.2,-36.7,"Horsham",7.1
142.2,-34.2,"Mildura",1.2
142,-37.8,"Hamilton",4.4
