{
    "$id": "https://schema.biosecuritycommons.org.au/bsmanage/action_removal.json",
    "$schema": "http://json-schema.org/draft-07/schema#",
    "title": "Biosecurity Resource Allocation - Action Removal",
    "description": "Simulating the application of management removals or eradication of an invasive species.",
    "type": "object",
	"properties": {
    },
    "required": [
    ]
}
