{
    "user": {
        "uuid": "d83dc2bb-8df1-4c12-a80c-9e45e8e45a48"
    },
    "function": "aggregate_categories",
    "template": { 
        "uuid": "9ccad5ab-d8fd-538f-b052-a7d1453c8ec8",
        "layers": ["template_au"],
        "source_type": "dataset"
    },
    "spatial": {
        "uuid": "a71d8e6c-f555-5b06-9df7-17700f0926ac",
        "layers": ["Land_Use_Secondary_Categories"],
        "source_type": "dataset"
    },
    "categories": null,
    "selected": [340, 341, 342, 344, 345, 347, 348, 349, 350, 353, 365, 440,
           441, 442, 444, 445, 447, 448, 449, 450, 451, 453, 540, 541,
           542, 543, 544],
    "binarize": true
}