{
    "function": "distance_weight_layer",
    "template": {
        "uuid": "6221c91c-fa77-11eb-bc01-0242ac150005",
        "layers": ["bioclim_01"],
        "source_type": "dataset"
    },
    "location": "b5c4f5c8-5baf-11ec-a45a-0242ac130005",
    "beta": 0.55,
    "weights": null
}
