{
    "name": "bsimpact",
    "label": "Impact Analysis",
    "description": "The expected impact on different assets over time",
    "parent": ".toolkit",
    "components": {

        "assets_existence_or_bequest": {
            "create": "",
            "type": "Dataset",
            "label": "Cultural - Existence or bequest",
            "description": "Asset Values Biosecurity: Cultural - Existence or bequest (2015)",
            "uuid": "74cc185f-6598-5290-979a-66c0b1e58d3b",
            "outputs": [ "assets_existence_or_bequest" ],
            "param": { "name": "Existence or bequest" }
        },

        "assets_recreation_or_aesthetics": {
            "create": "",
            "type": "Dataset",
            "label": "Cultural - Recreation or aesthetics",
            "description": "Asset Values Biosecurity: Cultural - Recreation or aesthetics (2015)",
            "uuid": "74cc185f-6598-5290-979a-66c0b1e58d3b",
            "outputs": [ "assets_recreation_or_aesthetics" ],
            "param": { "name": "Recreation or aesthetics" }
        },

        "assets_tourism": {
            "create": "",
            "type": "Dataset",
            "label": "Cultural - Tourism",
            "description": "Asset Values Biosecurity: Cultural - Tourism (2015)",
            "uuid": "74cc185f-6598-5290-979a-66c0b1e58d3b",
            "outputs": [ "assets_tourism" ],
            "param": { "name": "Tourism" }
        },

        "assets_agriculture": {
            "create": "",
            "type": "Dataset",
            "label": "Provisioning - Agriculture",
            "description": "Asset Values Biosecurity: Provisioning - Agriculture (2015)",
            "uuid": "c5fc8b81-02ac-5b94-bdfe-58677a8c351a",
            "outputs": [ "assets_agriculture" ],
            "param": { "name": "Agriculture" }
        },

        "assets_forestry": {
            "create": "",
            "type": "Dataset",
            "label": "Provisioning - Forestry",
            "description": "Asset Values Biosecurity: Provisioning - Forestry (2015)",
            "uuid": "c5fc8b81-02ac-5b94-bdfe-58677a8c351a",
            "outputs": [ "assets_forestry" ],
            "param": { "name": "Forestry" }
        },

        "assets_water": {
            "create": "",
            "type": "Dataset",
            "label": "Provisioning - Water",
            "description": "Asset Values Biosecurity: Provisioning - Water (2015)",
            "uuid": "c5fc8b81-02ac-5b94-bdfe-58677a8c351a",
            "outputs": [ "assets_water" ],
            "param": { "name": "Water" }
        },

        "assets_infrastructure": {
            "create": "",
            "type": "Dataset",
            "label": "Infrastructure",
            "description": "Asset Values Biosecurity: Infrastructure (2015)",
            "uuid": "178db103-87cb-5a85-89fc-a85f62ad72ba",
            "outputs": [ "assets_infrastructure" ],
            "param": { "name": "Infrastructure" }
        },

        "assets_carbon_sequestration": {
            "create": "",
            "type": "Dataset",
            "label": "Regulating - Sequestration",
            "description": "Asset Values Biosecurity: Regulating - Sequestration (2015)",
            "uuid": "4141c27e-70f7-5f52-81a1-bd8aeb1cea3f",
            "outputs": [ "assets_carbon_sequestration" ],
            "param": { "name": "Sequestration" }
        },

        "assets_erosion_control": {
            "create": "",
            "type": "Dataset",
            "label": "Regulating - Erosion control",
            "description": "Asset Values Biosecurity: Regulating - Erosion control (2015)",
            "uuid": "4141c27e-70f7-5f52-81a1-bd8aeb1cea3f",
            "outputs": [ "assets_erosion_control" ],
            "param": { "name": "Erosion control" }
        },

        "assets_flood_control": {
            "create": "",
            "type": "Dataset",
            "label": "Regulating - Flood control",
            "description": "Asset Values Biosecurity: Regulating - Flood control (2015)",
            "uuid": "4141c27e-70f7-5f52-81a1-bd8aeb1cea3f",
            "outputs": [ "assets_flood_control" ],
            "param": { "name": "Flood control" }
        },

        "assets_genepool": {
            "create": "",
            "type": "Dataset",
            "label": "Regulating - Genepool",
            "description": "Asset Values Biosecurity: Regulating - Genepool (2015)",
            "uuid": "4141c27e-70f7-5f52-81a1-bd8aeb1cea3f",
            "outputs": [ "assets_genepool" ],
            "param": { "name": "Genepool" }
        },

        "assets_toxin_mediation": {
            "create": "",
            "type": "Dataset",
            "label": "Regulating - Toxin mediation",
            "description": "Asset Values Biosecurity: Regulating - Toxin mediation (2015)",
            "uuid": "4141c27e-70f7-5f52-81a1-bd8aeb1cea3f",
            "outputs": [ "assets_toxin_mediation" ],
            "param": { "name": "Toxin mediation" }
        },

        "assets_domestic_animals": {
            "create": "",
            "type": "Dataset",
            "label": "Companion Animals - Domestic",
            "description": "Asset Values Biosecurity: Companion Animals - Domestic (2015)",
            "uuid": "9efd4095-fc9a-58d5-bd83-15f89dd65459",
            "outputs": [ "assets_domestic_animals" ],
            "param": { "name": "Domestic animals" }
        },

        "assets_recreational_horses": {
            "create": "",
            "type": "Dataset",
            "label": "Companion Animals - Recreational horses",
            "description": "Asset Values Biosecurity: Companion Animals - Recreational horses (2015)",
            "uuid": "9efd4095-fc9a-58d5-bd83-15f89dd65459",
            "outputs": [ "assets_recreational_horses" ],
            "param": { "name": "Recreational horses" }
        },

        "bsimpact": {
            "create": "always",
            "inputs": [
                "region:bsimpact_region",
                "occurrence:bsimpact_occurrence",
                "method:bsimpact_method"
            ],
            "label": "Impact Analysis",
            "type": "Function",
            "icon": "circle-arrow-right",
            "url": "https://schema.biosecuritycommons.org.au/bsimpact/bsimpact.json",
            "outputs": [
            ],
            "param": {}
        },

        "bsimpact_region": {
            "create": "with_parent",
            "inputs": [
                "region_rast:toolkit_create_region"
            ],
            "label": "Region",
            "type": "Parameters",
            "icon": "area-of-interest",
            "url": "https://schema.biosecuritycommons.org.au/bsimpact/bsimpact_region.json",
            "outputs": [],
            "param": {}
        },

        "bsimpact_occurrence": {
            "create": "with_parent",
            "inputs": [],
            "label": "Occurrence",
            "type": "Parameters",
            "icon": "heatmap",
            "url": "https://schema.biosecuritycommons.org.au/bsimpact/bsimpact_occurrence.json",
            "outputs": [],
            "param": {}
        },

        "bsimpact_method": {
            "create": "with_parent",
            "inputs": [
                "parameters:bsimpact_method_monetary",
                "parameters:bsimpact_method_non_monetary"
            ],
            "label": "Valuation type",
            "type": "Parameters",
            "icon": "function",
            "url": "https://schema.biosecuritycommons.org.au/bsimpact/bsimpact_method.json",
            "outputs": [],
            "param": {}
        },

        "bsimpact_method_monetary": {
            "create": "with_parent",
            "inputs": [
                "asset_layers:assets_existence_or_bequest",
                "asset_layers:assets_recreation_or_aesthetics",
                "asset_layers:assets_tourism",
                "asset_layers:assets_agriculture",
                "asset_layers:assets_forestry",
                "asset_layers:assets_water",
                "asset_layers:assets_infrastructure",
                "asset_layers:assets_carbon_sequestration",
                "asset_layers:assets_erosion_control",
                "asset_layers:assets_flood_control",
                "asset_layers:assets_genepool",
                "asset_layers:assets_toxin_mediation",
                "asset_layers:assets_domestic_animals",
                "asset_layers:assets_recreational_horses"
            ],
            "label": "Monetary Impact",
            "type": "Parameters",
            "icon": "dollar",
            "url": "https://schema.biosecuritycommons.org.au/bsimpact/bsimpact_method_value.json",
            "outputs": [
                "DataGenreBSImpactAnalysisCombinedImpacts"
            ],
            "param": {
                "valuation_type": "monetary",
                "combine_function": "sum"
            }
        },

        "bsimpact_method_non_monetary": {
            "create": "with_parent",
            "inputs": [
            ],
            "label": "Non Monetary Impact",
            "type": "Parameters",
            "icon": "high-priority",
            "url": "https://schema.biosecuritycommons.org.au/bsimpact/bsimpact_method_value.json",
            "outputs": [
                "DataGenreBSImpactAnalysisCombinedImpacts"
            ],
            "param": {
                "valuation_type": "non-monetary",
                "combine_function": "none"
            }
        },

        "toolkit_buffered_hull": {
            "inputs": [
                "template:/bsimpact_region.region_rast"
            ]
        },

        "toolkit_distance_weight_layer": {
            "inputs": [
                "template:/bsimpact_region.region_rast"
            ]
        },   
        
        "toolkit_aggregate_categories": {
            "inputs": [
                "template:/bsimpact_region.region_rast"
            ]
        },

        "toolkit_combine_layers": {
            "inputs": [
                "spatial_dataset:*",
                "template:/bsimpact_region.region_rast"
            ]
        },
        
        "toolkit_conform_layer": {
            "inputs": [
                "spatial:*",
                "template:/bsimpact_region.region_rast"
            ]
        }
    }
}
