"","t00","t01","t02","t03","t04","t05","t06","t07","t08","t09","t10"
"mean",100,100.6,109,123.7,148,182.5,220.2,253.8,297.7,361.4,433.4
"sd",0,8.87192826341101,14.0158640277524,22.9252408202546,33.9607616718667,45.9595232544658,64.4028984854978,73.8253193543907,90.4139246896062,114.780176375927,143.963884359932
