"region_id","establish_pr","sample_sens","design_dens","benefit","sample_cost"
1,0.001,1,0.0100503358535015,2e+06,12
2,0.002,1,0.0408219945202552,1800000,14
3,0.003,1,0.0202027073175195,1600000,16
4,0.004,1,0.0304592074847086,1400000,18
5,0.005,1,0.0202027073175195,1200000,20
