{
  "function": "bsspread",
  "user": { "uuid": "6221c91c-fa77-11eb-bc01-0242ac150005" },
  "region": {
    "region_type": "raster",
    "region_rast": {
      "layers": [
        "falls_template"
      ],
      "uuid": "1b48ac9e-b94c-11ed-a833-ca580a640238",
      "source_type": "dataset"
    },
    "aggr_factor":20,
    "inner_radius":5000
  },
  "simulator": {
    "time_steps": 2,
    "step_units": "years",
    "step_duration": 1,
    "collation_steps": 1,
    "replicates": 1
  },
  "initializer":{
    "region_type": "raster",
    "source_type":"parameters",
    "initializer_type":"initial_layer",
    "initial_rast":{
       "uuid":"8b48ac9e-a94c-11ed-a833-da580a640238",
       "layers":[
          "falls_town"
       ],
       "source_type":"dataset"
    },
    "initial_geojson": {
      "method": "user-points",
      "geojson": "{\"type\":\"FeatureCollection\",\"features\":[{\"type\":\"Feature\",\"geometry\":{\"type\":\"Point\",\"coordinates\":[147.2534774194293,-36.8317397249121]},\"properties\":null},{\"type\":\"Feature\",\"geometry\":{\"type\":\"Point\",\"coordinates\":[147.24394444571217,-36.862208106491465]},\"properties\":null},{\"type\":\"Feature\",\"geometry\":{\"type\":\"Point\",\"coordinates\":[147.26441473722085,-36.893347499032714]},\"properties\":null},{\"type\":\"Feature\",\"geometry\":{\"type\":\"Point\",\"coordinates\":[147.3139733995583,-36.880276219596155]},\"properties\":null},{\"type\":\"Feature\",\"geometry\":{\"type\":\"Point\",\"coordinates\":[147.3114433212258,-36.830152434652724]},\"properties\":null}]}"
    }
  },
  "population_model": {
    "region_type": "raster",
    "capacity": {},
    "establish_pr": {},
    "population_type": "presence_only",
    "incursion_values": ""
  },
  "dispersal_models": [
    {
      "region_type": "raster",
      "dispersal_type": "diffusion",
      "attractors": [],
      "direction_function": {
        "function": ""
      },
      "permeability": {},
      "events": 0,
      "dispersal_stages": 0,
      "proportion": 1,
      "diffusion_rate": 20,
      "distance_function": 0,
      "distance_adjust": 0
    }
  ]
}