[
	{
		"datasetType": "spatial-raster",
		"uploadedFiles": ["test/data/bsimpact/package_demo/demo_1/input/template_vic.tif"],
		"metadata": {
			"title": "template_vic",
			"mimetype": "image/geotiff"
		},
		"uuid": "1b48ac9e-b94c-11ed-a863-da580a64023a"
    },
    {
		"datasetType": "spatial-point",
		"uploadedFiles": ["test/data/bsimpact/package_demo/demo_1/input/vic_cities.csv"],
		"metadata": {
			"title": "vic_cities",
			"mimetype": "image/geotiff"
		},
		"uuid": "2b48ac9e-b94c-11ed-a863-da580a64023a"
    },
    {
		"datasetType": "spatial-point",
		"uploadedFiles": ["test/data/bsimpact/package_demo/demo_1/input/vic_cities.csv"],
		"metadata": {
			"title": "vic_cities",
			"mimetype": "image/geotiff"
		},
		"uuid": "2b48ac9e-b94c-11ed-a863-da580a64023a"
    }
]