{
  "function": "bsdesign",
  "user": { "uuid": "6221c91c-fa77-11eb-bc01-0242ac150005" },
  "context": {
    "species_name": "Spongy moth",
    "species_type": "pest",
    "surveillance_purpose": "early_detection",
    "surveillance_type": "samples",
    "surv_qty_unit": "traps",
    "cost_unit": "$",
    "time_unit": "years",
    "dist_unit": "kilometers",
    "incursion_status": "never_detected",
    "area_freedom": false,
    "market_access": false,
    "market_requirement": "absence"
  },
  "method": {
    "parameters": {
      "method_name": "area_growth",
      "region": {
        "source_type": "dataset",
        "uuid": "7b89cfc2-580d-11ed-bcfb-0a580a640d0f",
        "layers": [
          ""
        ]
      },
      "mgmt_cost": {
        "eradication": 29357,
        "damage": 0,
        "penalty": 61403248
      },
      "growth_rate": 100,
      "size_class_max": 10,
      "class_pops_max": 100,
      "sample_sens": 1
    }
  }
}