{
    "name": "bsspread.two_tier_grid_kernel_example",
    "label": "Two-tier grid kernel example",
    "description": "",
    "parent": "bsspread",
    "group_with_parent": true,
    "metadata": {
        "demo": true,
        "region": "Greater Melbourne area"
    },
    "components": {
        "region": {
            "param": {
                "region_type": "raster",
                "two_tier": true,
                "aggr_factor": 5,
                "inner_radius": 20000
            },
            "inputs": [
                "region_rast:dataset_9bdf76e8-4954-11ef-bd65-0a580a640c2d"
            ]
        },
        "population_model": {
            "param": {
                "growth": 1.2,
                "region_type": "raster",
                "population_type": "unstructured"
            },
            "inputs": [
                "establish_pr_rast:dataset_dbba85a2-762a-11ef-9a27-0a580a640644",
                "capacity_rast:dataset_fb423f14-762a-11ef-82e7-0a580a640644",
                "region_type:/region.region_type"
            ]
        },
        "initializer": {
            "param": {
                "initial_layer_type": "draw",
                "initial_geojson": {
                    "method": "user-drawn",
                    "geojson": "{\"type\":\"Feature\",\"geometry\":{\"type\":\"Polygon\",\"coordinates\":[[[144.87735819313903,-37.879696174468144],[144.85940672492495,-37.84689863322239],[144.87373030636667,-37.799625603535034],[144.91205189638197,-37.792693063891946],[144.93761016960414,-37.79876772803473],[144.95690136109937,-37.80684478411626],[144.9645261389184,-37.85898828626069],[144.93776555953193,-37.87713763113358],[144.87735819313903,-37.879696174468144]]]},\"properties\":null}"
                },
                "population_size": 150,
                "region_type": "raster",
                "population_type": "unstructured",
                "initializer_type": "initial_layer"
            }
        },
        "dispersal_models": {
            "param": {},
            "inputs": [
                "dispersal_models:dispersal"
            ]
        },
        "simulator": {
            "param": {
                "replicates": 10,
                "step_units": "years",
                "time_steps": 20,
                "step_duration": 1,
                "collation_steps": 5,
                "population_type": "unstructured"
            }
        },
        "dispersal": {
            "create": "with_parent",
            "param": {
                "distance_function": {
                    "max_distance": null,
                    "distance_adjust": true,
                    "scale": 5000,
                    "function_name": "Cauchy"
                },
                "events_type": "single",
                "proportion_type": "single",
                "permeability_rast": {
                    "accepts": [
                        "genre:DataGenreSpatialRaster",
                        "mimetype:image/geotiff"
                    ],
                    "source_type": "dataset"
                },
                "proportion": 0.3,
                "region_type": "raster",
                "dispersal_type": "dispersal",
                "population_type": "unstructured"
            }
        },
        "dataset_9bdf76e8-4954-11ef-bd65-0a580a640c2d": {
            "type": "Dataset",
            "create": "with_parent",
            "label": "package demo : greater melb template",
            "param": {},
            "outputs": [
                "greater_melb"
            ],
            "uuid": "9bdf76e8-4954-11ef-bd65-0a580a640c2d"
        },
        "dataset_dbba85a2-762a-11ef-9a27-0a580a640644": {
            "type": "Dataset",
            "create": "with_parent",
            "label": "package demo : suitability",
            "param": {},
            "outputs": [
                "suitability"
            ],
            "uuid": "dbba85a2-762a-11ef-9a27-0a580a640644"
        },
        "dataset_fb423f14-762a-11ef-82e7-0a580a640644": {
            "type": "Dataset",
            "create": "with_parent",
            "label": "package demo : capacity",
            "param": {},
            "outputs": [
                "capacity"
            ],
            "uuid": "fb423f14-762a-11ef-82e7-0a580a640644"
        },
        "bsspread": {
            "outputs": [
                "genre:DataGenreDispersalOccupancy"
            ],
            "job_request_uuid": "2be92b3b-98de-45e9-9115-f4ae32cb35da",
            "job_uuid": "2be92b3b-98de-45e9-9115-f4ae32cb35da"
        }
    }
}