"lon","lat","name","pop"
144.9,-37.8,"Melbourne",630.4
144.3,-38.2,"Geelong",766.9
143.9,-37.6,"Ballarat",400.6
144.3,-36.8,"Bendigo",212.9
142.5,-38.4,"Warrnambool",114.8
147.1,-38.1,"Sale",96.2
145.5,-36.4,"Shepparton",77.2
141.5,-38.3,"Portland",48.7
148.4,-37.7,"Orbost",39.4
146,-36.6,"Benalla",98.8
146.9,-36.1,"Albury",53.2
142.2,-36.7,"Horsham",53.6
142.2,-34.2,"Mildura",8.1
142,-37.8,"Hamilton",71.1
