{
    "user": {
        "uuid": "76c77e9b-6744-4c5b-8722-7c2cee464040"
    },
    "function": "distribute_features",
    "template": {
        "uuid": "06674a48-b62e-11ec-a6a8-0242ac120006",
        "layers": ["distribute_features_template"]
    },
    "feature": "f8d77176-b62a-11ec-b408-0242ac120006",
    "vars": ["Adelaide", "Brisbane", "Fremantle", "Melbourne", "Sydney"]
}
