"region_id","establish_pr","prevalence","benefit","sample_cost","allocation","sensitivity"
1,0.001,0.01,2e+06,12,77.7434280808583,0.542211303469604
2,0.002,0.04,1800000,14,64.0977624383828,0.926949077097626
3,0.003,0.02,1600000,16,102.330086946578,0.87347872414227
4,0.004,0.03,1400000,18,82.5459477119749,0.919079181222889
5,0.005,0.02,1200000,20,102.330086946578,0.873478724142271
