{
  "context": {
    "species_name": "Mouse-ear Hawkweed",
    "species_type": "weed",
    "surveillance_purpose": "early_detection",
    "surveillance_type": "survey",
    "surv_qty_unit": "hours",
    "cost_unit": "hours",
    "time_unit": "years",
    "dist_unit": "meters",
    "incursion_status": "never_detected",
    "area_freedom": false,
    "market_access": false,
    "market_requirement": "absence"
  },
  "method": {
    "method_name": "continuous",
    "study_type": "raster",
    "region": {
      "source_type": "dataset",
      "uuid": "09d81cb4-5a86-11ed-aa38-0a580a640f3e",
      "layers": [
        "greater_melb"
      ]
    },
    "continuous_type": "effort",
    "lambda": {
      "type": "spatial",
      "raster": {
        "source_type": "dataset",
        "uuid": "e1171b6a-69ec-11ed-8945-0a580a641244",
        "layers": [
          "efficacy"
        ]
      }
    },
    "establish_pr": {
      "raster": {
        "source_type": "dataset",
        "uuid": "8721d3ea-5a81-11ed-aa38-0a580a640f3e",
        "layers": [
          "establish_pr"
        ]
      },
      "relative": false
    },
    "prevalence": 1,
    "optimal": "cost",
    "mgmt_cost": {
      "undetected": 400,
      "detected": 40
    },
    "benefit": null,
    "alloc_cost": null,
    "fixed_cost": null,
    "constraint": "none",
    "budget": null
  },

  "_tests": [
    {
       "label": "spatial_alloc_no_budget",
       "type": "image",
       "a": "allocation.tif",
       "b": "tests/bsdesign/bsdesign_spatial_ref/spatial_alloc_no_budget.tif",
       "arg": { "SSIM_MIN": 1, "MSE_MAX": 0 }
    }
  ]
}
