{
    "is_public": true,
    "uuid": "92601270-8FCA-4C47-8E68-8BB756519A9B",
    "title": "[bsrmap_example_mehw] Biosecurity Risk Mapping - MEHW example - Land Use - Secondary (ACLUM/ABARES)",
    "description": "bsrmap_example_mehw - land_use_abares_secondary",
    "parameters": {
        "spatial": {
            "source_type": "dataset",
            "uuid": "a71d8e6c-f555-5b06-9df7-17700f0926ac",
            "layers": [
                "Land_Use_Secondary_Categories"
            ]
        },
        "binarize": true,
        "template": {
            "source_type": "dataset",
            "uuid": "9ccad5ab-d8fd-538f-b052-a7d1453c8ec8",
            "layers": [
                "template_au"
            ]
        },
        "selected": [
            12,
            13,
            21,
            22,
            31,
            32,
            33,
            34,
            35,
            41,
            42,
            43,
            44,
            45,
            46,
            51,
            52,
            11
        ],
        "categories": [
            11,
            12,
            13,
            21,
            22,
            31,
            32,
            33,
            34,
            35,
            36,
            41,
            42,
            43,
            44,
            45,
            46,
            51,
            52,
            53,
            54,
            55,
            56,
            57,
            58,
            59,
            61,
            62,
            63,
            64,
            65,
            66
        ]
    },
    "jobtype": "PROJECT",
    "functions": [
        {
            "function": "https://gitlab.com/ecocommons-australia/biosecuritycommons-platform/bsc-functions/aggregate_categories.nf",
            "parameters": {}
        }
    ],
    "metadata": {}
}