"lon","lat","name","pop"
144.9,-37.8,"Melbourne",40.5824264101265
144.3,-38.2,"Geelong",60.9225373368145
143.9,-37.6,"Ballarat",31.095551664721
144.3,-36.8,"Bendigo",24.9131825880731
142.5,-38.4,"Warrnambool",16.7212439728628
147.1,-38.1,"Sale",20.0344148349229
145.5,-36.4,"Shepparton",21.0512601892513
141.5,-38.3,"Portland",18.5184592591644
148.4,-37.7,"Orbost",10.3112667612773
146,-36.6,"Benalla",31.3129366237024
146.9,-36.1,"Albury",11.6904519445001
142.2,-36.7,"Horsham",20.7803325820888
142.2,-34.2,"Mildura",7.60190034720851
142,-37.8,"Hamilton",19.2875895619725
