{
    "is_public": true,
    "uuid": "768133c8-1ff4-4505-9915-4dd84a2ec781",
    "title": "[bsrmap_example_mehw] Biosecurity Risk Mapping - MEHW example - Abiotic Suitability",
    "description": "bsrmap_example_mehw - abiotic_suitability",
    "parameters": {
        "template": {
            "source_type": "dataset",
            "uuid": "9ccad5ab-d8fd-538f-b052-a7d1453c8ec8",
            "layers": [
                "template_au"
            ]
        },
        "normalize": false,
        "sdm_output": {
            "source_type": "resultset",
            "uuid": "59b0c282-2822-4d00-bb01-f8463daa0629",
            "layers": [
                "genre:DataGenreCP_ENVLOP"
            ]
        }
    },
    "jobtype": "PROJECT",
    "functions": [
        {
            "function": "https://gitlab.com/ecocommons-australia/biosecuritycommons-platform/bsc-functions/abiotic_suitability.nf",
            "parameters": {}
        }
    ],
    "metadata": {}
}