{
  "function": "bsdesign",
  "user": { "uuid": "6221c91c-fa77-11eb-bc01-0242ac150005" },
  "context": {
    "species_name": "Unspecified",
    "species_type": "disease",
    "surveillance_purpose": "early_detection",
    "surveillance_type": "samples",
    "surv_qty_unit": "samples",
    "cost_unit": "$",
    "time_unit": "years",
    "incursion_status": "never_detected",
    "area_freedom": false,
    "market_access": false,
    "market_requirement": null
  },
  "method": {
    "method_name": "continuous",
    "study_type": "aspatial",
    "region": {
      "url": "https://gitlab.com/api/v4/projects/ecocommons-australia%2fbiosecuritycommons-platform%2fbsc-functions/repository/files/tests%2fbsdesign%2fdemo_4%2finput%2fsample_params_contin_saving.csv/raw",
      "source_type": "external"
    },
    "continuous_type": "sampling",
    "sample_sens": {
      "csv": true,
      "type": "spatial"
    },
    "design_dens": {
      "csv": true,
      "type": "spatial"
    },
    "sample_area": 1,
    "establish_pr": {
      "csv": true,
      "relative": false
    },
    "optimal": "saving",
    "saving": {
      "csv": true
    },
    "sample_cost": [12, 14, 16, 18, 20],
    "constraint": "budget",
    "budget": 4000,
    "discrete_alloc": false
  },

 "_tests": [
    {
       "label": "design",
       "type": "csv",
       "a": "design.csv",
       "b": "tests/bsdesign/demo_4/output/contin_saving_budget/design.csv",
       "arg": {}
    },
    {
       "label": "summary",
       "type": "csv",
       "a": "summary.csv",
       "b": "tests/bsdesign/demo_4/output/contin_saving_budget/summary.csv",
       "arg": {}
    },
    {
       "label": "system_sens",
       "type": "csv",
       "a": "system_sens.csv",
       "b": "tests/bsdesign/demo_4/output/contin_saving_budget/system_sens.csv",
       "arg": {}
    }
  ]
 
}
