<?xml version="1.0" encoding="utf-8"?>
<!-- Generator: Adobe Illustrator 16.0.0, SVG Export Plug-In . SVG Version: 6.00 Build 0)  -->
<!DOCTYPE svg PUBLIC "-//W3C//DTD SVG 1.1//EN" "http://www.w3.org/Graphics/SVG/1.1/DTD/svg11.dtd">
<svg version="1.1" id="Capa_1" xmlns="http://www.w3.org/2000/svg" xmlns:xlink="http://www.w3.org/1999/xlink" x="0px" y="0px"
	 width="200.011px" height="207.511px" viewBox="0 0 200.011 207.511" enable-background="new 0 0 200.011 207.511"
	 xml:space="preserve">
<g>
	<g>
		<path fill="#159AAA" d="M100.36,206.626c-55.184,0-100.081-44.896-100.081-100.083C0.279,51.355,45.176,6.462,100.36,6.462
			c55.186,0,100.083,44.894,100.083,100.081C200.443,161.73,155.545,206.626,100.36,206.626z M100.36,21.289
			c-47.008,0-85.255,38.246-85.255,85.253c0,47.015,38.247,85.257,85.255,85.257c47.01,0,85.255-38.242,85.255-85.257
			C185.615,59.535,147.37,21.289,100.36,21.289z"/>
		<circle fill="#FFFFFF" cx="100.359" cy="99.13" r="92.668"/>
		<path fill="#00B2BE" d="M100.36,199.211c-55.184,0-100.081-44.894-100.081-100.081C0.279,43.942,45.176-0.953,100.36-0.953
			c55.186,0,100.083,44.895,100.083,100.083C200.443,154.318,155.545,199.211,100.36,199.211z M100.36,13.874
			c-47.008,0-85.255,38.249-85.255,85.256c0,47.013,38.247,85.254,85.255,85.254c47.01,0,85.255-38.241,85.255-85.254
			C185.615,52.123,147.37,13.874,100.36,13.874z"/>
	</g>
	<g>
		<defs>
			<path id="SVGID_7_" d="M187.468,98.201c0,47.599-38.583,86.183-86.182,86.183S15.105,145.8,15.105,98.201
				c0-47.594,38.583-86.184,86.182-86.184S187.468,50.607,187.468,98.201z"/>
		</defs>
		<clipPath id="SVGID_2_">
			<use xlink:href="#SVGID_7_"  overflow="visible"/>
		</clipPath>
		<g clip-path="url(#SVGID_2_)">
			<g>
				<path fill="#432918" d="M93.677,70.797c0,0-6.385-12.578-19.317-12.514c-12.334,0.06-38.936,9.075-22.024,58.508l1.21-3.441
					c0,0,5.846,7.352,3.656,19.085c-2.19,11.732-8.917,9.286-8.917,9.286s11.473,8.452,18.33-4.406c0,0,1.605,2.745,0.946,4.406
					c0,0,13.263-1.934,10.604-19.767c0,0-0.587-20.825-0.587-32.559C77.578,77.663,93.677,70.797,93.677,70.797z"/>
				<path fill="#683C11" d="M60.98,113.853c0,0-15.441-16.524-11.106-33.321c4.333-16.793,22.484-21.669,22.484-21.669
					s-9.753,10.653-13.364,22.753C55.382,93.716,60.98,113.853,60.98,113.853z"/>
				<path fill="#683C11" d="M74.885,119.001c0,0,4.515,16.434-5.78,21.309c0,0,1.627-3.43-1.443-5.598
					C72.538,130.739,74.885,119.001,74.885,119.001z"/>
			</g>
			<path fill="#432918" d="M127.395,63.083c-8.972-10.712-22.686-13.219-27.28-11.69c-2.001,0.668-2.839,2.155-3.147,3.618
				c0.524,0.218,0.816,0.368,0.816,0.368c3.39,1.014,6.294,2.395,8.19,3.414c-0.047-0.155-0.097-0.305-0.152-0.44
				c0,0,13.5,5.15,17.677,12.527c0,0,0.661,1.969,1.349,5.066c0.609,2.739,1.238,6.362,1.449,10.293
				C126.686,93.448,137.524,75.179,127.395,63.083z"/>
			<path opacity="0.3" fill="#7D4E24" d="M111.726,53.46c0,0-14.704-2.034-9.94,1.576c4.764,3.61,22.333,6.827,24.886,21.547
				c2.55,14.723,4.257,2.774,4.257,0.854C130.928,75.518,128.367,57.75,111.726,53.46z"/>
			<path fill="#432918" d="M91.208,84.798c2.228-1.253,7.933-2.365,11.414-9.048c0.137-0.264,0.271-0.532,0.4-0.801
				c0.935-1.921,1.666-3.905,2.204-5.821c1.188-4.244,1.414-8.153,0.749-10.335c-1.229-0.659-2.886-1.474-4.821-2.241
				c-1.049-0.415-2.179-0.817-3.37-1.173c0,0-0.292-0.15-0.816-0.368c-4.165-1.711-29.275-0.844-31.09,29.09
				c-1.5,24.74,27.183,28.05,27.052,26.645c-5.443-3.635-8.402-8.689-8.402-8.689s-3.202-4.456-1.253-9.188
				C85.223,88.136,88.982,86.051,91.208,84.798z"/>
			<path fill="#F6B580" d="M94.228,85.724c18.586-6.331,13.075-26.755,13.074-26.758c-0.922-0.398-1.48-0.613-1.48-0.613
				c0.055,0.135,0.105,0.285,0.152,0.44c0.665,2.183,0.438,6.091-0.749,10.335c-0.538,1.916-1.269,3.9-2.204,5.821
				c-0.129,0.269-0.263,0.537-0.4,0.801c-3.481,6.683-9.186,7.794-11.414,9.048c-2.226,1.253-5.985,3.338-7.933,8.071
				c-1.949,4.732,1.253,9.188,1.253,9.188s2.959,5.054,8.402,8.689c3.089,2.063,6.982,3.665,11.587,3.623
				c-0.571-0.191-1.514-0.359-2.962-0.486C93.222,113.146,75.643,92.052,94.228,85.724z"/>
			<path fill="#FACB99" d="M124.848,75.947c-0.688-3.098-1.349-5.066-1.349-5.066c-3.329-5.88-12.578-10.342-16.197-11.915
				c0.001,0.002,5.512,20.427-13.074,26.758c-18.066,6.152-1.958,26.258,6.608,28.047c0.245,0.053,0.486,0.091,0.719,0.112
				c1.448,0.127,2.391,0.295,2.962,0.486c1.136-0.01,2.312-0.118,3.532-0.344c0.148-0.028,0.291-0.059,0.437-0.089
				c5.451-1.103,9.337-3.442,12.061-6.497c1.258-1.409,2.264-2.97,3.065-4.628c0.276-0.572,0.529-1.155,0.759-1.748
				c0.714-1.851,1.205-3.794,1.521-5.766c0.043-0.274,0.078-0.55,0.115-0.826C126.938,87.618,125.87,80.54,124.848,75.947z"/>
			<path opacity="0.3" fill="#7D4E24" d="M102.872,61.438c0,0-12.375-11.095-23.789-2.24c-11.414,8.853-9.281,28.511-0.746,26.362
				c8.534-2.148,18.863-2.953,22.499-9.538C104.473,69.438,105.005,65.811,102.872,61.438z"/>
			<path opacity="0.6" fill="#7D4E24" d="M73.429,75.501c0,0,0.565-21.424,23.058-18.01c22.493,3.414,0.481-0.369,0.481-0.369
				s-16.498,0.397-21.085,20.865L73.429,75.501z"/>
			<path opacity="0.3" fill="#7D4E24" d="M86.019,107.727c-21.011-3.791-17.378-24.33-17.378-24.33s4.265,16.273,16.192,19.134
				L86.019,107.727z"/>
			<path fill="#FACA98" d="M115.956,130.871c0,0,1.078,12.024,1.482,13.399c0.404,1.375,12.066,4.731,12.066,4.731l-2.868,3.861
				c0,0-4.633-1.986-9.036-3.582c-2.648-0.961-4.053-6.681-5.092-13.494c-1.137-7.46-0.188-4.513-0.188-4.513L115.956,130.871z"/>
			<path fill="#1A1A1A" d="M116.452,101.645c0,0-8.395,5.279-15.33-0.085C101.122,101.56,109.777,116.173,116.452,101.645z"/>
			<path fill="#332112" d="M83.013,79.026c0,0,3.076-3.965,10.797-4.294c0,0,3.831,0.884,4.391,0.206
				c0.56-0.678-0.988-1.889-4.518-1.921C90.154,72.985,85.337,75.646,83.013,79.026z"/>
			<path fill="#452B13" d="M125.736,77.987c0,0-2.713-3.352-9.348-3.496c0,0-3.273,0.831-3.766,0.258
				c-0.493-0.573,0.813-1.639,3.844-1.731C119.497,72.927,123.68,75.126,125.736,77.987z"/>
			<path fill="#452B13" d="M127.083,83.65c-0.405,0.318-0.788,0.569-1.175,0.772c0.078-0.247,0.082-0.511-0.028-0.779
				c-0.049-0.12-0.224-0.177-0.296-0.04c-0.348,0.674-0.946,1.178-1.7,1.266c0.121-0.139,0.232-0.29,0.335-0.44
				c0.159-0.229,0.21-0.511,0.279-0.698c0.065-0.173-0.171-0.278-0.29-0.17c-0.027,0.024-0.038,0.039-0.044,0.047
				c-0.007,0.001-0.015,0.002-0.029,0.006c-0.083,0.022-0.166,0.099-0.231,0.153c-0.212,0.171-0.404,0.368-0.597,0.561
				c-0.29,0.286-0.668,0.69-1.104,0.526c-0.17-0.064-0.301,0.006-0.378,0.121c-0.956-0.062-1.901-0.128-2.87-0.015
				c-1.204,0.14-4.027,0.571-3.411,2.423c0.088,0.265,0.534,0.322,0.591,0c0.373-2.084,4.505-1.56,6.004-1.439
				c1.935,0.153,4.613,0.174,5.348-2.058C127.575,83.63,127.256,83.515,127.083,83.65z"/>
			<path fill="#452B13" d="M84.152,91.649c0.497,0.134,0.947,0.214,1.381,0.25c-0.166-0.194-0.273-0.436-0.278-0.728
				c-0.001-0.129,0.138-0.25,0.256-0.15c0.585,0.483,1.332,0.713,2.061,0.501c-0.166-0.083-0.327-0.176-0.481-0.274
				c-0.235-0.148-0.393-0.39-0.531-0.535c-0.128-0.134,0.05-0.322,0.201-0.269c0.035,0.012,0.051,0.021,0.059,0.025
				c0.008-0.001,0.016-0.003,0.031-0.004c0.085-0.013,0.19,0.024,0.272,0.048c0.263,0.077,0.516,0.182,0.769,0.284
				c0.378,0.15,0.886,0.374,1.221,0.054c0.131-0.125,0.281-0.113,0.396-0.038c0.854-0.43,1.7-0.859,2.635-1.135
				c1.163-0.339,3.929-1.048,4.087,0.9c0.022,0.278-0.368,0.503-0.545,0.231c-1.157-1.774-4.757,0.325-6.087,1.02
				c-1.723,0.898-4.183,1.962-5.728,0.196C83.693,91.823,83.939,91.591,84.152,91.649z"/>
			<path fill="#BE1639" d="M116.355,101.73c0,0-2.444,5.82-6.623,6.237c-4.181,0.419-8.451-6.237-8.451-6.237
				s2.76,7.678,8.354,7.359C115.23,108.768,116.355,101.73,116.355,101.73z"/>
			<path fill="#24484D" d="M103.746,173.822c-0.005,0.001-0.009,0.001-0.014,0.002c-0.053,0.016-0.107,0.062-0.119,0.12
				c-0.042,0.202-0.012,0.456,0.205,0.533c0.045,0.016,0.1-0.002,0.132-0.035C104.092,174.303,104.015,173.743,103.746,173.822z"/>
			<path fill="#24484D" d="M103.986,174.842c-0.057-0.079-0.157-0.083-0.212,0c-0.142,0.204-0.193,0.613,0.018,0.784
				c0.072,0.058,0.157,0.063,0.228,0C104.237,175.44,104.136,175.042,103.986,174.842z"/>
			<path fill="#24484D" d="M116.272,170.187c0,0.01,0.001,0.019,0.003,0.029C116.273,170.206,116.272,170.196,116.272,170.187z"/>
			<path fill="#24484D" d="M116.309,170.563c0.003,0.042,0.007,0.083,0.012,0.126C116.316,170.646,116.312,170.606,116.309,170.563z
				"/>
			<path fill="#24484D" d="M89.767,168.994c0.002,0.189,0.003,0.38,0.006,0.575C89.77,169.374,89.769,169.183,89.767,168.994
				L89.767,168.994z"/>
			<path fill="#24484D" d="M89.779,170.042c-0.001-0.158-0.004-0.317-0.006-0.474C89.775,169.725,89.778,169.884,89.779,170.042z"/>
			<path fill="#24484D" d="M116.352,171.047c0.003,0.036,0.006,0.074,0.01,0.108C116.358,171.121,116.355,171.083,116.352,171.047z"
				/>
			<path fill="#24484D" d="M89.878,163.705c0.001-0.031,0.004-0.062,0.008-0.093C89.883,163.643,89.88,163.674,89.878,163.705z"/>
			<path fill="#24484D" d="M89.856,163.968c0.002-0.036,0.005-0.069,0.008-0.104C89.861,163.899,89.858,163.932,89.856,163.968z"/>
			<path fill="#24484D" d="M89.765,166.844c0.001-0.093,0.002-0.186,0.002-0.277C89.767,166.659,89.766,166.751,89.765,166.844z"/>
			<path fill="#24484D" d="M89.768,166.46c0.002-0.165,0.004-0.326,0.008-0.484C89.772,166.134,89.77,166.295,89.768,166.46z"/>
			<path fill="#24484D" d="M89.779,165.793c0.002-0.066,0.003-0.13,0.005-0.196C89.782,165.663,89.781,165.727,89.779,165.793z"/>
			<path fill="#24484D" d="M89.8,165.039c0.003-0.054,0.004-0.109,0.006-0.161C89.805,164.93,89.803,164.984,89.8,165.039z"/>
			<path fill="#24484D" d="M89.815,164.661c0.002-0.035,0.003-0.074,0.004-0.11C89.818,164.587,89.817,164.626,89.815,164.661z"/>
			<path fill="#24484D" d="M89.837,164.254c0.002-0.034,0.004-0.064,0.006-0.099C89.841,164.19,89.839,164.22,89.837,164.254z"/>
			<path fill="#24484D" d="M89.789,165.408c0.001-0.06,0.003-0.119,0.005-0.179C89.792,165.289,89.79,165.348,89.789,165.408z"/>
			<path fill="#24484D" d="M89.764,166.991c-0.001,0.032-0.001,0.064-0.001,0.098l0,0C89.762,167.057,89.762,167.022,89.764,166.991
				z"/>
			<path fill="#24484D" d="M89.761,167.75c0-0.109,0-0.22,0-0.327C89.761,167.531,89.761,167.641,89.761,167.75z"/>
			<path fill="#24484D" d="M115.862,166.71c0.012,0.075,0.022,0.151,0.034,0.228C115.884,166.862,115.874,166.785,115.862,166.71z"
				/>
			<path fill="#24484D" d="M115.794,166.261c0.017,0.108,0.035,0.217,0.051,0.33C115.829,166.478,115.811,166.369,115.794,166.261z"
				/>
			<path fill="#24484D" d="M115.917,167.087c0.01,0.074,0.02,0.15,0.03,0.226C115.937,167.238,115.927,167.161,115.917,167.087z"/>
			<path fill="#24484D" d="M116.139,168.899c0.007,0.062,0.014,0.129,0.021,0.193C116.153,169.028,116.146,168.963,116.139,168.899z
				"/>
			<path fill="#24484D" d="M116.032,167.975c0.01,0.087,0.021,0.173,0.032,0.264C116.053,168.148,116.042,168.062,116.032,167.975z"
				/>
			<path fill="#24484D" d="M116.187,169.351c0.007,0.05,0.012,0.104,0.017,0.153C116.199,169.455,116.194,169.401,116.187,169.351z"
				/>
			<path fill="#24484D" d="M116.09,168.463c0.008,0.064,0.014,0.129,0.023,0.194C116.104,168.592,116.098,168.527,116.09,168.463z"
				/>
			<path fill="#24484D" d="M115.968,167.468c0.012,0.086,0.023,0.177,0.035,0.266C115.991,167.645,115.98,167.555,115.968,167.468z"
				/>
			<path fill="#24484D" d="M114.335,163.422c0.061,0.059,0.121,0.121,0.181,0.185C114.456,163.542,114.395,163.48,114.335,163.422z"
				/>
			<path fill="#24484D" d="M113.345,162.663c0.313,0.193,0.599,0.406,0.855,0.638C113.944,163.068,113.658,162.855,113.345,162.663z
				"/>
			<path fill="#24484D" d="M115.29,164.695c0.024,0.051,0.046,0.1,0.071,0.151C115.336,164.795,115.314,164.747,115.29,164.695z"/>
			<path fill="#24484D" d="M115.646,165.616c0.016,0.05,0.031,0.1,0.044,0.152C115.677,165.716,115.662,165.667,115.646,165.616z"/>
			<path fill="#24484D" d="M114.659,163.767c0.051,0.059,0.103,0.119,0.151,0.18C114.761,163.886,114.71,163.826,114.659,163.767z"
				/>
			<path fill="#24484D" d="M115.485,165.134c0.022,0.053,0.042,0.109,0.061,0.165C115.527,165.243,115.507,165.187,115.485,165.134z
				"/>
			<path fill="#24484D" d="M114.967,164.166c0.034,0.049,0.071,0.097,0.105,0.148C115.038,164.262,115.001,164.215,114.967,164.166z
				"/>
			<path fill="#24484D" d="M89.762,167.089c-0.001,0.066-0.001,0.131-0.001,0.2C89.761,167.22,89.761,167.155,89.762,167.089
				L89.762,167.089z"/>
			<path fill="#24484D" d="M89.761,167.838c0,0.371,0.003,0.757,0.006,1.156l0,0C89.764,168.595,89.761,168.209,89.761,167.838z"/>
			<path fill="#152D3D" d="M116.272,170.187c-0.017-0.177-0.035-0.349-0.051-0.521l0,0
				C116.237,169.838,116.255,170.01,116.272,170.187z"/>
			<path fill="#152D3D" d="M116.32,170.69c0.011,0.119,0.021,0.237,0.032,0.357C116.342,170.927,116.331,170.809,116.32,170.69z"/>
			<path fill="#152D3D" d="M116.623,174.448c-0.083-1.165-0.17-2.268-0.261-3.293C116.453,172.179,116.54,173.283,116.623,174.448
				L116.623,174.448z"/>
			<path fill="#152D3D" d="M116.275,170.215c0.011,0.115,0.021,0.233,0.033,0.348C116.296,170.448,116.286,170.331,116.275,170.215z
				"/>
			<path fill="#152D3D" d="M115.69,165.768c0.04,0.16,0.077,0.324,0.104,0.493C115.767,166.092,115.73,165.928,115.69,165.768z"/>
			<path fill="#152D3D" d="M115.845,166.591c0.006,0.039,0.013,0.081,0.017,0.12C115.858,166.671,115.851,166.63,115.845,166.591z"
				/>
			<path fill="#152D3D" d="M115.896,166.938c0.008,0.05,0.014,0.098,0.021,0.149C115.91,167.036,115.904,166.988,115.896,166.938z"
				/>
			<path fill="#152D3D" d="M115.947,167.313c0.007,0.05,0.014,0.102,0.021,0.155C115.961,167.415,115.955,167.363,115.947,167.313z"
				/>
			<path fill="#152D3D" d="M115.546,165.299c0.036,0.104,0.071,0.211,0.1,0.317C115.617,165.51,115.582,165.403,115.546,165.299z"/>
			<path fill="#152D3D" d="M115.072,164.314c0.078,0.124,0.148,0.25,0.217,0.381C115.221,164.563,115.15,164.438,115.072,164.314z"
				/>
			<path fill="#152D3D" d="M115.36,164.847c0.043,0.094,0.086,0.188,0.125,0.287C115.446,165.035,115.403,164.94,115.36,164.847z"/>
			<path fill="#152D3D" d="M114.516,163.606c0.049,0.052,0.097,0.105,0.143,0.16C114.612,163.711,114.565,163.658,114.516,163.606z"
				/>
			<path fill="#152D3D" d="M114.201,163.3c0.044,0.04,0.089,0.08,0.134,0.122C114.29,163.38,114.245,163.34,114.201,163.3z"/>
			<path fill="#152D3D" d="M116.221,169.666L116.221,169.666c-0.005-0.052-0.012-0.106-0.017-0.163
				C116.209,169.559,116.215,169.614,116.221,169.666z"/>
			<path fill="#152D3D" d="M116.113,168.658c0.008,0.081,0.017,0.16,0.026,0.242C116.13,168.818,116.122,168.739,116.113,168.658z"
				/>
			<path fill="#152D3D" d="M116.161,169.092c0.009,0.084,0.018,0.17,0.026,0.258C116.178,169.263,116.17,169.176,116.161,169.092z"
				/>
			<polygon fill="#152D3D" points="111.068,161.675 111.068,161.675 111.074,161.678 			"/>
			<path fill="#152D3D" d="M114.81,163.947c0.055,0.071,0.106,0.146,0.158,0.219C114.916,164.092,114.864,164.018,114.81,163.947z"
				/>
			<path fill="#152D3D" d="M116.003,167.734c0.01,0.08,0.019,0.159,0.029,0.24C116.022,167.894,116.013,167.814,116.003,167.734z"/>
			<path fill="#152D3D" d="M116.064,168.239c0.008,0.072,0.017,0.149,0.026,0.225C116.081,168.388,116.072,168.311,116.064,168.239z
				"/>
			<path fill="#152D3D" d="M113.568,170.295c0.639,1.46,1.464,2.811,2.711,3.881c0.115,0.099,0.229,0.187,0.344,0.271
				c-0.083-1.164-0.17-2.269-0.261-3.292c-0.004-0.034-0.007-0.072-0.01-0.108c-0.01-0.121-0.021-0.238-0.032-0.357
				c-0.004-0.043-0.008-0.084-0.012-0.126c-0.012-0.115-0.022-0.233-0.033-0.348c-0.002-0.01-0.003-0.019-0.003-0.029
				c-0.017-0.177-0.035-0.349-0.051-0.521C115.338,169.91,114.453,170.12,113.568,170.295z"/>
			<path fill="#152D3D" d="M89.779,170.046v-0.003V170.046z"/>
			<path fill="#152D3D" d="M89.773,169.569L89.773,169.569L89.773,169.569z"/>
			<path fill="#152D3D" d="M89.82,164.551c0.006-0.103,0.01-0.202,0.017-0.297C89.83,164.349,89.826,164.448,89.82,164.551z"/>
			<path fill="#152D3D" d="M89.764,166.991c0-0.049,0-0.098,0.001-0.146C89.764,166.893,89.764,166.942,89.764,166.991z"/>
			<path fill="#152D3D" d="M89.806,164.878c0.003-0.075,0.007-0.146,0.009-0.217C89.813,164.732,89.809,164.803,89.806,164.878z"/>
			<path fill="#152D3D" d="M89.776,165.976c0.002-0.062,0.002-0.124,0.003-0.183C89.778,165.852,89.778,165.915,89.776,165.976z"/>
			<path fill="#152D3D" d="M89.784,165.597c0.001-0.064,0.002-0.128,0.004-0.189C89.787,165.469,89.785,165.533,89.784,165.597z"/>
			<path fill="#152D3D" d="M89.794,165.229c0.002-0.065,0.004-0.129,0.006-0.19C89.798,165.1,89.796,165.164,89.794,165.229z"/>
			<path fill="#152D3D" d="M89.843,164.155c0.003-0.063,0.008-0.125,0.013-0.187C89.852,164.03,89.847,164.092,89.843,164.155z"/>
			<path fill="#152D3D" d="M89.767,166.567c0-0.037,0-0.07,0.001-0.107C89.767,166.497,89.767,166.531,89.767,166.567z"/>
			<path fill="#152D3D" d="M89.886,163.612c0.005-0.053,0.011-0.103,0.016-0.154C89.897,163.51,89.891,163.56,89.886,163.612z"/>
			<path fill="#152D3D" d="M89.864,163.864c0.004-0.055,0.008-0.106,0.014-0.159C89.873,163.758,89.868,163.81,89.864,163.864z"/>
			<path fill="#152D3D" d="M89.761,167.423c0-0.047,0-0.09,0-0.134C89.761,167.333,89.761,167.376,89.761,167.423z"/>
			<path fill="#152D3D" d="M89.761,167.838c0-0.029,0-0.058,0-0.087C89.761,167.78,89.761,167.809,89.761,167.838z"/>
			<path fill="#152D3D" d="M96.203,172.08c0.348-0.479,0.657-0.997,0.93-1.535c-2.898-0.416-5.426-1-7.366-1.551
				c0.002,0.189,0.003,0.38,0.006,0.575l0,0c0.002,0.156,0.005,0.315,0.006,0.474v0.003c0.027,1.916,0.086,4.054,0.165,6.222
				C92.542,176.066,94.699,174.146,96.203,172.08z"/>
			<path fill="#24484D" d="M103.727,172.097c0.116-0.134,0.117-0.365,0.041-0.525c-0.051-0.106-0.115-0.173-0.197-0.179
				c0,0,0,0,0-0.004c-0.001,0.002-0.003,0.003-0.005,0.003c-0.002,0-0.003-0.001-0.005-0.001c-0.022,0-0.037,0.009-0.047,0.023
				c-0.18,0.104-0.063,0.572,0.042,0.683C103.598,172.144,103.685,172.146,103.727,172.097z"/>
			<path fill="#24484D" d="M106.574,171.962c0.088-0.204,0.003-0.353-0.081-0.545c-0.03-0.07-0.122-0.038-0.143,0.018
				c-0.073,0.2-0.104,0.382,0.051,0.55C106.445,172.031,106.547,172.025,106.574,171.962z"/>
			<path fill="#24484D" d="M106.55,173.747c-0.034-0.052-0.108-0.054-0.143,0c-0.129,0.205-0.148,0.536-0.004,0.738
				c0.052,0.075,0.154,0.079,0.205,0C106.748,174.275,106.686,173.947,106.55,173.747z"/>
			<path fill="#24484D" d="M106.701,175.115c-0.03-0.105-0.14-0.307-0.285-0.215c-0.231,0.146-0.26,0.646-0.073,0.828
				c0.064,0.061,0.154,0.053,0.218,0C106.707,175.6,106.756,175.3,106.701,175.115z"/>
			<g opacity="0.7">
				<path fill="#F2957E" d="M98.529,93.777c0,0,3.094,2.861-0.121,3.952c-3.216,1.089-4.094,1.084-5.805,2.322
					c-1.709,1.243-4.968-1.457-3.747-3.232C90.076,95.042,93.859,91.354,98.529,93.777z"/>
			</g>
			<g opacity="0.6">
				<path fill="#F2957E" d="M124.843,90.895c0,0,1.27,3.551-1.768,3.049c-3.039-0.505-3.74-0.881-5.634-0.629
					c-1.896,0.252-3.363-3.243-1.635-4.121C117.535,88.315,122.127,87.019,124.843,90.895z"/>
			</g>
			<path fill="#F6B580" d="M109.153,92.73c0,0-2.345,2.906-1.442,3.942c0.902,1.037,3.896,0.274,3.316-1.435
				C110.446,93.527,109.153,92.73,109.153,92.73z"/>
			<path fill="#9F621C" d="M110.936,94.804c-0.359-1.42-1.347-2.631-1.973-3.933c-0.574-1.199-0.845-2.492-0.917-3.812
				c-0.057-1.019,0.014-2.009-0.249-3.005c-0.053-0.201-0.314-0.135-0.337,0.046c-0.329,2.532-0.293,4.857,0.721,7.228
				c0.429,1.004,1.073,1.89,1.538,2.874c0.25,0.53,0.409,1.098,0.442,1.682c0.085,1.415-1.639,0.896-2.327,0.536
				c-0.388-0.206-0.847,0.32-0.486,0.63c0.835,0.723,1.944,0.959,2.955,0.464C111.29,97.031,111.15,95.654,110.936,94.804z"/>
			<path fill="#FACB99" d="M100.594,118.884c-0.058,0.218-0.138,0.947-0.138,0.947c1.25,0.455,5.487,0.757,7.61-0.682l0.151-1.878
				l0.098-1.213C107.559,116.311,101.084,118.571,100.594,118.884z"/>
			<path fill="#F6B580" d="M108.049,114.025c-1.221,0.227-2.396,0.334-3.532,0.344c-0.571-0.191-1.514-0.359-2.962-0.486
				c-0.232-0.021-0.474-0.06-0.719-0.112c0,0-0.158,4.797-0.242,5.114c0.49-0.313,6.964-2.574,7.721-2.826l0.171-2.123
				C108.34,113.966,108.197,113.997,108.049,114.025z"/>
			<path fill="#9F621C" d="M91.099,109.136c0,0,0.537,0.578,1.639,1.386c1.094,0.809,2.778,1.826,4.971,2.6
				c1.093,0.388,2.315,0.702,3.63,0.888c1.313,0.188,2.715,0.257,4.157,0.173c1.443-0.083,2.929-0.314,4.402-0.686
				c1.471-0.368,2.932-0.898,4.317-1.577c1.389-0.67,2.712-1.487,3.897-2.444c1.187-0.954,2.26-2.02,3.161-3.162
				c0.902-1.145,1.669-2.334,2.284-3.525c0.617-1.191,1.086-2.376,1.443-3.493c0.352-1.121,0.618-2.167,0.784-3.11
				c0.1-0.468,0.148-0.915,0.216-1.323c0.047-0.412,0.091-0.792,0.13-1.133c0.026-0.342,0.05-0.65,0.069-0.916
				c0.023-0.267,0.024-0.495,0.035-0.679c0.015-0.368,0.024-0.566,0.024-0.566s0,0.198,0.001,0.566
				c0.007,0.37-0.008,0.913-0.04,1.603c-0.029,0.344-0.059,0.726-0.092,1.14c-0.056,0.412-0.089,0.862-0.174,1.337
				c-0.137,0.954-0.366,2.021-0.704,3.159c-0.338,1.137-0.791,2.348-1.393,3.569c-0.602,1.221-1.349,2.458-2.268,3.625
				c-0.912,1.171-2,2.268-3.205,3.25c-1.205,0.987-2.55,1.833-3.966,2.526c-1.418,0.693-2.909,1.217-4.416,1.583
				c-1.502,0.369-3.012,0.594-4.482,0.667c-0.368,0.029-0.734,0.019-1.095,0.028c-0.362-0.004-0.72-0.013-1.074-0.031
				c-0.708-0.052-1.399-0.118-2.063-0.235c-1.332-0.218-2.567-0.563-3.667-0.981c-0.553-0.202-1.068-0.433-1.554-0.661
				c-0.48-0.239-0.931-0.476-1.341-0.723c-0.824-0.484-1.504-0.969-2.042-1.396c-0.54-0.422-0.935-0.792-1.195-1.05
				C91.225,109.285,91.099,109.136,91.099,109.136z"/>
			<path fill="none" d="M103.571,171.394c0,0,0,0,0-0.004c-0.001,0.002-0.003,0.003-0.005,0.003c-0.002,0-0.003-0.001-0.005-0.001
				c-0.022,0-0.037,0.009-0.047,0.023c-0.18,0.104-0.063,0.572,0.042,0.683c0.042,0.046,0.129,0.049,0.172,0
				c0.116-0.134,0.117-0.365,0.041-0.525C103.717,171.466,103.652,171.399,103.571,171.394z"/>
			<path fill="none" d="M106.351,171.435c-0.073,0.2-0.104,0.382,0.051,0.55c0.043,0.046,0.145,0.041,0.172-0.022
				c0.088-0.204,0.003-0.353-0.081-0.545C106.464,171.347,106.372,171.379,106.351,171.435z"/>
			<path fill="#24484D" d="M89.944,176.268c0,0,0.001,0,0.001,0c-0.005-0.133-0.011-0.265-0.015-0.397
				C89.935,176.004,89.939,176.135,89.944,176.268z"/>
			<path fill="none" d="M103.571,171.394c0,0,0,0,0-0.004c-0.001,0.002-0.003,0.003-0.005,0.003c-0.002,0-0.003-0.001-0.005-0.001
				c-0.022,0-0.037,0.009-0.047,0.023c-0.18,0.104-0.063,0.572,0.042,0.683c0.042,0.046,0.129,0.049,0.172,0
				c0.116-0.134,0.117-0.365,0.041-0.525C103.717,171.466,103.652,171.399,103.571,171.394z"/>
			<path fill="none" d="M106.351,171.435c-0.073,0.2-0.104,0.382,0.051,0.55c0.043,0.046,0.145,0.041,0.172-0.022
				c0.088-0.204,0.003-0.353-0.081-0.545C106.464,171.347,106.372,171.379,106.351,171.435z"/>
			<g>
				<path fill="#159A8A" d="M116.623,174.447c-0.115-0.084-0.229-0.172-0.344-0.271c-0.557-0.479-1.026-1.015-1.436-1.589
					l-0.643,0.41l0.55,68.229h1.376c0.097-3.456,0.82-33.756,1.122-42.644C117.47,192.017,117.156,182.001,116.623,174.447z"/>
				<path fill="#21B1A2" d="M114.751,241.227l-0.55-68.229l0.643-0.41c-0.508-0.713-0.922-1.486-1.275-2.292
					c-5.824,1.16-11.636,0.937-16.436,0.25c-0.272,0.539-0.582,1.056-0.93,1.535c-1.504,2.066-3.66,3.986-6.258,4.188
					c0.045,1.246,0.096,2.499,0.152,3.73c0.325,6.948,2.91,35.23,3.395,42.178c0.484,6.95,0.322,19.924,0.322,19.924
					s3.557,1.454,5.658-0.162c0,0,0-0.605,0.005-1.618l-1.996,0.973l1.429-66.138l1.536-1.737l3.327,1.424L103.372,176
					c1.537,0.262,3.514,0.409,4.827-0.204c0,0,2.909,39.479,1.778,66.303c0,0,4.04,1.133,6.14-0.485c0,0,0.004-0.137,0.011-0.389
					H114.751z"/>
				<path fill="#159A8A" d="M100.447,173.418l-1.536,1.737l-1.429,66.138l1.996-0.973c0.021-3.919,0.126-18.496,0.64-22.991
					c0.646-5.656,0.324-22.462,0.646-31.19c0.323-8.727,0.323-10.666,0.323-10.666s0.984,0.304,2.284,0.527l0.402-1.159
					L100.447,173.418z"/>
				<g>
					<path fill="#159A8A" d="M103.372,174.917c-1.3-0.222-2.284-0.527-2.284-0.527s0,0.858-0.095,3.994l-10.305,8.963
						c-0.115-1.46-0.218-2.813-0.307-4.025l15.294-13.3c1.76-0.027,3.565-0.151,5.387-0.396l-6.292,5.471
						C104.286,175.057,103.811,174.991,103.372,174.917z"/>
					<path fill="#159A8A" d="M100.588,197.44l-8.446,7.345c-0.113-1.316-0.227-2.653-0.341-3.995l8.815-7.666
						C100.604,194.53,100.594,195.979,100.588,197.44z"/>
					<path fill="#159A8A" d="M108.909,185.913l8.044-6.996c0.066,1.358,0.127,2.743,0.178,4.134l-7.999,6.957
						C109.058,188.563,108.983,187.194,108.909,185.913z"/>
					<path fill="#159A8A" d="M109.758,203.875l7.494-6.515c-0.001,0.046-0.002,0.093-0.003,0.139
						c-0.038,1.116-0.083,2.572-0.132,4.27l-7.213,6.273C109.859,206.635,109.811,205.243,109.758,203.875z"/>
				</g>
			</g>
			<path opacity="0.6" fill="#7D4E24" d="M74.88,79.661c0,0-4.707,12.381,0.495,20.27c0,0,3.873,4.98,3.873,2.325
				c0-2.655-5.618-16.25,1.186-20.454C80.434,81.803,79.001,75.294,74.88,79.661z"/>
			<g>
				<path fill="#D3D3D5" d="M150.705,252.532c0.141,0.805-0.268,1.598-0.913,1.773l0,0c-0.645,0.175-1.282-0.333-1.423-1.138
					L127.883,134.26c-0.141-0.803,0.268-1.597,0.913-1.772l0,0c0.645-0.175,1.282,0.333,1.422,1.138L150.705,252.532z"/>
				<path fill="#FACA98" d="M140.637,150.971c-0.074-0.161-0.203-0.348-0.37-0.547c-0.896-1.06-4.232-1.469-6.529-2.071
					c-2.01-0.525-6.412,0-6.412,0s-1.9,2.279-0.787,4.51c0.846,0.496,1.802,0.98,2.178,2.137c0.552,1.694,1.044,2.922,1.802,3.019
					c0.158,0.018,0.295,0.015,0.417,0c0.918-0.127,0.452-1.311,0.168-2.012c-0.319-0.792,1.373-1.287,2.004-1.479
					c0.389-0.053,1.167,0.223,1.392,0.491c0.21,0.25,0.308,0.599,0.208,0.98c-0.206,0.792,0.627,1.736,1.746,1.497
					c1.369-0.289,0.992-2.08,0.992-2.08c2.461,0.512,1.937-1.759,1.937-1.759c0.489-0.064,0.838-0.204,1.083-0.394
					C141.178,152.711,140.989,151.739,140.637,150.971z"/>
				<path fill="#9F621C" d="M136.744,152.866c0,0,0.051,0.161,0.135,0.394c0.083,0.234,0.192,0.54,0.285,0.847
					c0.048,0.155,0.086,0.311,0.122,0.456c0.013,0.074,0.033,0.144,0.043,0.213c0.011,0.068,0.022,0.133,0.032,0.193
					c0.012,0.12,0.027,0.223,0.027,0.295c0.005,0.074,0.009,0.116,0.009,0.116s0.016-0.039,0.039-0.109
					c0.01-0.036,0.03-0.079,0.037-0.131c0.01-0.051,0.02-0.108,0.029-0.172c0.013-0.127,0.016-0.28-0.003-0.439
					c-0.016-0.158-0.054-0.326-0.101-0.491c-0.052-0.162-0.11-0.32-0.182-0.464c-0.066-0.144-0.142-0.27-0.211-0.376
					C136.866,152.984,136.744,152.866,136.744,152.866z"/>
				<path fill="#9F621C" d="M137.713,151.26c0,0,0.046,0.018,0.121,0.053c0.073,0.033,0.179,0.085,0.297,0.153
					c0.059,0.035,0.12,0.075,0.185,0.118c0.064,0.042,0.123,0.099,0.19,0.147c0.059,0.058,0.125,0.114,0.178,0.179
					c0.061,0.062,0.111,0.133,0.158,0.206c0.057,0.068,0.086,0.151,0.13,0.225c0.033,0.079,0.065,0.158,0.097,0.234
					c0.02,0.081,0.041,0.159,0.062,0.233c0.02,0.075,0.024,0.148,0.039,0.217c0.03,0.134,0.027,0.252,0.039,0.333
					c0.01,0.083,0.017,0.129,0.017,0.129s0.014-0.043,0.032-0.125c0.016-0.082,0.054-0.199,0.054-0.344
					c0.001-0.073,0.01-0.152,0.002-0.237c-0.011-0.083-0.02-0.171-0.036-0.263c-0.028-0.087-0.05-0.183-0.087-0.274
					c-0.048-0.088-0.083-0.183-0.143-0.265c-0.059-0.082-0.119-0.162-0.19-0.231c-0.065-0.075-0.147-0.128-0.218-0.187
					c-0.156-0.104-0.311-0.182-0.451-0.223C137.91,151.247,137.713,151.26,137.713,151.26z"/>
				<path fill="#1A191E" d="M134.242,156.583c0.141,0.803-0.269,1.598-0.913,1.773l0,0c-0.646,0.175-1.282-0.333-1.423-1.137
					l-4.023-22.958c-0.141-0.803,0.268-1.597,0.913-1.772l0,0c0.645-0.175,1.282,0.333,1.422,1.138L134.242,156.583z"/>
				<g>
					<polygon fill="#E84835" points="135.903,166.626 133.581,167.337 137.269,188.747 139.591,188.035 					"/>
				</g>
			</g>
			<path fill="#1A191E" d="M129.856,140.412c-0.082-0.04-0.168-0.06-0.254-0.063c0-0.015,0.001-0.033,0.002-0.048
				c0.024-0.791,0.038-1.242,0.038-1.242c0.001-0.084-0.059-0.159-0.144-0.17c-0.091-0.013-0.175,0.054-0.186,0.143
				c0,0-0.079,0.564-0.214,1.536c-0.041,0.045-0.078,0.093-0.105,0.151l-3.248,6.833c-0.042,0.091-0.013,0.201,0.074,0.257
				c0.094,0.058,0.216,0.03,0.275-0.062l2.57-4.08c-0.186,1.297-0.398,2.792-0.627,4.391c-0.247,1.667-0.524,3.44-0.84,5.202
				c-0.161,0.879-0.34,1.752-0.529,2.603c-0.197,0.843-0.411,1.686-0.708,2.382c-0.072,0.169-0.154,0.333-0.232,0.442
				c-0.004,0.007-0.009,0.01-0.012,0.017c-0.008-0.006-0.016-0.011-0.023-0.015c-0.059-0.057-0.128-0.16-0.187-0.287
				c-0.232-0.539-0.329-1.267-0.369-1.898c-0.059-0.646-0.053-1.253-0.065-1.793c0.002-0.545,0.003-1.019,0.006-1.41
				c0.007-0.787,0.012-1.238,0.012-1.238c0-0.069-0.042-0.137-0.113-0.16c-0.086-0.031-0.182,0.016-0.213,0.103
				c0,0-0.154,0.436-0.338,1.216c-0.088,0.391-0.189,0.867-0.269,1.421c-0.088,0.555-0.145,1.187-0.165,1.893
				c-0.001,0.354,0.007,0.724,0.049,1.119c0.044,0.396,0.111,0.81,0.306,1.261c0.099,0.226,0.231,0.466,0.452,0.693
				c0.129,0.109,0.229,0.211,0.449,0.306c0.05,0.023,0.101,0.042,0.151,0.062c0.049,0.015,0.055,0.014,0.086,0.022l0.073,0.019
				l0.037,0.008l0.01,0.003c0.144,0.025,0.057,0.008,0.097,0.014l0.057,0.002c0.078,0,0.16-0.003,0.231-0.02
				c0.066-0.015,0.134-0.038,0.2-0.064c0.07-0.026,0.103-0.057,0.155-0.087c0.044-0.03,0.101-0.065,0.129-0.094
				c0.145-0.125,0.24-0.25,0.318-0.363c0.157-0.234,0.257-0.451,0.351-0.668c0.354-0.865,0.556-1.727,0.756-2.611
				c0.195-0.882,0.349-1.78,0.49-2.676c0.285-1.795,0.494-3.594,0.664-5.279c0.089-0.842,0.155-1.658,0.218-2.432
				c0.065-0.774,0.121-1.506,0.163-2.182c0.028-0.439,0.054-0.852,0.074-1.241l0.622-0.984c0.012-0.021,0.026-0.046,0.037-0.067
				C130.317,140.953,130.181,140.563,129.856,140.412z"/>
			<g>
				<path fill="#353435" d="M109.739,83.919c0,0,1.762,4.199,4.471,6.232c2.708,2.031,12.054,0.54,12.19-1.356
					c0.135-1.895-0.813-7.719-0.813-7.719L109.739,83.919z"/>
				<path fill="#353435" d="M105.554,85.41c0,0-0.203,4.549-2.043,7.391c-1.84,2.842-10.959,3.48-12.462,2.633
					c-1.503-0.849-5.147-6.502-5.147-6.502L105.554,85.41z"/>
				<g>
					<path fill="#1D1D1B" d="M85.9,89.202c0.056,0,0.113-0.005,0.17-0.015l39.686-7.178c0.516-0.094,0.856-0.586,0.764-1.103
						c-0.094-0.513-0.587-0.856-1.101-0.762l-39.686,7.178c-0.516,0.093-0.858,0.585-0.765,1.102
						C85.051,88.881,85.45,89.202,85.9,89.202z"/>
				</g>
			</g>
			<path fill="#EA5DBD" d="M111.497,117.444c1.741-0.723,4.462-0.491,6.661,3.524c2.485,4.538,0.623,8.47-2.467,10.295
				c-3.088,1.827-8.526-0.46-8.498-4.766C107.222,122.19,106.465,119.527,111.497,117.444z"/>
			<path fill="#C551B4" d="M112.832,125.621l-0.829-6.961c-1.099-0.469-2.758-0.842-4.305-1.042c0,0-6.205-0.373-11.33,2.589
				c-0.716,0.415-0.708,3.343-1.508,3.429c-0.896,4.303-2.316,11.328-2.944,14.912c-0.79,4.519-2.741,16.095-6.438,25.007
				c0.092,0.094,0.184,0.197,0.279,0.312c1.073,1.326,2.015,2.524,4.005,3.222c0-0.034,0-0.066,0.001-0.098
				c-0.001,0.031-0.001,0.066-0.001,0.098c1.744,0.61,4.293,0.838,8.444,0.429c1.328-0.129,2.817-0.325,4.497-0.593
				c2.776-0.446,4.824-2.603,6.332-5.71C114.562,149.827,112.832,125.621,112.832,125.621z"/>
			<path fill="#662483" d="M119.066,167.515c-0.363-1.455-3.394-18.181-4.485-30.422c-1.09-12.242-0.483-16.97-1.697-17.938
				c-0.216-0.172-0.519-0.339-0.881-0.494l0.829,6.961c0,0,1.73,24.206-3.797,35.593c-1.508,3.108-3.556,5.265-6.332,5.71
				c-1.68,0.268-3.169,0.464-4.497,0.593c-4.15,0.409-6.7,0.182-8.444-0.429c-0.001,0.066-0.001,0.131-0.001,0.2
				c0-0.069,0-0.134,0.001-0.2c-1.99-0.698-2.932-1.896-4.005-3.222c-0.095-0.115-0.187-0.218-0.279-0.312
				c-0.269,0.646-0.546,1.283-0.833,1.898c0,0,0,1.213,1.09,2.062c0.297,0.232,1.761,0.833,4.032,1.479
				c-0.003-0.399-0.006-0.785-0.006-1.156c0,0.371,0.003,0.757,0.006,1.156c1.94,0.551,4.468,1.135,7.366,1.551
				c4.8,0.688,10.611,0.911,16.436-0.25c0.885-0.176,1.77-0.386,2.652-0.629c0.75-0.208,1.497-0.437,2.239-0.698
				C118.46,168.968,119.431,168.968,119.066,167.515z M111.068,161.675L111.068,161.675c0.002,0,0.004,0.001,0.006,0.003
				C111.072,161.676,111.07,161.675,111.068,161.675z"/>
			<path fill="#FACB99" d="M90.582,125.316c0,0,3.039,0.043,3.438,1.8c0,0-6.186,22.704-7.368,28.994l-3.436,0.237
				C83.721,154.07,90.582,125.316,90.582,125.316z"/>
			<g>
				<path fill="#FACB99" d="M85.757,153.99c0,0-2.634-0.476-3.778,0.801c-1.14,1.274-2.813,8.976-2.506,10.754
					c0.308,1.778,0.979,1.282,1.293,0.41c0,0-0.335,3.197,0.568,3.369c0.904,0.174,1.238-1.961,1.238-1.961
					s-0.398,2.946,0.615,3.027c1.014,0.08,1.021-2.835,1.021-2.835s0.4,2.418,1.008,2.202c0.609-0.217,0.891-0.421,0.958-2.82
					c0.07-2.403,0.451-5.411,0.53-5.895c0.079-0.484,0.562-0.14,0.842,0.189c0.28,0.329,0.79,2.654,1.725,2.951
					c0.934,0.297,0.686-0.701,0.455-1.372c-0.233-0.671-0.729-1.873-1.163-3.355C88.133,157.972,87.517,154.946,85.757,153.99z"/>
				<g>
					<path fill="#9F621C" d="M84.367,168.034c0.11-1.714,0.301-3.497,0.628-5.182c0.01-0.052-0.063-0.065-0.083-0.022
						c-0.323,0.646-0.397,1.618-0.484,2.33c-0.113,0.935-0.453,1.941-0.207,2.875C84.24,168.11,84.36,168.125,84.367,168.034z"/>
					<path fill="#9F621C" d="M82.542,168.239c0.189-0.901,0.374-1.811,0.533-2.718c0.145-0.817,0.19-1.678,0.423-2.477
						c0.02-0.06-0.06-0.117-0.1-0.058c-0.35,0.525-0.373,1.32-0.469,1.926c-0.171,1.089-0.569,2.197-0.57,3.302
						C82.359,168.333,82.517,168.358,82.542,168.239z"/>
					<path fill="#9F621C" d="M80.626,166.758c0.314-0.674,0.406-1.455,0.599-2.169c0.177-0.651,0.578-1.274,0.623-1.951
						c0.002-0.038-0.046-0.049-0.065-0.018c-0.659,1.283-1.063,2.679-1.336,4.091C80.425,166.82,80.583,166.852,80.626,166.758z"/>
					<path fill="#9F621C" d="M84.863,162.13c0.176,0.062,0.378-0.023,0.447-0.196c0.026-0.066-0.049-0.109-0.101-0.075
						c-0.116,0.069-0.257,0.059-0.366,0.144C84.802,162.036,84.81,162.11,84.863,162.13z"/>
					<path fill="#9F621C" d="M83.481,162.01c0.102,0.085,0.235,0.117,0.368,0.1c0.049-0.007,0.075-0.068,0.043-0.106
						c-0.092-0.115-0.23-0.175-0.375-0.139C83.451,161.883,83.423,161.961,83.481,162.01z"/>
					<path fill="#9F621C" d="M82.246,161.763c0.095,0.015,0.124-0.104,0.063-0.16c-0.129-0.119-0.177-0.266-0.344-0.347
						c-0.07-0.035-0.155,0.034-0.142,0.109C81.861,161.591,82.023,161.728,82.246,161.763z"/>
				</g>
				<path fill="#9F621C" d="M82.306,154.347c0,0-0.267,0.739-0.666,1.844c-0.228,0.539-0.396,1.203-0.633,1.891
					c-0.107,0.348-0.254,0.698-0.337,1.069c-0.087,0.37-0.175,0.746-0.263,1.119c-0.089,0.378-0.199,0.739-0.27,1.127
					c-0.069,0.379-0.136,0.749-0.222,1.112c-0.156,0.729-0.367,1.377-0.439,1.943c-0.047,0.282-0.033,0.537-0.025,0.769
					c0.046,0.224,0.084,0.427,0.143,0.585c0.129,0.316,0.203,0.497,0.203,0.497s-0.106-0.167-0.292-0.458
					c-0.083-0.151-0.153-0.355-0.236-0.587c-0.047-0.243-0.102-0.524-0.072-0.828c0.005-0.305,0.062-0.625,0.11-0.961
					c0.056-0.33,0.115-0.679,0.177-1.041c0.071-0.354,0.111-0.735,0.179-1.113c0.062-0.372,0.172-0.766,0.258-1.15
					c0.097-0.385,0.193-0.771,0.288-1.151c0.089-0.382,0.263-0.725,0.385-1.075c0.271-0.688,0.521-1.33,0.79-1.857
					C81.892,155.016,82.306,154.347,82.306,154.347z"/>
			</g>
			<path fill="#EA5DBD" d="M90.642,117.444c1.742-0.723,4.463-0.491,6.663,3.524c2.485,4.538,0.622,8.47-2.467,10.295
				c-3.089,1.827-10.861-0.642-10.832-4.949C84.033,122.007,85.609,119.527,90.642,117.444z"/>
		</g>
	</g>
</g>
</svg>
