<?xml version="1.0" encoding="utf-8"?>
<!-- Generator: Adobe Illustrator 16.0.0, SVG Export Plug-In . SVG Version: 6.00 Build 0)  -->
<!DOCTYPE svg PUBLIC "-//W3C//DTD SVG 1.1//EN" "http://www.w3.org/Graphics/SVG/1.1/DTD/svg11.dtd">
<svg version="1.1" id="Capa_1" xmlns="http://www.w3.org/2000/svg" xmlns:xlink="http://www.w3.org/1999/xlink" x="0px" y="0px"
	 width="200px" height="200px" viewBox="0 0 200 200" enable-background="new 0 0 200 200" xml:space="preserve">
<g>
	<circle fill="#D10522" cx="98.666" cy="99.345" r="99.343"/>
	<g>
		<g>
			<path fill="#FFDD15" d="M128.665,54.43c-13.636-10.716-35.193-9.073-47.942,2.116c-8.833,7.752-11.909,25.357-11.705,29.133
				c0.051,0.938,0.624,1.789,1.57,2.034c3.231,0.854,6.581,1.438,9.863,2.069c2.412,0.468,6.061,1.602,8.291,0.19
				c0.815-0.519,1.915-4.3,1.593-5.162c-4.947-13.083,19.177-16.56,18.752-3.331c-0.271,8.569-10.969,10.762-15.078,17.362
				c-4.702,7.55-5.865,18.387-6.6,27.06c-0.13,1.581,1.349,2.497,2.688,2.661c4.277,0.523,8.561,1.035,12.849,1.485
				c1.129,0.115,2.331-0.919,2.568-1.979c0.797-3.59,1.081-7.284,1.688-10.918c0.936-5.608,3.717-7.084,8.901-8.737
				c7.535-2.41,12.952-5.635,17.395-12.322C141.779,83.619,140.825,63.98,128.665,54.43L128.665,54.43z M128.665,54.43"/>
		</g>
		<path fill="#FFDD15" d="M106.502,147.461c0,1.657-1.343,3-3,3H90.078c-1.657,0-3-1.343-3-3v-9.48c0-1.657,1.343-3,3-3h13.424
			c1.657,0,3,1.343,3,3V147.461z"/>
	</g>
</g>
</svg>
