<svg
   xmlns="http://www.w3.org/2000/svg"
   viewBox="0 0 8 8"
   id="content"
   version="1.1">
   
   <!-- Image being drawn -->
   <path stroke-width="1.5" stroke-linecap="round" d="M 1,1 7,7"/>
   <path stroke-width="1.5" stroke-linecap="round" d="M 1,7 7,1"/>
   <!-- Hit box for click events -->
   <rect width="8" height="8" pointer-events="fill" opacity="0"/>
</svg>

