<svg
   xmlns="http://www.w3.org/2000/svg"
   viewBox="0 0 8 8"
   id="content"
   version="1.1">
   
   <!-- Image being drawn -->
   <path fill="none" stroke-width="1.5" stroke-linecap="round" stroke-linejoin="round" d="M 1,5 3,7 7,2"/>
   <!-- Hit box for click events -->
   <rect width="8" height="8" pointer-events="fill" opacity="0"/>
</svg>

