<svg
   xmlns="http://www.w3.org/2000/svg"
   viewBox="0 0 8 8"
   id="content"
   version="1.1">
   
   <defs>
    <g id="sunbeam">
       <path d="M 4 1
                L 3.5 2.25
                L 4.5 2.25 z"
	     stroke="none"
       />
       <path d="M 4 7
                L 3.5 5.75
                L 4.5 5.75 z"
	     stroke="none"
       />
    
    </g>
   </defs>
   
   <!-- Image being drawn -->
   <circle cx="4" cy="4" r="1.5" stroke="none"/>
   <use href="#sunbeam"/>
   <use href="#sunbeam" transform="rotate(45,4,4)"/>
   <use href="#sunbeam" transform="rotate(90,4,4)"/>
   <use href="#sunbeam" transform="rotate(135,4,4)"/>
   
   <!-- Hit box for click events -->
   <rect width="8" height="8" pointer-events="fill" opacity="0"/>
</svg>

