<svg
   xmlns="http://www.w3.org/2000/svg"
   viewBox="0 0 6 10"
   id="content"
   version="1.1">
   
   <!-- Image being drawn -->
   <path d="M 3 0
            Q 3.5 2 5 4
            A 3 3 270 1 1 1 4
            Q 2.5 2 3 0"
   />
</svg>

