<svg
   xmlns="http://www.w3.org/2000/svg"
   viewBox="0 0 8 8"
   id="content"
   version="1.1">
   
   <!-- Image being drawn -->
   <path d="M 3 1.5
            A 2.625 2.625 0 1 0 6.5 5
            A 3 3 0 0 1 3 1.5"
         stroke="none"
   />
   
   <!-- Hit box for click events -->
   <rect width="8" height="8" pointer-events="fill" opacity="0"/>
</svg>

