<svg
   xmlns="http://www.w3.org/2000/svg"
   viewBox="0 0 8 8"
   id="content"
   version="1.1">
   
   <path d="M 4 1.75
            Q 4.25 3 4.875 3.5
            A 1.125 1.125 0 1 1 3.125 3.5
            Q 3.75 3 4 1.75"
   />
</svg>

