<svg
   xmlns="http://www.w3.org/2000/svg"
   viewBox="0 0 8 8"
   id="content"
   version="1.1">
   
   <!-- Image being drawn -->
   <path d="M 4 4
            L 3 6.5
            L 3.5 6.5
            L 4 5
            L 4.5 6.5
            L 5 6.5 `z"
         stroke="none"
   />
   
   <rect width="1" height="0.5" x="3.5" y="5.5" stroke="none"/>
   
   <!-- Hit box for click events -->
   <rect width="8" height="8" pointer-events="fill" opacity="0"/>
</svg>

