{
  "@odata.context": "$metadata#Products(Attributes())",
  "value": [
    {
      "@odata.mediaContentType": "application/octet-stream",
      "Id": "0dbe935f-fac5-35ee-98e8-dab4bcb28c00",
      "Name": "S2A_OPER_MSI_L0__GR_SGS__20160726T061346_S20160726T025100_D07_N02.04.tar",
      "ContentType": "application/x-tar",
      "ContentLength": 18388992,
      "OriginDate": "2020-11-13T23:43:40.206Z",
      "PublicationDate": "2021-09-13T08:32:50.942Z",
      "ModificationDate": "2021-09-13T08:32:50.942Z",
      "Online": true,
      "EvictionDate": "2022-09-13T08:32:50.991Z",
      "Checksum": [
        {
          "Algorithm": "MD5",
          "Value": "32a200c0aec6354de86264ce8a31906b",
          "ChecksumDate": "2021-09-13T08:32:50.942Z"
        }
      ],
      "ContentDate": {
        "Start": "2016-07-26T02:51:00Z",
        "End": "2016-07-26T02:51:00Z"
      },
      "Footprint": "geography'SRID=4326;Polygon((130.109667689675 59.7537107785163,130.355875644242 60.1042516463722,129.925351948865 60.180865449029,129.681885317254 59.8299681649503,130.109667689675 59.7537107785163))'",
      "Attributes": []
    },
    {
      "@odata.mediaContentType": "application/octet-stream",
      "Id": "0ded0a2d-6dec-300c-b410-97cdeba7ecd3",
      "Name": "S2A_OPER_MSI_L0__GR_EPAE_20200425T074411_S20200425T051135_D02_N02.09.tar",
      "ContentType": "application/x-tar",
      "ContentLength": 18388992,
      "OriginDate": "2020-09-17T23:21:55.531Z",
      "PublicationDate": "2020-12-14T21:01:30.896Z",
      "ModificationDate": "2021-07-09T03:48:14Z",
      "Online": false,
      "EvictionDate": null,
      "Checksum": [
        {
          "Algorithm": "MD5",
          "Value": "da797a0fe977596061a87b33494a1012",
          "ChecksumDate": "2020-12-14T21:01:30.896Z"
        }
      ],
      "ContentDate": {
        "Start": "2020-04-25T05:11:35Z",
        "End": "2020-04-25T05:11:35Z"
      },
      "Footprint": "geography'SRID=4326;Polygon((82.7837486272019 25.8068861825302,82.8769843333594 26.1723966574819,82.6175646027834 26.2149957144843,82.5249617250125 25.8482692987604,82.7837486272019 25.8068861825302))'",
      "Attributes": []
    },
    {
      "@odata.mediaContentType": "application/octet-stream",
      "Id": "0dbea78d-bdbc-39cd-9c69-4359e2e0e532",
      "Name": "S2A_OPER_MSI_L0__GR_EPAE_20180422T075404_S20180422T053635_D09_N02.06.tar",
      "ContentType": "application/x-tar",
      "ContentLength": 18388992,
      "OriginDate": "2021-01-03T08:03:00.732Z",
      "PublicationDate": "2021-08-29T01:44:24.454Z",
      "ModificationDate": "2021-08-29T01:44:24.454Z",
      "Online": true,
      "EvictionDate": "2022-08-29T01:44:24.493Z",
      "Checksum": [
        {
          "Algorithm": "MD5",
          "Value": "51dbc0a53b9c88c3eb773440188bbb0c",
          "ChecksumDate": "2021-08-29T01:44:24.454Z"
        }
      ],
      "ContentDate": {
        "Start": "2018-04-22T05:36:35Z",
        "End": "2018-04-22T05:36:35Z"
      },
      "Footprint": "geography'SRID=4326;Polygon((75.296290192336 8.42215452424756,75.3775357178942 8.78782487438711,75.1525080271184 8.8420098239011,75.0707804589182 8.47704647154026,75.296290192336 8.42215452424756))'",
      "Attributes": []
    },
    {
      "@odata.mediaContentType": "application/octet-stream",
      "Id": "0dbea8ac-385f-3edd-babc-111d55da3178",
      "Name": "S2A_OPER_MSI_L0__GR_EPAE_20190426T082712_S20190426T073202_D07_N02.07.tar",
      "ContentType": "application/x-tar",
      "ContentLength": 18388992,
      "OriginDate": "2021-02-20T03:43:29.06Z",
      "PublicationDate": "2021-08-07T01:50:28.964Z",
      "ModificationDate": "2021-08-07T01:50:28.964Z",
      "Online": true,
      "EvictionDate": "2022-08-07T01:50:12.484Z",
      "Checksum": [
        {
          "Algorithm": "MD5",
          "Value": "8ef58453bbb868f432ed6665fc0bd7f6",
          "ChecksumDate": "2021-08-07T01:50:28.964Z"
        }
      ],
      "ContentDate": {
        "Start": "2019-04-26T07:32:02Z",
        "End": "2019-04-26T07:32:02Z"
      },
      "Footprint": "geography'SRID=4326;Polygon((62.0440832804223 62.8948639699971,62.3397924859373 63.241420975085,61.8679358165663 63.3245782648456,61.5756001569125 62.9775507024439,62.0440832804223 62.8948639699971))'",
      "Attributes": []
    },
    {
      "@odata.mediaContentType": "application/octet-stream",
      "Id": "0dbea907-bf62-30af-afc0-86cee9d7fe3b",
      "Name": "S2A_OPER_MSI_L0__GR_SGS__20170821T173200_S20170821T142534_D01_N02.05.tar",
      "ContentType": "application/x-tar",
      "ContentLength": 18388992,
      "OriginDate": "2020-12-10T04:07:13.451Z",
      "PublicationDate": "2021-09-26T14:59:12.575Z",
      "ModificationDate": "2021-09-26T14:59:12.575Z",
      "Online": true,
      "EvictionDate": "2022-09-26T14:59:12.628Z",
      "Checksum": [
        {
          "Algorithm": "MD5",
          "Value": "4e4c206b9a0a9958a75852e3732e4575",
          "ChecksumDate": "2021-09-26T14:59:12.575Z"
        }
      ],
      "ContentDate": {
        "Start": "2017-08-21T14:25:34Z",
        "End": "2017-08-21T14:25:34Z"
      },
      "Footprint": "geography'SRID=4326;Polygon((-61.5480026783268 -10.2581814162335,-61.4642194122618 -9.89095076831328,-61.7044985541575 -9.84664617153752,-61.7901358692951 -10.2148453934859,-61.5480026783268 -10.2581814162335))'",
      "Attributes": []
    },
    {
      "@odata.mediaContentType": "application/octet-stream",
      "Id": "0dbec50f-b279-32aa-89b1-087ac89a6cdc",
      "Name": "S2A_OPER_MSI_L0__GR_MTI__20160929T103814_S20160929T070952_D10_N02.04.tar",
      "ContentType": "application/x-tar",
      "ContentLength": 18388992,
      "OriginDate": "2020-11-17T18:01:30.657Z",
      "PublicationDate": "2021-09-14T01:09:05.084Z",
      "ModificationDate": "2021-09-14T01:09:05.084Z",
      "Online": true,
      "EvictionDate": "2022-09-14T01:09:05.191Z",
      "Checksum": [
        {
          "Algorithm": "MD5",
          "Value": "d6e8c977aa0551ae63e7d9b76ea7f682",
          "ChecksumDate": "2021-09-14T01:09:05.084Z"
        }
      ],
      "ContentDate": {
        "Start": "2016-09-29T07:09:52Z",
        "End": "2016-09-29T07:09:52Z"
      },
      "Footprint": "geography'SRID=4326;Polygon((56.8934506401403 34.0491648916422,57.0026522696907 34.4127995530053,56.7312335492921 34.476780029879,56.6232353416182 34.1139184130301,56.8934506401403 34.0491648916422))'",
      "Attributes": []
    },
    {
      "@odata.mediaContentType": "application/octet-stream",
      "Id": "0dbece19-fcfa-35de-bb1b-802f760ee3c5",
      "Name": "S2A_OPER_MSI_L0__GR_SGS__20190703T215522_S20190703T183005_D12_N02.07.tar",
      "ContentType": "application/x-tar",
      "ContentLength": 18388992,
      "OriginDate": "2021-03-23T11:31:28.212Z",
      "PublicationDate": "2021-09-24T20:45:08.63Z",
      "ModificationDate": "2021-09-24T20:45:08.63Z",
      "Online": true,
      "EvictionDate": "2022-09-24T20:45:08.779Z",
      "Checksum": [
        {
          "Algorithm": "MD5",
          "Value": "e1160e211238708e05104c3811739130",
          "ChecksumDate": "2021-09-24T20:45:08.63Z"
        }
      ],
      "ContentDate": {
        "Start": "2019-07-03T18:30:05Z",
        "End": "2019-07-03T18:30:05Z"
      },
      "Footprint": "geography'SRID=4326;Polygon((-44.966248700842 79.8139622502358,-42.8924053070936 79.9049840038211,-43.1352284659602 80.1444124607772,-45.2476940900031 80.0519648247023,-44.966248700842 79.8139622502358))'",
      "Attributes": []
    },
    {
      "@odata.mediaContentType": "application/octet-stream",
      "Id": "0dbed271-9569-36d7-8d0a-adaa5a2d7b05",
      "Name": "S2A_OPER_MSI_L0__GR_SGS__20170506T022825_S20170506T011132_D12_N02.05.tar",
      "ContentType": "application/x-tar",
      "ContentLength": 18388992,
      "OriginDate": "2020-11-29T15:07:08.229Z",
      "PublicationDate": "2021-09-20T19:36:48.066Z",
      "ModificationDate": "2021-09-20T19:36:48.066Z",
      "Online": true,
      "EvictionDate": "2022-09-20T19:36:48.228Z",
      "Checksum": [
        {
          "Algorithm": "MD5",
          "Value": "72ff6dc24d3dc4c31216dd59d6bbaefd",
          "ChecksumDate": "2021-09-20T19:36:48.066Z"
        }
      ],
      "ContentDate": {
        "Start": "2017-05-06T01:11:32Z",
        "End": "2017-05-06T01:11:32Z"
      },
      "Footprint": "geography'SRID=4326;Polygon((138.496380861318 -16.2761357460169,138.577596274104 -15.9059779403599,138.333950519734 -15.8422925129197,138.252614132561 -16.2110290247592,138.496380861318 -16.2761357460169))'",
      "Attributes": []
    },
    {
      "@odata.mediaContentType": "application/octet-stream",
      "Id": "0dbedbc2-aec3-35cf-b22b-715c669b769d",
      "Name": "S2A_OPER_MSI_L0__GR_SGS__20170607T081749_S20170607T032535_D04_N02.05.tar",
      "ContentType": "application/x-tar",
      "ContentLength": 18388992,
      "OriginDate": "2020-12-02T14:37:25.066Z",
      "PublicationDate": "2021-09-14T09:04:11.673Z",
      "ModificationDate": "2021-09-14T09:04:11.673Z",
      "Online": true,
      "EvictionDate": "2022-09-14T09:04:11.799Z",
      "Checksum": [
        {
          "Algorithm": "MD5",
          "Value": "c91db57a98ec1c6ebab6d01ea28c290c",
          "ChecksumDate": "2021-09-14T09:04:11.673Z"
        }
      ],
      "ContentDate": {
        "Start": "2017-06-07T03:25:35Z",
        "End": "2017-06-07T03:25:35Z"
      },
      "Footprint": "geography'SRID=4326;Polygon((106.989822724933 8.74863019399304,107.072542924273 9.11387249529872,106.844165033792 9.15881498952392,106.76168605293 8.79290264997497,106.989822724933 8.74863019399304))'",
      "Attributes": []
    },
    {
      "@odata.mediaContentType": "application/octet-stream",
      "Id": "0ded1ec3-c7b5-37ba-9ed4-b5069590fec2",
      "Name": "S2A_OPER_MSI_L0__GR_MTI__20190827T205529_S20190827T161257_D12_N02.08.tar",
      "ContentType": "application/x-tar",
      "ContentLength": 18388992,
      "OriginDate": "2020-08-25T18:23:20.596Z",
      "PublicationDate": "2020-12-25T09:22:49.8Z",
      "ModificationDate": "2021-06-12T10:44:00Z",
      "Online": false,
      "EvictionDate": null,
      "Checksum": [
        {
          "Algorithm": "MD5",
          "Value": "4a7502114b9aab447181948b5eb06a92",
          "ChecksumDate": "2020-12-25T09:22:49.8Z"
        }
      ],
      "ContentDate": {
        "Start": "2019-08-27T16:12:57Z",
        "End": "2019-08-27T16:12:57Z"
      },
      "Footprint": "geography'SRID=4326;Polygon((-77.667992099875 36.6776784731294,-77.55064741647 37.0431659310571,-77.8398974307291 37.1163233726768,-77.9553143592284 36.7519091897884,-77.667992099875 36.6776784731294))'",
      "Attributes": []
    }
  ]
}