{
  "@odata.context": "$metadata#Products",
  "@odata.count": 3,
  "value": [
    {
      "@odata.mediaContentType": "application/octet-stream",
      "Id": "0723d9a4-3bbe-305e-b712-5e820058e065",
      "Name": "S2B_OPER_MSI_L0__GR_MPS__20170803T123125_S20170803T090229_D12_N02.05.tar",
      "ContentType": "application/x-tar",
      "ContentLength": 18388992,
      "OriginDate": "2020-12-15T11:51:07.854Z",
      "PublicationDate": "2021-09-24T07:08:01.693Z",
      "ModificationDate": "2021-09-24T07:08:01.693Z",
      "Online": true,
      "EvictionDate": "2022-09-24T07:08:01.81Z",
      "Checksum": [
        {
          "Algorithm": "MD5",
          "Value": "33b93645f16ce9d4751caa930ba7f9be",
          "ChecksumDate": "2021-09-24T07:08:01.693Z"
        }
      ],
      "ContentDate": {
        "Start": "2017-08-03T09:02:29Z",
        "End": "2017-08-03T09:02:29Z"
      },
      "Footprint": "geography'SRID=4326;Polygon((27.8571916262211 27.6012663294073,27.9566145069402 27.9686094951899,27.6944445133401 28.0376524185454,27.5963741578432 27.6714742215385,27.8571916262211 27.6012663294073))'"
    },
    {
      "@odata.mediaContentType": "application/octet-stream",
      "Id": "0723d9bf-02a2-3e99-b1b3-f6d81de84b62",
      "Name": "S2B_OPER_MSI_L0__GR_EPAE_20180703T214414_S20180703T165907_D05_N02.06.tar",
      "ContentType": "application/x-tar",
      "ContentLength": 18388992,
      "OriginDate": "2021-01-14T04:47:33.191Z",
      "PublicationDate": "2021-09-08T07:53:22.847Z",
      "ModificationDate": "2021-09-08T07:53:22.847Z",
      "Online": true,
      "EvictionDate": "2022-09-08T07:53:22.923Z",
      "Checksum": [
        {
          "Algorithm": "MD5",
          "Value": "feb013ff17d23d0f21a3540b9bbecce4",
          "ChecksumDate": "2021-09-08T07:53:22.847Z"
        }
      ],
      "ContentDate": {
        "Start": "2018-07-03T16:59:07Z",
        "End": "2018-07-03T16:59:07Z"
      },
      "Footprint": "geography'SRID=4326;Polygon((-86.6232066444991 51.8804870716752,-86.4570270752102 52.2378779606643,-86.8164446736959 52.298575837261,-86.9812833883799 51.9406699313941,-86.6232066444991 51.8804870716752))'"
    },
    {
      "@odata.mediaContentType": "application/octet-stream",
      "Id": "0723ddbc-b0e7-4702-abeb-de257b9f4094",
      "Name": "S1A_IW_GRDH_1ADV_20200711T172512_20200711T172537_033410_03DF06_FE7E.SAFE.zip",
      "ContentType": "application/zip",
      "ContentLength": 1670304,
      "OriginDate": "2021-03-06T06:21:32.396Z",
      "PublicationDate": "2021-03-06T06:28:05.756Z",
      "ModificationDate": "2021-03-06T06:28:05.756Z",
      "Online": false,
      "EvictionDate": null,
      "Checksum": [
        {
          "Algorithm": "MD5",
          "Value": "142558cb60cd3bf457b69d551b72327a",
          "ChecksumDate": "2021-03-06T06:28:05.756Z"
        }
      ],
      "ContentDate": {
        "Start": "2020-07-11T17:25:12.845Z",
        "End": "2020-07-11T17:25:12.845Z"
      },
      "Footprint": "geography'SRID=4326;Polygon((3.960965 51.399876,7.661462 51.806129,7.284795 53.301105,3.458167 52.89222,3.960965 51.399876))'"
    },
    {
      "@odata.mediaContentType": "application/octet-stream",
      "Id": "0723d9bf-02a2-3e99-b1b3-f6d81de84b62",
      "Name": "banana.png",
      "ContentType": "image",
      "ContentLength": 18388992,
      "OriginDate": "2021-01-14T04:47:33.191Z",
      "PublicationDate": "2021-09-08T07:53:22.847Z",
      "ModificationDate": "2021-09-08T07:53:22.847Z",
      "Online": true,
      "EvictionDate": "2022-09-08T07:53:22.923Z",
      "Checksum": [
        {
          "Algorithm": "MD5",
          "Value": "feb013ff17d23d0f21a3540b9bbecce4",
          "ChecksumDate": "2021-09-08T07:53:22.847Z"
        }
      ],
      "ContentDate": {
        "Start": "2018-07-03T16:59:07Z",
        "End": "2018-07-03T16:59:07Z"
      },
      "Footprint": "geography'SRID=4326;Polygon((-86.6232066444991 51.8804870716752,-86.4570270752102 52.2378779606643,-86.8164446736959 52.298575837261,-86.9812833883799 51.9406699313941,-86.6232066444991 51.8804870716752))'"
    }
  ]
}