module gitlab.com/dr.sybren/goln

go 1.21.3

require (
	github.com/mattn/go-colorable v0.1.13 // indirect
	github.com/mattn/go-isatty v0.0.19 // indirect
	github.com/rs/zerolog v1.31.0 // indirect
	golang.org/x/sys v0.12.0 // indirect
)
