{
  "users": [
    {
      "id": 1,
      "name": "john"
    },
    {
      "id": 2,
      "name": "mary"
    },
    {
      "id": 3,
      "name": "mike"
    },
    {
      "id": 4,
      "name": "test"
    }
  ],
  "posts": [
    {
      "id": 1,
      "post": "primo post",
      "user_id": 1
    },
    {
      "id": 2,
      "post": "secondo post",
      "user_id": 2
    },
    {
      "id": 3,
      "post": "terzo post",
      "user_id": 3
    },
    {
      "id": 4,
      "post": "quarto post",
      "user_id": 2
    },
    {
      "id": 5,
      "post": "quinto post",
      "user_id": 3
    }
  ]
}