<?xml version="1.0" encoding="UTF-8" standalone="no"?>
<svg
   xmlns:dc="http://purl.org/dc/elements/1.1/"
   xmlns:cc="http://creativecommons.org/ns#"
   xmlns:rdf="http://www.w3.org/1999/02/22-rdf-syntax-ns#"
   xmlns:svg="http://www.w3.org/2000/svg"
   xmlns="http://www.w3.org/2000/svg"
   xmlns:sodipodi="http://sodipodi.sourceforge.net/DTD/sodipodi-0.dtd"
   xmlns:inkscape="http://www.inkscape.org/namespaces/inkscape"
   version="1.1"
   id="Layer_1"
   x="0px"
   y="0px"
   viewBox="0 0 70 47"
   xml:space="preserve"
   sodipodi:docname="spaceship.svg"
   width="70"
   height="47"
   inkscape:version="1.0.1 (3bc2e81, 2020-09-07)"
   inkscape:export-filename="/home/genji/SCUOLA/2020-2021_zuccante/materiali/zuccante_src/java_game/move_spaceship/spaceship.png"
   inkscape:export-xdpi="96"
   inkscape:export-ydpi="96"><metadata
   id="metadata981"><rdf:RDF><cc:Work
       rdf:about=""><dc:format>image/svg+xml</dc:format><dc:type
         rdf:resource="http://purl.org/dc/dcmitype/StillImage" /><dc:title></dc:title></cc:Work></rdf:RDF></metadata><defs
   id="defs979" /><sodipodi:namedview
   pagecolor="#ffffff"
   bordercolor="#666666"
   borderopacity="1"
   objecttolerance="10"
   gridtolerance="10"
   guidetolerance="10"
   inkscape:pageopacity="0"
   inkscape:pageshadow="2"
   inkscape:window-width="1634"
   inkscape:window-height="888"
   id="namedview977"
   showgrid="false"
   inkscape:zoom="5.0703125"
   inkscape:cx="42.334869"
   inkscape:cy="49.84101"
   inkscape:window-x="72"
   inkscape:window-y="27"
   inkscape:window-maximized="0"
   inkscape:current-layer="Layer_1"
   inkscape:document-rotation="0" />
























<g
   id="g1016"
   transform="matrix(0,0.13193055,-0.13193055,0,68.774221,-10.274221)"><polygon
     style="fill:#1e2e3b"
     points="429.176,322.938 225.938,85.826 296.44,367.833 429.176,456.323 "
     id="polygon926" /><polygon
     style="fill:#3c5d76"
     points="286.062,85.826 82.824,322.938 82.824,456.323 215.56,367.833 "
     id="polygon928" /><circle
     style="fill:#ffda44"
     cx="256"
     cy="421.647"
     r="60.235001"
     id="circle930" /><path
     style="fill:#ff9811"
     d="m 293.647,391.529 c 0,18.295 -9.001,36.826 -26.752,55.078 -3.659,3.763 -7.362,7.16 -10.895,10.159 -3.533,-2.998 -7.236,-6.396 -10.895,-10.159 -17.751,-18.251 -26.752,-36.783 -26.752,-55.078 h 75.294 M 256,346.353 173.176,391.529 C 173.176,466.824 256,512 256,512 c 0,0 82.824,-45.176 82.824,-120.471 z"
     id="path932" /><path
     style="fill:#ff5023"
     d="m 256,346.353 v 45.176 h 37.647 c 0,18.295 -9.001,36.826 -26.752,55.078 -3.659,3.763 -7.362,7.16 -10.895,10.159 V 512 c 0,0 82.824,-45.176 82.824,-120.471 z"
     id="path934" /><path
     style="fill:#cce9f9"
     d="M 338.824,391.529 V 120.471 C 338.824,45.176 256,0 256,0 256,0 173.176,45.176 173.176,120.471 V 391.53 h 165.648 z"
     id="path936" /><path
     style="fill:#93c7ef"
     d="M 338.824,391.529 V 120.471 C 338.824,45.176 256,0 256,0 v 391.529 z"
     id="path938" /><rect
     x="233.412"
     y="225.882"
     style="fill:#1e2e3b"
     width="45.175999"
     height="105.412"
     id="rect940" /><rect
     x="173.17599"
     y="346.353"
     style="fill:#78b9eb"
     width="165.647"
     height="45.175999"
     id="rect942" /><rect
     x="256"
     y="346.353"
     style="fill:#5a8bb0"
     width="82.823997"
     height="45.175999"
     id="rect944" /><g
     id="g946">
</g><g
     id="g948">
</g><g
     id="g950">
</g><g
     id="g952">
</g><g
     id="g954">
</g><g
     id="g956">
</g><g
     id="g958">
</g><g
     id="g960">
</g><g
     id="g962">
</g><g
     id="g964">
</g><g
     id="g966">
</g><g
     id="g968">
</g><g
     id="g970">
</g><g
     id="g972">
</g><g
     id="g974">
</g></g>
</svg>
