{
  "_note1": "KEEP THIS FILE! Check it into a version control system (VCS) like git.",
  "_note2": "ObjectBox manages crucial IDs for your object model. See docs for details.",
  "_note3": "If you have VCS merge conflicts, you must resolve them according to ObjectBox docs.",
  "entities": [
    {
      "id": "1:8450335034325527495",
      "lastPropertyId": "2:4820214838695316426",
      "name": "User",
      "properties": [
        {
          "id": "1:2082052660147527531",
          "name": "id",
          "type": 6,
          "flags": 1
        },
        {
          "id": "2:4820214838695316426",
          "name": "name",
          "type": 9
        }
      ],
      "relations": []
    }
  ],
  "lastEntityId": "1:8450335034325527495",
  "lastIndexId": "0:0",
  "lastRelationId": "0:0",
  "lastSequenceId": "0:0",
  "modelVersion": 5,
  "modelVersionParserMinimum": 5,
  "retiredEntityUids": [],
  "retiredIndexUids": [],
  "retiredPropertyUids": [],
  "retiredRelationUids": [],
  "version": 1
}