{
  "project_info": {
    "project_number": "1094126991816",
    "firebase_url": "https://am001-f6e74.firebaseio.com",
    "project_id": "am001-f6e74",
    "storage_bucket": "am001-f6e74.appspot.com"
  },
  "client": [
    {
      "client_info": {
        "mobilesdk_app_id": "1:1094126991816:android:ef34dce9be7bf422",
        "android_client_info": {
          "package_name": "com.example.am010_google_sign_in"
        }
      },
      "oauth_client": [
        {
          "client_id": "1094126991816-j1v96g34fthikalkhorqab48mg7g4goc.apps.googleusercontent.com",
          "client_type": 1,
          "android_info": {
            "package_name": "com.example.am010_google_sign_in",
            "certificate_hash": "af3a57d5d835cfa76a283f37bf8e720b50ea3df2"
          }
        },
        {
          "client_id": "1094126991816-dpbjsi5hbda54r0aq2ue9uomsfnfkbtu.apps.googleusercontent.com",
          "client_type": 3
        }
      ],
      "api_key": [
        {
          "current_key": "AIzaSyBGuB3TEo-z3saSKUDNGcj_whjFgiKBSJw"
        }
      ],
      "services": {
        "appinvite_service": {
          "other_platform_oauth_client": [
            {
              "client_id": "1094126991816-dpbjsi5hbda54r0aq2ue9uomsfnfkbtu.apps.googleusercontent.com",
              "client_type": 3
            }
          ]
        }
      }
    }
  ],
  "configuration_version": "1"
}