module gitlab.com/digilab.overheid.nl/ecosystem/synthetic-data-generator/frp-interpreter

go 1.22.2

replace gitlab.com/digilab.overheid.nl/ecosystem/sdg-monorepo/claim-api => ../claim-api

require (
	github.com/google/uuid v1.6.0
	github.com/nats-io/nats.go v1.35.0
	github.com/spf13/cobra v1.8.0
	gitlab.com/digilab.overheid.nl/ecosystem/sdg-monorepo/claim-api v0.0.0-00010101000000-000000000000
)

require (
	github.com/apapsch/go-jsonmerge/v2 v2.0.0 // indirect
	github.com/davecgh/go-spew v1.1.2-0.20180830191138-d8f796af33cc // indirect
	github.com/getkin/kin-openapi v0.125.0 // indirect
	github.com/go-chi/chi/v5 v5.1.0 // indirect
	github.com/go-openapi/jsonpointer v0.21.0 // indirect
	github.com/go-openapi/swag v0.23.0 // indirect
	github.com/inconshreveable/mousetrap v1.1.0 // indirect
	github.com/invopop/yaml v0.3.1 // indirect
	github.com/josharian/intern v1.0.0 // indirect
	github.com/klauspost/compress v1.17.8 // indirect
	github.com/mailru/easyjson v0.7.7 // indirect
	github.com/mohae/deepcopy v0.0.0-20170929034955-c48cc78d4826 // indirect
	github.com/nats-io/nkeys v0.4.7 // indirect
	github.com/nats-io/nuid v1.0.1 // indirect
	github.com/oapi-codegen/runtime v1.1.1 // indirect
	github.com/perimeterx/marshmallow v1.1.5 // indirect
	github.com/pmezard/go-difflib v1.0.1-0.20181226105442-5d4384ee4fb2 // indirect
	github.com/spf13/pflag v1.0.5 // indirect
	github.com/ugorji/go/codec v1.2.12 // indirect
	golang.org/x/crypto v0.23.0 // indirect
	golang.org/x/sys v0.20.0 // indirect
	gopkg.in/yaml.v3 v3.0.1 // indirect
)
