module pleio-events

go 1.22

require (
	github.com/gofiber/fiber/v2 v2.52.5
	github.com/gofiber/template/html/v2 v2.1.2
)

require (
	github.com/andybalholm/brotli v1.1.1 // indirect
	github.com/gofiber/template v1.8.3 // indirect
	github.com/gofiber/utils v1.1.0 // indirect
	github.com/google/uuid v1.6.0 // indirect
	github.com/klauspost/compress v1.17.11 // indirect
	github.com/mattn/go-colorable v0.1.13 // indirect
	github.com/mattn/go-isatty v0.0.20 // indirect
	github.com/mattn/go-runewidth v0.0.16 // indirect
	github.com/rivo/uniseg v0.4.7 // indirect
	github.com/valyala/bytebufferpool v1.0.0 // indirect
	github.com/valyala/fasthttp v1.56.0 // indirect
	github.com/valyala/tcplisten v1.0.0 // indirect
	golang.org/x/sys v0.26.0 // indirect
)
