<?xml version="1.0" encoding="UTF-8" standalone="no"?>
<svg
   xmlns:dc="http://purl.org/dc/elements/1.1/"
   xmlns:cc="http://creativecommons.org/ns#"
   xmlns:rdf="http://www.w3.org/1999/02/22-rdf-syntax-ns#"
   xmlns:svg="http://www.w3.org/2000/svg"
   xmlns="http://www.w3.org/2000/svg"
   xmlns:sodipodi="http://sodipodi.sourceforge.net/DTD/sodipodi-0.dtd"
   xmlns:inkscape="http://www.inkscape.org/namespaces/inkscape"
   width="64"
   height="64"
   viewBox="0 0 64.000001 64"
   version="1.1"
   id="svg1484"
   inkscape:version="1.0 (1.0+r73+1)"
   sodipodi:docname="benchmarks.svg">
  <title
     id="title840">Elpida</title>
  <defs
     id="defs1478" />
  <sodipodi:namedview
     id="base"
     pagecolor="#ffffff"
     bordercolor="#666666"
     borderopacity="1.0"
     inkscape:pageopacity="0.0"
     inkscape:pageshadow="2"
     inkscape:zoom="0.99999996"
     inkscape:cx="258.49659"
     inkscape:cy="220.23324"
     inkscape:document-units="px"
     inkscape:current-layer="layer1"
     inkscape:document-rotation="0"
     showgrid="false"
     fit-margin-top="0"
     fit-margin-left="0"
     fit-margin-right="0"
     fit-margin-bottom="0"
     units="px"
     inkscape:window-width="3840"
     inkscape:window-height="2045"
     inkscape:window-x="3840"
     inkscape:window-y="0"
     inkscape:window-maximized="1"
     inkscape:object-paths="true"
     inkscape:snap-nodes="false"
     showguides="true" />
  <metadata
     id="metadata1481">
    <rdf:RDF>
      <cc:Work
         rdf:about="">
        <dc:format>image/svg+xml</dc:format>
        <dc:type
           rdf:resource="http://purl.org/dc/dcmitype/StillImage" />
        <dc:title>Elpida</dc:title>
        <dc:creator>
          <cc:Agent>
            <dc:title>Ioannis Panagiotopoulos</dc:title>
          </cc:Agent>
        </dc:creator>
        <cc:license
           rdf:resource="http://creativecommons.org/licenses/by-nc/4.0/" />
        <dc:rights>
          <cc:Agent>
            <dc:title>Ioannis Panagiotopoulos</dc:title>
          </cc:Agent>
        </dc:rights>
      </cc:Work>
      <cc:License
         rdf:about="http://creativecommons.org/licenses/by-nc/4.0/">
        <cc:permits
           rdf:resource="http://creativecommons.org/ns#Reproduction" />
        <cc:permits
           rdf:resource="http://creativecommons.org/ns#Distribution" />
        <cc:requires
           rdf:resource="http://creativecommons.org/ns#Notice" />
        <cc:requires
           rdf:resource="http://creativecommons.org/ns#Attribution" />
        <cc:prohibits
           rdf:resource="http://creativecommons.org/ns#CommercialUse" />
        <cc:permits
           rdf:resource="http://creativecommons.org/ns#DerivativeWorks" />
      </cc:License>
    </rdf:RDF>
  </metadata>
  <g
     inkscape:label="Layer 1"
     inkscape:groupmode="layer"
     id="layer1"
     transform="translate(10.77773,-210.83315)">
    <g
       id="g1686-7"
       transform="translate(112.50931,15.15517)" />
    <rect
       ry="1"
       rx="1"
       y="258.81277"
       x="5.22227"
       height="12"
       width="32"
       id="rect1210-3"
       style="fill:#c7cdf9;fill-opacity:1;stroke:#6a7098;stroke-width:4;stroke-linecap:round;stroke-miterlimit:4;stroke-dasharray:none;stroke-opacity:1" />
    <path
       sodipodi:nodetypes="cccssscccccccccccccccsccccccccccccccccccccccccccccccccccccccccccccccccccccccc"
       id="path3045-9-1-3-6-1"
       style="color:#000000;font-style:normal;font-variant:normal;font-weight:normal;font-stretch:normal;font-size:medium;line-height:normal;font-family:sans-serif;font-variant-ligatures:normal;font-variant-position:normal;font-variant-caps:normal;font-variant-numeric:normal;font-variant-alternates:normal;font-variant-east-asian:normal;font-feature-settings:normal;font-variation-settings:normal;text-indent:0;text-align:start;text-decoration:none;text-decoration-line:none;text-decoration-style:solid;text-decoration-color:#000000;letter-spacing:normal;word-spacing:normal;text-transform:none;writing-mode:lr-tb;direction:ltr;text-orientation:mixed;dominant-baseline:auto;baseline-shift:baseline;text-anchor:start;white-space:normal;shape-padding:0;shape-margin:0;inline-size:0;clip-rule:nonzero;display:inline;overflow:visible;visibility:visible;isolation:auto;mix-blend-mode:normal;color-interpolation:sRGB;color-interpolation-filters:linearRGB;solid-color:#000000;solid-opacity:1;vector-effect:none;fill:#6a7098;fill-opacity:1;fill-rule:nonzero;stroke:#c7cdf9;stroke-width:2.82714;stroke-linecap:round;stroke-linejoin:miter;stroke-miterlimit:4;stroke-dasharray:none;stroke-dashoffset:0;stroke-opacity:1;color-rendering:auto;image-rendering:auto;shape-rendering:auto;text-rendering:auto;enable-background:accumulate;stop-color:#000000"
       d="m 12.447904,256.47882 c 0.01863,-0.9489 0.793245,-1.70837 1.74233,-1.70828 h 4.005308 v -10.80447 c 0,-1.68397 1.365121,-3.0491 3.04908,-3.0491 1.683958,0 3.049071,1.36513 3.049071,3.0491 v 10.80447 h 4.007018 c 1.476354,4.9e-4 2.283185,1.72179 1.33908,2.85681 l -7.023764,8.43769 -0.0085,0.0124 c -0.0077,0.009 -0.01581,0.0183 -0.02386,0.0272 -0.01445,0.0174 -0.02915,0.0342 -0.04429,0.051 l -0.0026,10e-4 c -0.02258,0.0251 -0.04583,0.0494 -0.06977,0.0732 -0.0085,0.009 -0.01693,0.0172 -0.02548,0.0255 -0.0059,0.005 -0.01125,0.0102 -0.01701,0.0154 -0.01838,0.0169 -0.0371,0.0334 -0.05609,0.0493 l -0.0035,0.003 c -0.0026,0.001 -0.0051,0.003 -0.0068,0.005 -0.02437,0.0205 -0.04933,0.0404 -0.0749,0.0596 -0.0026,0.001 -0.0051,0.003 -0.0068,0.005 -0.02557,0.0189 -0.05172,0.0369 -0.07824,0.0544 -0.0026,8.5e-4 -0.0051,0.002 -0.0068,0.003 -0.02677,0.0177 -0.05394,0.0348 -0.08165,0.051 -0.0026,8.6e-4 -0.0051,0.002 -0.0068,0.003 -0.0042,0.002 -0.0091,0.003 -0.01367,0.008 -0.02522,0.0143 -0.0507,0.028 -0.07652,0.0408 -0.02907,0.0144 -0.05864,0.0281 -0.08848,0.0408 -0.0026,8.5e-4 -0.0051,0.002 -0.0068,0.003 -0.02975,0.0124 -0.05985,0.0235 -0.09018,0.0341 -0.0026,6.1e-4 -0.0051,8.7e-4 -0.0068,10e-4 -0.03035,0.0114 -0.06095,0.0214 -0.09189,0.0307 -0.0026,6e-4 -0.0051,8.6e-4 -0.0068,10e-4 -0.03095,0.009 -0.06216,0.0166 -0.09357,0.0238 -0.0026,5.9e-4 -0.0051,8.6e-4 -0.0068,0.001 -0.03103,0.006 -0.06224,0.0124 -0.09357,0.0171 -0.0026,5.9e-4 -0.0059,8.5e-4 -0.0085,0.001 -0.03163,0.005 -0.06344,0.0102 -0.09528,0.0136 -0.0026,10e-6 -0.0051,10e-6 -0.0068,0 -0.03171,0.003 -0.06344,0.005 -0.09529,0.008 -0.0026,1e-5 -0.0059,1e-5 -0.0085,0 -0.03172,0.001 -0.06352,0.001 -0.09529,0.001 -0.0026,10e-6 -0.0059,10e-6 -0.0085,0 -0.0318,-8.6e-4 -0.06361,-0.002 -0.09529,-0.005 -0.0026,0 -0.0051,0 -0.0068,0 -0.03241,-0.002 -0.06471,-0.006 -0.09698,-0.0102 -0.0026,-5.8e-4 -0.0051,-8.5e-4 -0.0068,-10e-4 -0.03189,-0.003 -0.0637,-0.0102 -0.09529,-0.0154 -0.0026,-5.6e-4 -0.0051,-8.4e-4 -0.0068,-10e-4 -0.03138,-0.006 -0.06258,-0.0139 -0.09358,-0.0221 -0.0026,-5.9e-4 -0.0051,-8.6e-4 -0.0068,-10e-4 -0.03147,-0.008 -0.06267,-0.0173 -0.09356,-0.0272 -0.0026,-5.9e-4 -0.0051,-8.6e-4 -0.0068,-0.001 -0.03035,-0.0102 -0.06045,-0.0207 -0.09018,-0.0324 -0.0026,-8.5e-4 -0.0051,-0.002 -0.0068,-0.003 -0.02983,-0.0114 -0.05933,-0.0242 -0.08847,-0.0375 -0.0026,-8.6e-4 -0.0051,-0.002 -0.0068,-0.003 -0.02872,-0.0133 -0.05711,-0.0275 -0.08507,-0.0425 -0.0026,-8.5e-4 -0.0051,-0.002 -0.0068,-0.003 -0.02821,-0.0151 -0.05601,-0.0309 -0.08337,-0.0476 -0.0026,-8.5e-4 -0.0051,-0.002 -0.0068,-0.003 -0.02719,-0.0174 -0.05378,-0.0355 -0.07993,-0.0543 -0.01726,-0.0124 -0.03428,-0.0246 -0.05104,-0.0374 -0.0108,-0.008 -0.02163,-0.0157 -0.03232,-0.0238 l -0.0051,-0.005 c -0.0098,-0.008 -0.01932,-0.0148 -0.02889,-0.0221 -0.0108,-0.0102 -0.02164,-0.0191 -0.03232,-0.0288 -0.0059,-0.005 -0.01249,-0.0102 -0.01873,-0.0153 -0.0086,-0.008 -0.0171,-0.0158 -0.02548,-0.0239 -0.01675,-0.0155 -0.03318,-0.0314 -0.04933,-0.0476 -0.0077,-0.009 -0.01599,-0.0168 -0.02386,-0.0255 -0.01565,-0.0166 -0.03095,-0.0336 -0.04592,-0.051 -0.0077,-0.009 -0.01599,-0.018 -0.02386,-0.0272 l -0.0051,-0.005 -7.054391,-8.47684 c -0.249711,-0.35303 -0.314491,-0.79104 -0.401711,-1.14871 z" />
    <rect
       ry="1"
       rx="1"
       y="236.83316"
       x="5.22227"
       height="12"
       width="32"
       id="rect1210-0"
       style="fill:#c7cdf9;fill-opacity:1;stroke:#6a7098;stroke-width:4;stroke-linecap:round;stroke-miterlimit:4;stroke-dasharray:none;stroke-opacity:1" />
    <path
       d="m 12.447904,234.4992 c 0.01863,-0.9489 0.793245,-1.70837 1.74233,-1.70828 h 4.005308 v -10.80447 c 0,-1.68397 1.365121,-3.0491 3.04908,-3.0491 1.683958,0 3.049071,1.36513 3.049071,3.0491 v 10.80447 h 4.007018 c 1.476354,4.9e-4 2.283185,1.72179 1.33908,2.85681 l -7.023764,8.43769 -0.0085,0.0124 c -0.0077,0.009 -0.01581,0.0183 -0.02386,0.0272 -0.01445,0.0174 -0.02915,0.0342 -0.04429,0.051 l -0.0026,0.001 c -0.02258,0.0251 -0.04583,0.0494 -0.06977,0.0732 -0.0085,0.009 -0.01693,0.0172 -0.02548,0.0255 -0.0059,0.005 -0.01125,0.0102 -0.01701,0.0154 -0.01838,0.0169 -0.0371,0.0334 -0.05609,0.0493 l -0.0035,0.003 c -0.0026,0.001 -0.0051,0.003 -0.0068,0.005 -0.02437,0.0205 -0.04933,0.0404 -0.0749,0.0596 -0.0026,0.001 -0.0051,0.003 -0.0068,0.005 -0.02557,0.0189 -0.05172,0.0369 -0.07824,0.0544 -0.0026,8.5e-4 -0.0051,0.002 -0.0068,0.003 -0.02677,0.0177 -0.05394,0.0348 -0.08165,0.051 -0.0026,8.6e-4 -0.0051,0.002 -0.0068,0.003 -0.0042,0.002 -0.0091,0.003 -0.01367,0.008 -0.02522,0.0143 -0.0507,0.028 -0.07652,0.0408 -0.02907,0.0144 -0.05864,0.0281 -0.08848,0.0408 -0.0026,8.5e-4 -0.0051,0.002 -0.0068,0.003 -0.02975,0.0124 -0.05985,0.0235 -0.09018,0.0341 -0.0026,6.1e-4 -0.0051,8.7e-4 -0.0068,0.001 -0.03035,0.0114 -0.06095,0.0214 -0.09189,0.0307 -0.0026,6e-4 -0.0051,8.6e-4 -0.0068,0.001 -0.03095,0.009 -0.06216,0.0166 -0.09357,0.0238 -0.0026,5.9e-4 -0.0051,8.6e-4 -0.0068,0.001 -0.03103,0.006 -0.06224,0.0124 -0.09357,0.0171 -0.0026,5.9e-4 -0.0059,8.5e-4 -0.0085,0.001 -0.03163,0.005 -0.06344,0.0102 -0.09528,0.0136 -0.0026,1e-5 -0.0051,1e-5 -0.0068,0 -0.03171,0.003 -0.06344,0.005 -0.09529,0.008 -0.0026,1e-5 -0.0059,1e-5 -0.0085,0 -0.03172,0.001 -0.06352,0.001 -0.09529,0.001 -0.0026,10e-6 -0.0059,10e-6 -0.0085,0 -0.0318,-8.6e-4 -0.06361,-0.002 -0.09529,-0.005 -0.0026,0 -0.0051,0 -0.0068,0 -0.03241,-0.002 -0.06471,-0.006 -0.09698,-0.0102 -0.0026,-5.8e-4 -0.0051,-8.5e-4 -0.0068,-10e-4 -0.03189,-0.003 -0.0637,-0.0102 -0.09529,-0.0154 -0.0026,-5.6e-4 -0.0051,-8.4e-4 -0.0068,-0.001 -0.03138,-0.006 -0.06258,-0.0139 -0.09358,-0.0221 -0.0026,-5.9e-4 -0.0051,-8.6e-4 -0.0068,-10e-4 -0.03147,-0.008 -0.06267,-0.0173 -0.09356,-0.0272 -0.0026,-5.9e-4 -0.0051,-8.6e-4 -0.0068,-10e-4 -0.03035,-0.0102 -0.06045,-0.0207 -0.09018,-0.0324 -0.0026,-8.5e-4 -0.0051,-0.002 -0.0068,-0.003 -0.02983,-0.0114 -0.05933,-0.0242 -0.08847,-0.0375 -0.0026,-8.6e-4 -0.0051,-0.002 -0.0068,-0.003 -0.02872,-0.0133 -0.05711,-0.0275 -0.08507,-0.0425 -0.0026,-8.5e-4 -0.0051,-0.002 -0.0068,-0.003 -0.02821,-0.0151 -0.05601,-0.0309 -0.08337,-0.0476 -0.0026,-8.5e-4 -0.0051,-0.002 -0.0068,-0.003 -0.02719,-0.0174 -0.05378,-0.0355 -0.07993,-0.0543 -0.01726,-0.0124 -0.03428,-0.0246 -0.05104,-0.0374 -0.0108,-0.008 -0.02163,-0.0157 -0.03232,-0.0238 l -0.0051,-0.005 c -0.0098,-0.008 -0.01932,-0.0148 -0.02889,-0.0221 -0.0108,-0.0102 -0.02164,-0.0191 -0.03232,-0.0288 -0.0059,-0.005 -0.01249,-0.0102 -0.01873,-0.0153 -0.0086,-0.008 -0.0171,-0.0158 -0.02548,-0.0239 -0.01675,-0.0155 -0.03318,-0.0314 -0.04933,-0.0476 -0.0077,-0.009 -0.01599,-0.0168 -0.02386,-0.0255 -0.01565,-0.0166 -0.03095,-0.0336 -0.04592,-0.051 -0.0077,-0.009 -0.01599,-0.018 -0.02386,-0.0272 l -0.0051,-0.005 -7.054391,-8.47684 c -0.249711,-0.35303 -0.314491,-0.79104 -0.401711,-1.14871 z"
       style="color:#000000;font-style:normal;font-variant:normal;font-weight:normal;font-stretch:normal;font-size:medium;line-height:normal;font-family:sans-serif;font-variant-ligatures:normal;font-variant-position:normal;font-variant-caps:normal;font-variant-numeric:normal;font-variant-alternates:normal;font-variant-east-asian:normal;font-feature-settings:normal;font-variation-settings:normal;text-indent:0;text-align:start;text-decoration:none;text-decoration-line:none;text-decoration-style:solid;text-decoration-color:#000000;letter-spacing:normal;word-spacing:normal;text-transform:none;writing-mode:lr-tb;direction:ltr;text-orientation:mixed;dominant-baseline:auto;baseline-shift:baseline;text-anchor:start;white-space:normal;shape-padding:0;shape-margin:0;inline-size:0;clip-rule:nonzero;display:inline;overflow:visible;visibility:visible;isolation:auto;mix-blend-mode:normal;color-interpolation:sRGB;color-interpolation-filters:linearRGB;solid-color:#000000;solid-opacity:1;vector-effect:none;fill:#6a7098;fill-opacity:1;fill-rule:nonzero;stroke:#c7cdf9;stroke-width:2.82714;stroke-linecap:round;stroke-linejoin:miter;stroke-miterlimit:4;stroke-dasharray:none;stroke-dashoffset:0;stroke-opacity:1;color-rendering:auto;image-rendering:auto;shape-rendering:auto;text-rendering:auto;enable-background:accumulate;stop-color:#000000"
       id="path3045-9-1-3-6"
       sodipodi:nodetypes="cccssscccccccccccccccsccccccccccccccccccccccccccccccccccccccccccccccccccccccc" />
    <rect
       style="fill:#c7cdf9;fill-opacity:1;stroke:#6a7098;stroke-width:4;stroke-linecap:round;stroke-miterlimit:4;stroke-dasharray:none;stroke-opacity:1"
       id="rect1210"
       width="32"
       height="12"
       x="5.22227"
       y="214.85353"
       rx="1"
       ry="1" />
  </g>
</svg>
