{
    "rulesDirectory": [
        "node_modules/codelyzer"
    ],
    "rules": {
        "callable-types": true,
        "class-name": true,
        "comment-format": [
            true,
            "check-space"
        ],
        "eofline": true,
        "forin": true,
        "import-blacklist": [
            true,
            "rxjs/Rx"
        ],
        "import-spacing": true,
        "indent": [
            true,
            "spaces"
        ],
        "interface-over-type-literal": true,
        "label-position": true,
        "max-line-length": [
            true,
            140
        ],
        "no-arg": true,
        "no-bitwise": true,
        "no-console": [
            true,
            "debug",
            "info",
            "time",
            "timeEnd",
            "trace"
        ],
        "no-construct": true,
        "no-debugger": true,
        "no-duplicate-super": true,
        "no-empty": false,
        "no-empty-interface": true,
        "no-eval": true,
        "no-misused-new": true,
        "no-non-null-assertion": {
            "severity": "warn"
        },
        "no-shadowed-variable": true,
        "no-string-literal": false,
        "no-string-throw": true,
        "no-switch-case-fall-through": true,
        "no-trailing-whitespace": true,
        "no-unnecessary-initializer": true,
        "no-unused-expression": true,
        "no-var-keyword": true,
        "object-literal-sort-keys": false,
        "one-line": [
            true,
            "check-open-brace",
            "check-catch",
            "check-else",
            "check-whitespace"
        ],
        "prefer-const": true,
        "quotemark": [
            true,
            "single"
        ],
        "radix": true,
        "typedef-whitespace": [
            true,
            {
                "call-signature": "nospace",
                "index-signature": "nospace",
                "parameter": "nospace",
                "property-declaration": "nospace",
                "variable-declaration": "nospace"
            }
        ],
        "variable-name": false,
        "whitespace": [
            true,
            "check-branch",
            "check-decl",
            "check-operator",
            "check-separator",
            "check-type"
        ],
        "no-output-on-prefix": true,
        "no-inputs-metadata-property": true,
        "no-outputs-metadata-property": true,
        "no-host-metadata-property": true,
        "no-input-rename": true,
        "no-output-rename": true,
        "use-lifecycle-interface": true,
        "use-pipe-transform-interface": true,
        "component-class-suffix": true,
        "directive-class-suffix": true,
        "directive-selector": [
            true,
            "attribute",
            "app",
            "camelCase"
        ],
        "component-selector": [
            true,
            "element",
            "app",
            "kebab-case"
        ],
        "member-access": {
            "options": [
                "check-accessor",
                "check-constructor",
                "check-parameter-property"
            ]
        },
        "unified-signatures": true,
        "switch-default": true,
        "restrict-plus-operands": true,
        "no-inferrable-types": false,
        "arrow-return-shorthand": true,
        "array-type": {
            "options": "array"
        },
        "curly": true,
        "deprecation": true,
        "encoding": true,
        "interface-name": {
            "options": "always-prefix"
        },
        "linebreak-style": {
            "options": "LF"
        },
        "member-ordering": {
            "options": {
                "order": [
                    "static-field",
                    "public-instance-field",
                    "protected-instance-field",
                    "private-instance-field",
                    "constructor",
                    "public-instance-accessor",
                    "protected-instance-accessor",
                    "private-instance-accessor",
                    "public-static-method",
                    "public-instance-method",
                    "protected-static-method",
                    "protected-instance-method",
                    "private-static-method",
                    "private-instance-method"
                ]
            }
        },
        "no-invalid-this": {
            "options": "check-function-in-method"
        },
        "no-return-await": true,
        "no-unsafe-finally": true,
        "prefer-readonly": true,
        "prefer-function-over-method": {
            "options": "allow-public"
        },
        "prefer-template": true,
        "semicolon": true,
        "strict-boolean-expressions": true,
        "triple-equals": true,
        "typedef": {
            "options": [
                "member-variable-declaration",
                "call-signature",
                "parameter",
                "property-declaration"
            ]
        }
    }
}
