{
  "$schema": "https://raw.githubusercontent.com/DotNetAnalyzers/StyleCopAnalyzers/master/StyleCop.Analyzers/StyleCop.Analyzers/Settings/stylecop.schema.json",
  "settings": {
    "indentation": {
      "tabSize": 4,
      "indentationSize": 4,
      "useTabs": true
    },
    "documentationRules": {
      "copyrightText": "=========================================================================\n\nElpida HTTP Rest API\n\nCopyright (C) 2021 Ioannis Panagiotopoulos\n\nThis program is free software: you can redistribute it and/or modify\nit under the terms of the GNU Affero General Public License as\npublished by the Free Software Foundation, either version 3 of the\nLicense, or (at your option) any later version.\n\nThis program is distributed in the hope that it will be useful,\nbut WITHOUT ANY WARRANTY; without even the implied warranty of\nMERCHANTABILITY or FITNESS FOR A PARTICULAR PURPOSE.  See the\nGNU Affero General Public License for more details.\n\nYou should have received a copy of the GNU Affero General Public License\nalong with this program.  If not, see <https://www.gnu.org/licenses/>.\n=========================================================================",
      "companyName": "Ioannis Panagiotopoulos",
      "xmlHeader": false,
      "documentationCulture": "en-US",
      "documentExposedElements": true,
      "documentInterfaces": true,
      "documentInternalElements": false,
      "documentPrivateElements": false,
      "documentPrivateFields": false
    },
    "orderingRules": {
      "usingDirectivesPlacement": "outsideNamespace"
    }
  }
}