date,Population,RenewableEnergySupply,EnergyConsumption,EnergySupply,CO2Emission,TemperatureDiff
1990-12-30,5330943460,2234890,6270990,8773413,20518.23,0.53
1995-12-30,5751474416,2597047,6543052,9225358,21379.59,0.56
2000-12-30,6145006989,2785412,7035492,10034075,23223.39,0.56
2005-12-30,6542159383,3186034,7978080,11494154,27069.7,0.87
2010-12-30,6958169159,3976251,8832149,12874737,30489.87,0.9
2015-12-30,7383008820,5172375,9427775,13669077,32276.04,0.97
2016-12-30,7466964280,5548923,9555323,13759825,32316.22,1.25
