<?xml version="1.0" encoding="utf-8"?>
<!-- Generator: Adobe Illustrator 19.1.0, SVG Export Plug-In . SVG Version: 6.00 Build 0)  -->
<svg version="1.1" id="Layer_1" xmlns="http://www.w3.org/2000/svg" xmlns:xlink="http://www.w3.org/1999/xlink" x="0px" y="0px"
	 viewBox="-297 234.7 360.5 92.3" style="enable-background:new -297 234.7 360.5 92.3;" xml:space="preserve">
<style type="text/css">
	.st0{fill:none;stroke:#000000;stroke-width:3;stroke-linecap:round;stroke-linejoin:round;stroke-miterlimit:10;}
	.st1{fill:none;stroke:#010202;stroke-width:3;stroke-linecap:round;stroke-linejoin:round;stroke-miterlimit:10;}
	.st2{fill:#FFFFFF;}
	.st3{fill:none;stroke:#FFFFFF;stroke-width:3;stroke-linecap:round;stroke-linejoin:round;stroke-miterlimit:10;}
	.st4{fill:none;stroke:#000000;stroke-width:3;stroke-linecap:round;stroke-miterlimit:10;}
	.st5{fill:none;stroke:#FFFFFF;stroke-width:3;stroke-linecap:round;stroke-miterlimit:10;}
</style>
<path class="st0" d="M-121.7,283.6"/>
<g>
	<path class="st1" d="M-225.2,238.9"/>
</g>
<g>
	<path class="st1" d="M-224.4,241.2"/>
</g>
<g>
	<path class="st1" d="M-176,238.9"/>
</g>
<g>
	<path class="st1" d="M-175.3,241.2"/>
</g>
<path class="st1" d="M-160.2,238.9"/>
<path class="st1" d="M-159.2,241.2"/>
<g>
	<g>
		<path class="st2" d="M-179,282c-0.2,0-0.3,0-0.5-0.1c-0.8-0.3-1.2-1.1-1-1.9l11.5-34.8c0.3-0.8,1.1-1.2,1.9-1
			c0.8,0.3,1.2,1.1,1,1.9l-11.5,34.8C-177.8,281.6-178.4,282-179,282z"/>
		<path class="st2" d="M-153,272.9c-0.6,0-1.2-0.4-1.4-1l-11.6-34.8c-0.3-0.8,0.2-1.6,1-1.9s1.6,0.2,1.9,1l11.5,34.8
			c0.3,0.8-0.2,1.6-1,1.9C-152.7,272.8-152.9,272.9-153,272.9z"/>
	</g>
	<path d="M-176.1,282.1c-0.2,0-0.3,0-0.5-0.1c-0.8-0.3-1.2-1.1-1-1.9l10.6-31.7c0.3-0.8,1.1-1.2,1.9-1c0.8,0.3,1.2,1.1,1,1.9
		l-10.5,31.8C-174.8,281.7-175.4,282.1-176.1,282.1z"/>
	<path d="M-150.9,270c-0.6,0-1.2-0.4-1.4-1l-10.5-31.8c-0.3-0.8,0.2-1.6,1-1.9c0.8-0.3,1.6,0.2,1.9,1l10.5,31.7
		c0.3,0.8-0.2,1.6-1,1.9C-150.6,270-150.8,270-150.9,270z"/>
	<g>
		<path d="M-182.2,282c-0.2,0-0.3,0-0.5-0.1c-0.8-0.3-1.2-1.1-1-1.9l12.5-37.8c0.3-0.8,1.1-1.2,1.9-1c0.8,0.3,1.2,1.1,1,1.9
			l-12.5,37.8C-181,281.6-181.6,282-182.2,282z"/>
		<path d="M-155.3,275.9c-0.6,0-1.2-0.4-1.4-1l-12.5-37.8c-0.3-0.8,0.2-1.6,1-1.9s1.6,0.2,1.9,1l12.5,37.8c0.3,0.8-0.2,1.6-1,1.9
			C-154.9,275.9-155.1,275.9-155.3,275.9z"/>
	</g>
	<g>
		<line class="st3" x1="-199.6" y1="280.6" x2="-216.9" y2="236.7"/>
		<line class="st3" x1="-219.9" y1="244.3" x2="-234.2" y2="280.6"/>
	</g>
	<g>
		<line class="st0" x1="-196.4" y1="280.6" x2="-213.7" y2="236.7"/>
		<line class="st0" x1="-217.7" y1="246.9" x2="-231" y2="280.6"/>
	</g>
	<g>
		<line class="st0" x1="-202.8" y1="280.6" x2="-220.1" y2="236.7"/>
		<line class="st0" x1="-222.1" y1="241.8" x2="-237.4" y2="280.6"/>
	</g>
	<path class="st2" d="M-141.4,235.3c-0.8-0.3-1.6,0.2-1.9,1l-13.1,39.6l-13-39.7c-0.3-0.8-1.1-1.2-1.9-1c-0.8,0.3-1.2,1.1-1,1.9
		l0.4,1.1c-0.6,0-1.2,0.4-1.4,1l-13.5,40.8c-0.3,0.8,0.2,1.6,1,1.9c0.2,0.1,0.3,0.1,0.5,0.1c0.6,0,1.2-0.4,1.4-1l13.1-39.6
		l12.1,36.5c0.2,0.6,0.8,1,1.4,1l-0.4,1.1c-0.3,0.8,0.2,1.6,1,1.9c0.2,0.1,0.3,0.1,0.5,0.1c0.6,0,1.2-0.4,1.4-1l14.5-43.9
		C-140.2,236.4-140.6,235.5-141.4,235.3z"/>
	<path d="M-153.1,282c-0.2,0-0.3,0-0.5-0.1c-0.8-0.3-1.2-1.1-1-1.9l14.5-43.9c0.3-0.8,1.1-1.2,1.9-1c0.8,0.3,1.2,1.1,1,1.9
		l-14.5,43.9C-151.9,281.6-152.5,282-153.1,282z"/>
	<g>
		<line class="st3" x1="-206" y1="280.6" x2="-223.3" y2="236.7"/>
		<line class="st3" x1="-224.3" y1="239.2" x2="-240.6" y2="280.6"/>
	</g>
	<g>
		<polyline class="st4" points="-292.5,280.6 -262.9,258.6 -292.5,236.7 		"/>
	</g>
	<g>
		<polyline class="st5" points="-287.5,280.6 -257.9,258.6 -287.5,236.7 		"/>
	</g>
	<g>
		<polyline class="st4" points="-282.5,280.6 -253,258.6 -282.5,236.7 		"/>
	</g>
	<g>
		<polyline class="st4" points="-272.7,280.6 -243.1,258.6 -272.7,236.7 		"/>
	</g>
	<g>
		<polyline class="st5" points="-277.6,280.6 -248,258.6 -277.6,236.7 		"/>
	</g>
	<g>
		<polyline class="st0" points="-209.2,280.6 -226.5,236.7 -243.8,280.6 		"/>
	</g>
	<path class="st2" d="M-150.1,282.1c-0.2,0-0.3,0-0.5-0.1c-0.8-0.3-1.2-1.1-1-1.9l14.6-43.9c0.3-0.8,1.1-1.2,1.9-1
		c0.8,0.3,1.2,1.1,1,1.9l-14.5,43.9C-148.8,281.7-149.4,282.1-150.1,282.1z"/>
	<path d="M-146.9,282c-0.2,0-0.3,0-0.5-0.1c-0.8-0.3-1.2-1.1-1-1.9l14.5-43.9c0.3-0.8,1.1-1.2,1.9-1c0.8,0.3,1.2,1.1,1,1.9
		l-14.5,43.9C-145.6,281.6-146.2,282-146.9,282z"/>
	<path d="M-129.5,282.1c-0.2,0-0.3,0-0.5-0.1c-0.8-0.3-1.2-1.1-1-1.9l14.5-43.9c0.3-0.8,1.1-1.2,1.9-1c0.8,0.3,1.2,1.1,1,1.9
		l-14.5,43.9C-128.3,281.7-128.9,282.1-129.5,282.1z"/>
	<path class="st2" d="M-126.4,282.1c-0.2,0-0.3,0-0.5-0.1c-0.8-0.3-1.2-1.1-1-1.9l14.5-43.9c0.3-0.8,1.1-1.2,1.9-1
		c0.8,0.3,1.2,1.1,1,1.9L-125,281C-125.1,281.7-125.7,282.1-126.4,282.1z"/>
	<path d="M-123.3,282.1c-0.2,0-0.3,0-0.5-0.1c-0.8-0.3-1.2-1.1-1-1.9l14.5-43.9c0.3-0.8,1.1-1.2,1.9-1c0.8,0.3,1.2,1.1,1,1.9
		l-14.5,43.9C-122,281.7-122.6,282.1-123.3,282.1z"/>
	<path class="st2" d="M-120.1,282.1c-0.2,0-0.3,0-0.5-0.1c-0.8-0.3-1.2-1.1-1-1.9l14.6-43.9c0.3-0.8,1.1-1.2,1.9-1
		c0.8,0.3,1.2,1.1,1,1.9l-14.5,43.9C-118.9,281.7-119.5,282.1-120.1,282.1z"/>
	<path d="M-117,282.1c-0.2,0-0.3,0-0.5-0.1c-0.8-0.3-1.2-1.1-1-1.9l14.5-43.9c0.3-0.8,1.1-1.2,1.9-1c0.8,0.3,1.2,1.1,1,1.9
		l-14.5,43.9C-115.8,281.7-116.4,282.1-117,282.1z"/>
	<path d="M-159.5,282.1c-0.2,0-0.3,0-0.5-0.1c-0.8-0.3-1.2-1.1-1-1.9l14.5-43.9c0.3-0.8,1.1-1.2,1.9-1c0.8,0.3,1.2,1.1,1,1.9
		l-14.5,43.9C-158.3,281.7-158.9,282.1-159.5,282.1z"/>
	<g>
		<path d="M-159.5,282.1c-0.6,0-1.2-0.4-1.4-1l-13.1-39.6l-13.1,39.6c-0.3,0.8-1.1,1.2-1.9,1c-0.8-0.3-1.2-1.1-1-1.9l14.5-43.9
			c0.2-0.6,0.8-1,1.4-1c0.6,0,1.2,0.4,1.4,1l14.5,43.9c0.3,0.8-0.2,1.6-1,1.9C-159.2,282-159.3,282.1-159.5,282.1z"/>
	</g>
	<path class="st2" d="M-70.9,282.1c-0.3,0-0.6-0.1-0.8-0.2c-0.7-0.5-0.9-1.4-0.4-2.1l13.9-21.1l-13.9-21.2c-0.5-0.7-0.3-1.6,0.4-2.1
		s1.6-0.3,2.1,0.4l14.5,21.9c0.3,0.5,0.3,1.2,0,1.7l-14.5,21.9C-69.9,281.8-70.4,282.1-70.9,282.1z"/>
	<path d="M-67.3,282c-0.3,0-0.6-0.1-0.8-0.2c-0.7-0.5-0.9-1.4-0.4-2.1l13.9-21.1l-14-21.1c-0.5-0.7-0.3-1.6,0.4-2.1s1.6-0.3,2.1,0.4
		l14.5,21.9c0.3,0.5,0.3,1.2,0,1.7l-14.5,21.9C-66.4,281.8-66.8,282-67.3,282z"/>
	<path d="M-81.7,282.1c-0.5,0-1-0.2-1.3-0.7l-14.5-21.9c-0.3-0.5-0.3-1.2,0-1.7l14.5-21.9c0.5-0.7,1.4-0.9,2.1-0.4
		c0.7,0.5,0.9,1.4,0.4,2.1l-13.9,21.1l14,21c0.5,0.7,0.3,1.6-0.4,2.1C-81.1,282-81.4,282.1-81.7,282.1z"/>
	<path class="st2" d="M-79.5,280c-0.5,0-1-0.2-1.3-0.7l-13.1-19.9c-0.3-0.5-0.3-1.2,0-1.7l13.1-19.9c0.5-0.7,1.4-0.9,2.1-0.4
		c0.7,0.5,0.9,1.4,0.4,2.1l-12.6,19.1l12.7,19.1c0.5,0.7,0.3,1.6-0.4,2.1C-78.9,279.9-79.2,280-79.5,280z"/>
	<path d="M-72.1,275c-0.5,0-1-0.2-1.3-0.7l-9.9-15c-0.3-0.5-0.3-1.1,0-1.7l9.8-15c0.5-0.7,1.4-0.9,2.1-0.4c0.7,0.5,0.9,1.4,0.4,2.1
		l-9.3,14.1l9.4,14.2c0.5,0.7,0.3,1.6-0.4,2.1C-71.5,274.9-71.8,275-72.1,275z"/>
	<path class="st2" d="M-75,276c-0.5,0-1-0.2-1.3-0.7l-10.5-15.9c-0.3-0.5-0.3-1.2,0-1.7l10.5-15.9c0.5-0.7,1.4-0.9,2.1-0.4
		c0.7,0.5,0.9,1.4,0.4,2.1l-10,15.1l10,15.1c0.5,0.7,0.3,1.6-0.4,2.1C-74.4,275.9-74.7,276-75,276z"/>
	<path d="M-77.2,278.1c-0.5,0-1-0.2-1.3-0.7l-11.8-17.9c-0.3-0.5-0.3-1.2,0-1.7l11.8-17.9c0.5-0.7,1.4-0.9,2.1-0.4
		c0.7,0.5,0.9,1.4,0.4,2.1l-11.3,17.1l11.4,17c0.5,0.7,0.3,1.6-0.4,2.1C-76.6,278-76.9,278.1-77.2,278.1z"/>
	<path d="M-81.7,282.1c-0.3,0-0.6-0.1-0.8-0.2c-0.7-0.5-0.9-1.4-0.4-2.1l13.9-21.2l-13.9-21.1c-0.5-0.7-0.3-1.6,0.4-2.1
		s1.6-0.3,2.1,0.4l14.4,22c0.3,0.5,0.3,1.2,0,1.7l-14.5,21.9C-80.7,281.8-81.2,282.1-81.7,282.1z"/>
	<path class="st2" d="M-78.1,282c-0.3,0-0.6-0.1-0.8-0.2c-0.7-0.5-0.9-1.4-0.4-2.1l13.9-21.1l-13.9-21.1c-0.5-0.7-0.3-1.6,0.4-2.1
		s1.6-0.3,2.1,0.4l14.5,21.9c0.3,0.5,0.3,1.2,0,1.7l-14.5,21.9C-77.1,281.8-77.6,282-78.1,282z"/>
	<path d="M-74.5,282.1c-0.3,0-0.6-0.1-0.8-0.2c-0.7-0.5-0.9-1.4-0.4-2.1l13.9-21.1l-14-21.2c-0.5-0.7-0.3-1.6,0.4-2.1
		s1.6-0.3,2.1,0.4l14.5,21.9c0.3,0.5,0.3,1.2,0,1.7l-14.5,21.9C-73.6,281.8-74,282.1-74.5,282.1z"/>
</g>
<line class="st3" x1="-47.4" y1="281.6" x2="-295.5" y2="281.6"/>
<polyline class="st0" points="-82.1,281.6 -67.6,303.5 -78.6,320.2 "/>
<polyline class="st0" points="-78.8,319.5 -89.3,303.5 -78.5,287.1 "/>
<g>
	<polyline class="st0" points="-46,325.4 -16.5,303.5 -46,281.6 	"/>
</g>
<g>
	<polyline class="st0" points="-35.8,325.5 -6.3,303.6 -35.8,281.7 	"/>
</g>
<g>
	<polyline class="st0" points="-25.6,325.4 3.9,303.5 -25.6,281.6 	"/>
</g>
<g>
	<polyline class="st0" points="-97.6,281.6 -127.2,303.5 -97.6,325.4 	"/>
</g>
<g>
	<polyline class="st0" points="-116.3,281.7 -145.9,303.6 -116.3,325.5 	"/>
</g>
<g>
	<polyline class="st0" points="-107,281.7 -136.6,303.6 -107,325.5 	"/>
</g>
<g>
	<polyline class="st0" points="41.7,281.7 12.1,303.6 41.7,325.5 	"/>
</g>
<g>
	<polyline class="st0" points="52,281.7 22.4,303.6 52,325.5 	"/>
</g>
<g>
	<polyline class="st0" points="62,281.7 32.4,303.6 62,325.5 	"/>
</g>
<polyline class="st0" points="-74.9,281.6 -60.5,303.5 -74.9,325.4 "/>
<polyline class="st0" points="-67.6,281.6 -53.2,303.5 -67.6,325.4 "/>
<polyline class="st0" points="-82.1,281.6 -96.6,303.5 -82.1,325.4 "/>
<line class="st0" x1="-78.6" y1="320.2" x2="-82.1" y2="325.4"/>
<g>
	<line class="st0" x1="36.6" y1="306.6" x2="55" y2="306.6"/>
	<line class="st0" x1="36.6" y1="300.6" x2="55" y2="300.6"/>
</g>
<path class="st0" d="M59,303.6"/>
<path class="st0" d="M32.4,303.6"/>
<path class="st0" d="M-74.8,314.5"/>
<polyline class="st0" points="-74.8,292.6 -82,303.5 -74.9,314.4 "/>
<line class="st3" x1="-47.4" y1="236.2" x2="-295.5" y2="236.2"/>
</svg>
