[
  {
    "name": "AB"
  },
  {
    "name": "AB/C32"
  },
  {
    "name": "AB/EKW"
  },
  {
    "name": "AB/PS"
  },
  {
    "name": "AB/TL"
  },
  {
    "name": "AB/TU"
  },
  {
    "name": "C32"
  },
  {
    "name": "KOLN"
  },
  {
    "name": "DAR"
  },
  {
    "name": "EKW"
  },
  {
    "name": "HK/AB"
  },
  {
    "name": "HK/SING"
  },
  {
    "name": "HK"
  },
  {
    "name": "HLF"
  },
  {
    "name": "HSB"
  },
  {
    "name": "IND"
  },
  {
    "name": "INDO"
  },
  {
    "name": "LSB"
  },
  {
    "name": "SPF 5-D"
  },
  {
    "name": "SPF AB"
  },
  {
    "name": "NA"
  },
  {
    "name": "NHGR-1"
  },
  {
    "name": "RW"
  },
  {
    "name": "SAT"
  },
  {
    "name": "SH"
  },
  {
    "name": "SING"
  },
  {
    "name": "SJA"
  },
  {
    "name": "SJD"
  },
  {
    "name": "SJD/C32"
  },
  {
    "name": "TL"
  },
  {
    "name": "TU"
  },
  {
    "name": "TU/TL"
  },
  {
    "name": "TLN"
  },
  {
    "name": "WIK"
  },
  {
    "name": "WIK/AB"
  },
  {
    "name": "WT"
  },
  {
    "name": "crossbreed"
  }
]
