<?xml version="1.0" encoding="utf-8"?>
<!-- Generator: Adobe Illustrator 19.1.0, SVG Export Plug-In . SVG Version: 6.00 Build 0)  -->
<svg version="1.1" id="Layer_1" xmlns="http://www.w3.org/2000/svg" xmlns:xlink="http://www.w3.org/1999/xlink" x="0px" y="0px"
	 viewBox="0 0 76.1 72.9" style="enable-background:new 0 0 76.1 72.9;" xml:space="preserve">
<style type="text/css">
	.st0{fill:#FFFFFF;}
	.st1{fill:none;stroke:#000000;stroke-width:9;stroke-miterlimit:10;}
</style>
<g>
	<path class="st0" d="M62.6,14.6C74.8,27.1,74.6,47.2,62,59.4s-32.6,11.9-44.8-0.6S5.2,26.2,17.8,14"/>
	<g>
		<path class="st1" d="M62.6,14.6C74.8,27.1,74.6,47.2,62,59.4c-12.5,12.2-32.6,11.9-44.8-0.6S5.2,26.2,17.8,14"/>
		<g>
			<polygon points="0,0 31.3,32.1 31.7,0.4 			"/>
		</g>
	</g>
</g>
</svg>
