{"terms":
[
{"label":"#series_title_label_help","text": "A title given to the series, describing it shortly in order to identify it easily afterwards"},
{"label":"#series_publication_label_help","text": "The DOI to the published results of this series"},
{"label":"#series_geo_id_label_help","text": "The ID to the uploaded Series in GEO or SRA"},
{"label":"#series_public_label_help","text": "Should the series be available publicly or only to DCC members"},
{"label":".series_num_samples_label_help","text": "The number of biosamples. If the input is multiple numbers seperated by ',', the values are interpreted as the number of biological replicate per sample group"},
{"label":"#series_num_replicates_label_help","text": "The maximum number of replicates of the biosamples, leave this field empty if you entered the biological replicates in the number of samples field."},
{"label":"#series_num_assays_label_help","text": "The number of different assays applied to the samples to generate sequencing libraries"},
{"label":"#series_description_label_help","text":"A description of the series entailing the research question, the aim of the expirements, a description of the different cases in case control studies etc."},
{"label":"#series_num_replicates_label_help","text": "The maximum number of biological replicates in one biosample group (can be changed per group in the next section)"},
{"label":".series_num_control_label_help","text": "The number of biological controls. Seperated the values  by ',' where each value corresponds to the number of biological replicate per control"},
{"label":"#biosample_post_fertilization_parent","text":"The hours between fertilisation until the exitus of the organism."},
{"label":"#biosample_developmental_stage_parent","text":"Developmental stage of organism"},
{"label":"#biosample_lab_parent","text":"The lab which handled the biosamples"},
{"label":"#biosample_source_parent","text":"Where the specific fish were obtained, e.g. a zebrafish distribution center"},
{"label":"#biosample_genetic_background_parent","text":"The specific zebrafish strain of the biosample"},
{"label":"#biosample_sample_type_parent","text":"The type describes the organic material of origin for the biosample"},
{"label":"#biosample_mutation_description_parent","text":"The mutation of the biosample (optional)"},
{"label":"#biosample_treatment_parent","text":"The treatment the biosample underwent (optional)"},
{"label":"#biosample_cell_type_parent","text":"The type of the cell line (optional)"},
{"label":"#biosample_sex_parent","text":"The sex of the biosample (optional)"},
{"label":"#biosample_sex_parent","text":"The sex of the biosample (optional)"},
{"label":"#biosample_controlled_by_parent","text":"The biosample used as a biological control"},
{"label":".assay_available_assay_label_help","text":"Load previously entered assays"},
{"label":".assay_lab_label_help","text":"The lab which prepared the sequencing library with the assay"},
{"label":".assay_type_label_help","text":"The type of the assay"},
{"label":".assay_prep_label_help","text":"The library preparation used, if yours is not mentioned in the selection list, enter its name in the search/text field"},
{"label":".assay_description_label_help","text":"A description/protocol for the assay"},
{"label":".assay_target_label_help","text":"The target of the immunoprecipitation and its technical control. Enter 'input' for input controls and 'mock' for mock controls"},
{"label":"#sequencing_platform_parent","text":"The platform used for sequencing"},
{"label":"#sequencing_lab_parent","text":"The lab which did the sequencing"},
{"label":"#sequencing_instrument_parent","text":"The specific instrument used for sequencing"},
{"label":"#sequencing_range_parent","text":"The maximal read length of the sequencing"},
{"label":"#sequencing_chem_version_parent","text":"The chemistry version used for sequencing"},
{"label":"#sequencing_paired_end_help","text":"If the sequencing was performed single or paired ended"},
{"label":"#sequencing_date_help","text":"The time the sequencing was performed, if the month or day is unknown, please give at least the first month or day"},
{"label":"#data_primary_file_label","text":"The filepath to the sequencing file/first read. The format should be 'lab_folder_name/file_name' (without quotes)"},
{"label":"#data_secondary_file_label","text":"The filepath to the second read. The format should be 'lab_folder_name/file_name' (without quotes)"}
]
}
