{"terms":
[
{"label":"1-cell"},
{"label":"2-cell"},
{"label":"4-cell"},
{"label":"8-cell"},
{"label":"16-cell"},
{"label":"32-cell"},
{"label":"64-cell"},
{"label":"128-cell"},
{"label":"256-cell"},
{"label":"512-cell"},
{"label":"1k-cell"},
{"label":"High"},
{"label":"Oblong"},
{"label":"Sphere"},
{"label":"Dome"},
{"label":"30%-epiboly"},
{"label":"50%-epiboly"},
{"label":"Germ-ring"},
{"label":"Shield"},
{"label":"75%-epiboly"},
{"label":"90%-epiboly"},
{"label":"Bud"},
{"label":"1-4 somites"},
{"label":"5-9 somites"},
{"label":"10-13 somites"},
{"label":"14-19 somites"},
{"label":"20-25 somites"},
{"label":"26+ somites"},
{"label":"Prim-5"},
{"label":"Prim-15"},
{"label":"Prim-25"},
{"label":"High-pec"},
{"label":"Long-pec"},
{"label":"Pec-fin"},
{"label":"Protruding-mouth"},
{"label":"Day 4"},
{"label":"Day 5"},
{"label":"Day 6"},
{"label":"Days 7-13"},
{"label":"Days 14-20"},
{"label":"Days 21-29"},
{"label":"Days 30-44"},
{"label":"Days 45-89"},
{"label":"90 Days-2 Years"}
]
}