<?xml version="1.0" encoding="UTF-8" standalone="no"?>
<!-- Created with Inkscape (http://www.inkscape.org/) -->

<svg
   xmlns:dc="http://purl.org/dc/elements/1.1/"
   xmlns:cc="http://creativecommons.org/ns#"
   xmlns:rdf="http://www.w3.org/1999/02/22-rdf-syntax-ns#"
   xmlns:svg="http://www.w3.org/2000/svg"
   xmlns="http://www.w3.org/2000/svg"
   xmlns:sodipodi="http://sodipodi.sourceforge.net/DTD/sodipodi-0.dtd"
   xmlns:inkscape="http://www.inkscape.org/namespaces/inkscape"
   width="109.59229mm"
   height="36.412212mm"
   viewBox="0 0 109.59228 36.412212"
   version="1.1"
   id="svg48086"
   inkscape:version="0.92.3 (2405546, 2018-03-11)"
   sodipodi:docname="perceptron-scheme-simple.svg">
  <defs
     id="defs48080">
    <marker
       inkscape:stockid="DotM"
       orient="auto"
       refY="0"
       refX="0"
       id="DotM"
       style="overflow:visible"
       inkscape:isstock="true">
      <path
         id="path10540"
         d="m -2.5,-1 c 0,2.76 -2.24,5 -5,5 -2.76,0 -5,-2.24 -5,-5 0,-2.76 2.24,-5 5,-5 2.76,0 5,2.24 5,5 z"
         style="fill:#000000;fill-opacity:1;fill-rule:evenodd;stroke:#000000;stroke-width:1.00000003pt;stroke-opacity:1"
         transform="matrix(0.4,0,0,0.4,2.96,0.4)"
         inkscape:connector-curvature="0" />
    </marker>
    <marker
       inkscape:isstock="true"
       style="overflow:visible"
       id="marker12146"
       refX="0"
       refY="0"
       orient="auto"
       inkscape:stockid="Arrow1Lend">
      <path
         inkscape:connector-curvature="0"
         transform="matrix(-0.8,0,0,-0.8,-10,0)"
         style="fill:#000000;fill-opacity:1;fill-rule:evenodd;stroke:#000000;stroke-width:1.00000003pt;stroke-opacity:1"
         d="M 0,0 5,-5 -12.5,0 5,5 Z"
         id="path12144" />
    </marker>
    <marker
       inkscape:stockid="Arrow1Lstart"
       orient="auto"
       refY="0"
       refX="0"
       id="Arrow1Lstart"
       style="overflow:visible"
       inkscape:isstock="true">
      <path
         id="path49627"
         d="M 0,0 5,-5 -12.5,0 5,5 Z"
         style="fill:#000000;fill-opacity:1;fill-rule:evenodd;stroke:#000000;stroke-width:1.00000003pt;stroke-opacity:1"
         transform="matrix(0.8,0,0,0.8,10,0)"
         inkscape:connector-curvature="0" />
    </marker>
    <marker
       inkscape:stockid="Arrow1Lend"
       orient="auto"
       refY="0"
       refX="0"
       id="marker52714"
       style="overflow:visible"
       inkscape:isstock="true">
      <path
         id="path52712"
         d="M 0,0 5,-5 -12.5,0 5,5 Z"
         style="fill:#000000;fill-opacity:1;fill-rule:evenodd;stroke:#000000;stroke-width:1.00000003pt;stroke-opacity:1"
         transform="matrix(-0.8,0,0,-0.8,-10,0)"
         inkscape:connector-curvature="0" />
    </marker>
    <marker
       inkscape:isstock="true"
       style="overflow:visible"
       id="marker52218"
       refX="0"
       refY="0"
       orient="auto"
       inkscape:stockid="DotL">
      <path
         inkscape:connector-curvature="0"
         transform="matrix(0.8,0,0,0.8,5.92,0.8)"
         style="fill:#000000;fill-opacity:1;fill-rule:evenodd;stroke:#000000;stroke-width:1.00000003pt;stroke-opacity:1"
         d="m -2.5,-1 c 0,2.76 -2.24,5 -5,5 -2.76,0 -5,-2.24 -5,-5 0,-2.76 2.24,-5 5,-5 2.76,0 5,2.24 5,5 z"
         id="path52216" />
    </marker>
    <clipPath
       clipPathUnits="userSpaceOnUse"
       id="clipPath22136">
      <path
         d="M 0,0 H 599.24542 V 345.97549 H 0 Z"
         id="path22134"
         inkscape:connector-curvature="0" />
    </clipPath>
    <clipPath
       clipPathUnits="userSpaceOnUse"
       id="clipPath22136-7">
      <path
         d="M 0,0 H 599.24542 V 345.97549 H 0 Z"
         id="path22134-7"
         inkscape:connector-curvature="0" />
    </clipPath>
    <clipPath
       clipPathUnits="userSpaceOnUse"
       id="clipPath22136-7-7">
      <path
         d="M 0,0 H 599.24542 V 345.97549 H 0 Z"
         id="path22134-7-9"
         inkscape:connector-curvature="0" />
    </clipPath>
    <clipPath
       clipPathUnits="userSpaceOnUse"
       id="clipPath22136-7-7-2">
      <path
         d="M 0,0 H 599.24542 V 345.97549 H 0 Z"
         id="path22134-7-9-3"
         inkscape:connector-curvature="0" />
    </clipPath>
    <clipPath
       clipPathUnits="userSpaceOnUse"
       id="clipPath22136-7-7-2-7">
      <path
         d="M 0,0 H 599.24542 V 345.97549 H 0 Z"
         id="path22134-7-9-3-2"
         inkscape:connector-curvature="0" />
    </clipPath>
    <clipPath
       clipPathUnits="userSpaceOnUse"
       id="clipPath22136-7-7-2-1">
      <path
         d="M 0,0 H 599.24542 V 345.97549 H 0 Z"
         id="path22134-7-9-3-7"
         inkscape:connector-curvature="0" />
    </clipPath>
    <marker
       inkscape:stockid="DotL"
       orient="auto"
       refY="0"
       refX="0"
       id="DotL-5"
       style="overflow:visible"
       inkscape:isstock="true">
      <path
         inkscape:connector-curvature="0"
         id="path49688-5"
         d="m -2.5,-1 c 0,2.76 -2.24,5 -5,5 -2.76,0 -5,-2.24 -5,-5 0,-2.76 2.24,-5 5,-5 2.76,0 5,2.24 5,5 z"
         style="fill:#000000;fill-opacity:1;fill-rule:evenodd;stroke:#000000;stroke-width:1.00000003pt;stroke-opacity:1"
         transform="matrix(0.8,0,0,0.8,5.92,0.8)" />
    </marker>
    <marker
       inkscape:stockid="Arrow1Lend"
       orient="auto"
       refY="0"
       refX="0"
       id="Arrow1Lend-6"
       style="overflow:visible"
       inkscape:isstock="true">
      <path
         inkscape:connector-curvature="0"
         id="path49630-0"
         d="M 0,0 5,-5 -12.5,0 5,5 Z"
         style="fill:#000000;fill-opacity:1;fill-rule:evenodd;stroke:#000000;stroke-width:1.00000003pt;stroke-opacity:1"
         transform="matrix(-0.8,0,0,-0.8,-10,0)" />
    </marker>
    <marker
       inkscape:stockid="Arrow1Lstart"
       orient="auto"
       refY="0"
       refX="0"
       id="Arrow1Lstart-2"
       style="overflow:visible"
       inkscape:isstock="true">
      <path
         inkscape:connector-curvature="0"
         id="path49627-6"
         d="M 0,0 5,-5 -12.5,0 5,5 Z"
         style="fill:#000000;fill-opacity:1;fill-rule:evenodd;stroke:#000000;stroke-width:1.00000003pt;stroke-opacity:1"
         transform="matrix(0.8,0,0,0.8,10,0)" />
    </marker>
    <marker
       inkscape:stockid="Arrow1Lend"
       orient="auto"
       refY="0"
       refX="0"
       id="Arrow1Lend-9"
       style="overflow:visible"
       inkscape:isstock="true"
       inkscape:collect="always">
      <path
         id="path49630-1"
         d="M 0,0 5,-5 -12.5,0 5,5 Z"
         style="fill:#000000;fill-opacity:1;fill-rule:evenodd;stroke:#000000;stroke-width:1.00000003pt;stroke-opacity:1"
         transform="matrix(-0.8,0,0,-0.8,-10,0)"
         inkscape:connector-curvature="0" />
    </marker>
    <marker
       inkscape:stockid="Arrow1Lend"
       orient="auto"
       refY="0"
       refX="0"
       id="Arrow1Lend-9-7"
       style="overflow:visible"
       inkscape:isstock="true"
       inkscape:collect="always">
      <path
         id="path49630-1-0"
         d="M 0,0 5,-5 -12.5,0 5,5 Z"
         style="fill:#000000;fill-opacity:1;fill-rule:evenodd;stroke:#000000;stroke-width:1.00000003pt;stroke-opacity:1"
         transform="matrix(-0.8,0,0,-0.8,-10,0)"
         inkscape:connector-curvature="0" />
    </marker>
    <marker
       inkscape:stockid="Arrow1Lend"
       orient="auto"
       refY="0"
       refX="0"
       id="Arrow1Lend-9-7-1"
       style="overflow:visible"
       inkscape:isstock="true"
       inkscape:collect="always">
      <path
         id="path49630-1-0-8"
         d="M 0,0 5,-5 -12.5,0 5,5 Z"
         style="fill:#000000;fill-opacity:1;fill-rule:evenodd;stroke:#000000;stroke-width:1.00000003pt;stroke-opacity:1"
         transform="matrix(-0.8,0,0,-0.8,-10,0)"
         inkscape:connector-curvature="0" />
    </marker>
    <marker
       inkscape:stockid="Arrow1Lend"
       orient="auto"
       refY="0"
       refX="0"
       id="Arrow1Lend-9-7-1-5"
       style="overflow:visible"
       inkscape:isstock="true"
       inkscape:collect="always">
      <path
         id="path49630-1-0-8-9"
         d="M 0,0 5,-5 -12.5,0 5,5 Z"
         style="fill:#000000;fill-opacity:1;fill-rule:evenodd;stroke:#000000;stroke-width:1.00000003pt;stroke-opacity:1"
         transform="matrix(-0.8,0,0,-0.8,-10,0)"
         inkscape:connector-curvature="0" />
    </marker>
    <marker
       inkscape:stockid="Arrow1Lend"
       orient="auto"
       refY="0"
       refX="0"
       id="Arrow1Lend-9-7-1-5-9"
       style="overflow:visible"
       inkscape:isstock="true"
       inkscape:collect="always">
      <path
         id="path49630-1-0-8-9-7"
         d="M 0,0 5,-5 -12.5,0 5,5 Z"
         style="fill:#000000;fill-opacity:1;fill-rule:evenodd;stroke:#000000;stroke-width:1.00000003pt;stroke-opacity:1"
         transform="matrix(-0.8,0,0,-0.8,-10,0)"
         inkscape:connector-curvature="0" />
    </marker>
  </defs>
  <sodipodi:namedview
     id="base"
     pagecolor="#ffffff"
     bordercolor="#666666"
     borderopacity="1.0"
     inkscape:pageopacity="0.0"
     inkscape:pageshadow="2"
     inkscape:zoom="2.8"
     inkscape:cx="97.866591"
     inkscape:cy="76.898975"
     inkscape:document-units="mm"
     inkscape:current-layer="layer1"
     showgrid="false"
     fit-margin-top="0"
     fit-margin-left="0"
     fit-margin-right="0"
     fit-margin-bottom="0"
     showguides="false"
     inkscape:window-width="1916"
     inkscape:window-height="1041"
     inkscape:window-x="1920"
     inkscape:window-y="18"
     inkscape:window-maximized="0"
     inkscape:guide-bbox="true"
     inkscape:lockguides="true">
    <sodipodi:guide
       position="-11.60406,49.853703"
       orientation="1,0"
       id="guide49520"
       inkscape:locked="true" />
  </sodipodi:namedview>
  <metadata
     id="metadata48083">
    <rdf:RDF>
      <cc:Work
         rdf:about="">
        <dc:format>image/svg+xml</dc:format>
        <dc:type
           rdf:resource="http://purl.org/dc/dcmitype/StillImage" />
        <dc:title></dc:title>
      </cc:Work>
    </rdf:RDF>
  </metadata>
  <g
     inkscape:label="Calque 1"
     inkscape:groupmode="layer"
     id="layer1"
     transform="translate(-61.689637,-72.746635)">
    <g
       id="g22460"
       transform="matrix(0.12515497,0,0,0.12515497,47.429797,109.923)" />
    <path
       style="fill:none;fill-rule:evenodd;stroke:#000000;stroke-width:0.15000001;stroke-linecap:butt;stroke-linejoin:miter;stroke-miterlimit:4;stroke-dasharray:none;stroke-dashoffset:0;stroke-opacity:1;marker-end:url(#marker12146)"
       d="M 142.15062,102.36859 82.205801,102.31579 82.12818,88.891626"
       id="path49897-5-2-6-78"
       inkscape:connector-curvature="0"
       sodipodi:nodetypes="ccc" />
    <text
       xml:space="preserve"
       style="font-style:normal;font-weight:normal;font-size:1.41111112px;line-height:125%;font-family:sans-serif;text-align:center;letter-spacing:0px;word-spacing:0px;text-anchor:middle;fill:#000000;fill-opacity:1;stroke:none;stroke-width:0.26458332px;stroke-linecap:butt;stroke-linejoin:miter;stroke-opacity:1"
       x="81.713737"
       y="74.092293"
       id="text48887-3-4-6"><tspan
         sodipodi:role="line"
         id="tspan48885-5-3-4"
         x="81.713737"
         y="74.092293"
         style="font-size:1.41111112px;text-align:center;text-anchor:middle;stroke-width:0.26458332px">\textit{transfer function}</tspan></text>
    <g
       id="g13027"
       transform="translate(-3.1750001)">
      <rect
         ry="1.6003684"
         y="98.807861"
         x="97.987656"
         height="6.9663091"
         width="37.066879"
         id="rect52198"
         style="opacity:1;fill:#ffffff;fill-opacity:1;stroke:#000000;stroke-width:0.20176159;stroke-linejoin:round;stroke-miterlimit:4;stroke-dasharray:0.20176155, 0.20176155;stroke-dashoffset:0;stroke-opacity:1" />
      <text
         id="text52202"
         y="102.81707"
         x="116.04173"
         style="font-style:normal;font-weight:normal;font-size:1.41111112px;line-height:125%;font-family:sans-serif;text-align:center;letter-spacing:0px;word-spacing:0px;text-anchor:middle;fill:#000000;fill-opacity:1;stroke:none;stroke-width:0.26458332px;stroke-linecap:butt;stroke-linejoin:miter;stroke-opacity:1"
         xml:space="preserve"><tspan
           style="text-align:center;text-anchor:middle;stroke-width:0.26458332px"
           y="102.81707"
           x="116.26635"
           id="tspan52200"
           sodipodi:role="line">$\Delta \mathbf{w}$ $\leftarrow$ gradient descent </tspan></text>
    </g>
    <text
       xml:space="preserve"
       style="font-style:normal;font-weight:normal;font-size:1.41111112px;line-height:125%;font-family:sans-serif;text-align:center;letter-spacing:0px;word-spacing:0px;text-anchor:middle;fill:#000000;fill-opacity:1;stroke:none;stroke-width:0.26458332px;stroke-linecap:butt;stroke-linejoin:miter;stroke-opacity:1"
       x="67.910851"
       y="81.198799"
       id="text48887-7"><tspan
         sodipodi:role="line"
         id="tspan48885-0"
         x="67.910851"
         y="81.198799"
         style="font-size:1.41111112px;text-align:center;text-anchor:middle;stroke-width:0.26458332px">$\mathbf{x}$</tspan></text>
    <g
       id="g9738-3"
       transform="translate(15.731829,-56.940157)">
      <text
         id="text48887-7-5"
         y="139.44504"
         x="66.317116"
         style="font-style:normal;font-weight:normal;font-size:1.41111112px;line-height:125%;font-family:sans-serif;text-align:center;letter-spacing:0px;word-spacing:0px;text-anchor:middle;fill:#000000;fill-opacity:1;stroke:none;stroke-width:0.26458332px;stroke-linecap:butt;stroke-linejoin:miter;stroke-opacity:1"
         xml:space="preserve"><tspan
           style="font-size:1.41111112px;text-align:center;text-anchor:middle;stroke-width:0.26458332px"
           y="139.44504"
           x="66.317116"
           id="tspan48885-0-6"
           sodipodi:role="line">$a(\mathbf{x},\mathbf{w})$</tspan></text>
      <path
         inkscape:connector-curvature="0"
         id="path22250-5-67-2"
         style="fill:none;stroke:#000600;stroke-width:0.40000001;stroke-linecap:butt;stroke-linejoin:round;stroke-miterlimit:4;stroke-dasharray:none;stroke-opacity:1"
         d="m 73.046539,139.02389 c 0,3.71705 -3.012919,6.72996 -6.729648,6.72996 -3.71673,0 -6.729886,-3.01291 -6.729886,-6.72996 0,-3.71674 3.013156,-6.72965 6.729886,-6.72965 3.716729,0 6.729648,3.01291 6.729648,6.72965 z" />
    </g>
    <path
       style="fill:none;fill-rule:evenodd;stroke:#000000;stroke-width:0.15000001;stroke-linecap:butt;stroke-linejoin:miter;stroke-miterlimit:4;stroke-dasharray:none;stroke-opacity:1;marker-end:url(#Arrow1Lend-9)"
       d="m 61.690167,82.171983 13.249352,-0.0937"
       id="path49897-5-2"
       inkscape:connector-curvature="0"
       sodipodi:nodetypes="cc" />
    <text
       xml:space="preserve"
       style="font-style:normal;font-weight:normal;font-size:1.41111112px;line-height:125%;font-family:sans-serif;text-align:center;letter-spacing:0px;word-spacing:0px;text-anchor:middle;fill:#000000;fill-opacity:1;stroke:none;stroke-width:0.26458332px;stroke-linecap:butt;stroke-linejoin:miter;stroke-opacity:1"
       x="94.511223"
       y="81.11055"
       id="text48887-7-9"><tspan
         sodipodi:role="line"
         id="tspan48885-0-3"
         x="94.511223"
         y="81.11055"
         style="font-size:1.41111112px;text-align:center;text-anchor:middle;stroke-width:0.26458332px">$a$</tspan></text>
    <g
       id="g9738-3-6"
       transform="translate(42.820029,-57.02841)">
      <text
         id="text48887-7-5-0"
         y="139.44504"
         x="66.317116"
         style="font-style:normal;font-weight:normal;font-size:1.41111112px;line-height:125%;font-family:sans-serif;text-align:center;letter-spacing:0px;word-spacing:0px;text-anchor:middle;fill:#000000;fill-opacity:1;stroke:none;stroke-width:0.26458332px;stroke-linecap:butt;stroke-linejoin:miter;stroke-opacity:1"
         xml:space="preserve"><tspan
           style="font-size:1.41111112px;text-align:center;text-anchor:middle;stroke-width:0.26458332px"
           y="139.44504"
           x="66.317116"
           id="tspan48885-0-6-6"
           sodipodi:role="line">$z(a)$</tspan></text>
      <path
         inkscape:connector-curvature="0"
         id="path22250-5-67-2-2"
         style="fill:none;stroke:#000600;stroke-width:0.40000001;stroke-linecap:butt;stroke-linejoin:round;stroke-miterlimit:4;stroke-dasharray:none;stroke-opacity:1"
         d="m 73.046539,139.02389 c 0,3.71705 -3.012919,6.72996 -6.729648,6.72996 -3.71673,0 -6.729886,-3.01291 -6.729886,-6.72996 0,-3.71674 3.013156,-6.72965 6.729886,-6.72965 3.716729,0 6.729648,3.01291 6.729648,6.72965 z" />
    </g>
    <path
       style="fill:none;fill-rule:evenodd;stroke:#000000;stroke-width:0.15000001;stroke-linecap:butt;stroke-linejoin:miter;stroke-miterlimit:4;stroke-dasharray:none;stroke-opacity:1;marker-end:url(#Arrow1Lend-9-7)"
       d="m 88.778368,82.083733 13.249352,-0.0937"
       id="path49897-5-2-6"
       inkscape:connector-curvature="0"
       sodipodi:nodetypes="cc" />
    <text
       xml:space="preserve"
       style="font-style:normal;font-weight:normal;font-size:1.41111112px;line-height:125%;font-family:sans-serif;text-align:center;letter-spacing:0px;word-spacing:0px;text-anchor:middle;fill:#000000;fill-opacity:1;stroke:none;stroke-width:0.26458332px;stroke-linecap:butt;stroke-linejoin:miter;stroke-opacity:1"
       x="121.59942"
       y="81.022293"
       id="text48887-7-9-7"><tspan
         sodipodi:role="line"
         id="tspan48885-0-3-9"
         x="121.59942"
         y="81.022293"
         style="font-size:1.41111112px;text-align:center;text-anchor:middle;stroke-width:0.26458332px">$z$</tspan></text>
    <g
       id="g9738-3-6-2"
       transform="translate(69.908228,-57.116664)">
      <text
         id="text48887-7-5-0-0"
         y="139.44504"
         x="66.317116"
         style="font-style:normal;font-weight:normal;font-size:1.41111112px;line-height:125%;font-family:sans-serif;text-align:center;letter-spacing:0px;word-spacing:0px;text-anchor:middle;fill:#000000;fill-opacity:1;stroke:none;stroke-width:0.26458332px;stroke-linecap:butt;stroke-linejoin:miter;stroke-opacity:1"
         xml:space="preserve"><tspan
           style="font-size:1.41111112px;text-align:center;text-anchor:middle;stroke-width:0.26458332px"
           y="139.44504"
           x="66.317116"
           id="tspan48885-0-6-6-2"
           sodipodi:role="line">$y(z)$</tspan></text>
      <path
         inkscape:connector-curvature="0"
         id="path22250-5-67-2-2-3"
         style="fill:none;stroke:#000600;stroke-width:0.40000001;stroke-linecap:butt;stroke-linejoin:round;stroke-miterlimit:4;stroke-dasharray:none;stroke-opacity:1"
         d="m 73.046539,139.02389 c 0,3.71705 -3.012919,6.72996 -6.729648,6.72996 -3.71673,0 -6.729886,-3.01291 -6.729886,-6.72996 0,-3.71674 3.013156,-6.72965 6.729886,-6.72965 3.716729,0 6.729648,3.01291 6.729648,6.72965 z" />
    </g>
    <path
       style="fill:none;fill-rule:evenodd;stroke:#000000;stroke-width:0.15000001;stroke-linecap:butt;stroke-linejoin:miter;stroke-miterlimit:4;stroke-dasharray:none;stroke-opacity:1;marker-end:url(#Arrow1Lend-9-7-1)"
       d="m 115.86656,81.99548 13.24936,-0.0937"
       id="path49897-5-2-6-7"
       inkscape:connector-curvature="0"
       sodipodi:nodetypes="cc" />
    <text
       xml:space="preserve"
       style="font-style:normal;font-weight:normal;font-size:1.41111112px;line-height:125%;font-family:sans-serif;text-align:start;letter-spacing:0px;word-spacing:0px;text-anchor:start;fill:#000000;fill-opacity:1;stroke:none;stroke-width:0.26458332px;stroke-linecap:butt;stroke-linejoin:miter;stroke-opacity:1"
       x="162.1429"
       y="81.067673"
       id="text48887-7-9-7-2"><tspan
         sodipodi:role="line"
         id="tspan48885-0-3-9-2"
         x="162.1429"
         y="81.067673"
         style="font-size:1.41111112px;text-align:start;text-anchor:start;stroke-width:0.26458332px">$y$</tspan></text>
    <path
       style="fill:none;fill-rule:evenodd;stroke:#000000;stroke-width:0.15000001;stroke-linecap:butt;stroke-linejoin:miter;stroke-miterlimit:4;stroke-dasharray:none;stroke-opacity:1;marker-end:url(#Arrow1Lend-9-7-1-5)"
       d="m 142.95477,81.907226 18.54103,-0.0937"
       id="path49897-5-2-6-7-8"
       inkscape:connector-curvature="0"
       sodipodi:nodetypes="cc" />
    <path
       style="fill:none;fill-rule:evenodd;stroke:#000000;stroke-width:0.15000001;stroke-linecap:butt;stroke-linejoin:miter;stroke-miterlimit:4;stroke-dasharray:none;stroke-opacity:1;marker-start:url(#DotM);marker-end:url(#Arrow1Lend-9-7-1-5-9)"
       d="m 148.73108,81.840396 0.0937,13.249356"
       id="path49897-5-2-6-7-8-3"
       inkscape:connector-curvature="0"
       sodipodi:nodetypes="cc" />
    <text
       xml:space="preserve"
       style="font-style:normal;font-weight:normal;font-size:1.41111112px;line-height:125%;font-family:sans-serif;text-align:start;letter-spacing:0px;word-spacing:0px;text-anchor:start;fill:#000000;fill-opacity:1;stroke:none;stroke-width:0.26458332px;stroke-linecap:butt;stroke-linejoin:miter;stroke-opacity:1"
       x="149.5092"
       y="91.144539"
       id="text48887-7-9-7-2-6"><tspan
         sodipodi:role="line"
         id="tspan48885-0-3-9-2-1"
         x="149.5092"
         y="91.144539"
         style="font-size:1.41111112px;text-align:start;text-anchor:start;stroke-width:0.26458332px">$y$</tspan></text>
    <g
       id="g9738-3-6-2-2"
       transform="translate(82.67201,-36.795001)">
      <text
         id="text48887-7-5-0-0-9"
         y="139.44504"
         x="66.317116"
         style="font-style:normal;font-weight:normal;font-size:1.41111112px;line-height:125%;font-family:sans-serif;text-align:center;letter-spacing:0px;word-spacing:0px;text-anchor:middle;fill:#000000;fill-opacity:1;stroke:none;stroke-width:0.26458332px;stroke-linecap:butt;stroke-linejoin:miter;stroke-opacity:1"
         xml:space="preserve"><tspan
           style="font-size:1.41111112px;text-align:center;text-anchor:middle;stroke-width:0.26458332px"
           y="139.44504"
           x="66.317116"
           id="tspan48885-0-6-6-2-3"
           sodipodi:role="line">$L(y)$</tspan></text>
      <path
         inkscape:connector-curvature="0"
         id="path22250-5-67-2-2-3-1"
         style="fill:none;stroke:#000600;stroke-width:0.40000001;stroke-linecap:butt;stroke-linejoin:round;stroke-miterlimit:4;stroke-dasharray:none;stroke-opacity:1"
         d="m 73.046539,139.02389 c 0,3.71705 -3.012919,6.72996 -6.729648,6.72996 -3.71673,0 -6.729886,-3.01291 -6.729886,-6.72996 0,-3.71674 3.013156,-6.72965 6.729886,-6.72965 3.716729,0 6.729648,3.01291 6.729648,6.72965 z" />
    </g>
    <text
       xml:space="preserve"
       style="font-style:normal;font-weight:normal;font-size:1.41111112px;line-height:125%;font-family:sans-serif;text-align:center;letter-spacing:0px;word-spacing:0px;text-anchor:middle;fill:#000000;fill-opacity:1;stroke:none;stroke-width:0.26458332px;stroke-linecap:butt;stroke-linejoin:miter;stroke-opacity:1"
       x="109.25257"
       y="74.092293"
       id="text48887-3-4-6-36"><tspan
         sodipodi:role="line"
         id="tspan48885-5-3-4-10"
         x="109.25257"
         y="74.092293"
         style="font-size:1.41111112px;text-align:center;text-anchor:middle;stroke-width:0.26458332px">\textit{activation function}</tspan></text>
    <text
       xml:space="preserve"
       style="font-style:normal;font-weight:normal;font-size:1.41111112px;line-height:125%;font-family:sans-serif;text-align:center;letter-spacing:0px;word-spacing:0px;text-anchor:middle;fill:#000000;fill-opacity:1;stroke:none;stroke-width:0.26458332px;stroke-linecap:butt;stroke-linejoin:miter;stroke-opacity:1"
       x="136.68037"
       y="73.818748"
       id="text48887-3-4-6-36-6"><tspan
         sodipodi:role="line"
         id="tspan48885-5-3-4-10-3"
         x="136.68037"
         y="73.818748"
         style="font-size:1.41111112px;text-align:center;text-anchor:middle;stroke-width:0.26458332px">\textit{output function}</tspan></text>
    <text
       xml:space="preserve"
       style="font-style:normal;font-weight:normal;font-size:1.41111112px;line-height:125%;font-family:sans-serif;text-align:start;letter-spacing:0px;word-spacing:0px;text-anchor:start;fill:#000000;fill-opacity:1;stroke:none;stroke-width:0.26458332px;stroke-linecap:butt;stroke-linejoin:miter;stroke-opacity:1"
       x="156.51004"
       y="102.32143"
       id="text48887-3-4-6-36-6-2"><tspan
         sodipodi:role="line"
         id="tspan48885-5-3-4-10-3-0"
         x="156.51004"
         y="102.32143"
         style="font-size:1.41111112px;text-align:start;text-anchor:start;stroke-width:0.26458332px">\textit{loss function}</tspan></text>
    <text
       xml:space="preserve"
       style="font-style:normal;font-weight:normal;font-size:1.41111112px;line-height:125%;font-family:sans-serif;text-align:start;letter-spacing:0px;word-spacing:0px;text-anchor:start;fill:#000000;fill-opacity:1;stroke:none;stroke-width:0.26458332px;stroke-linecap:butt;stroke-linejoin:miter;stroke-opacity:1"
       x="83.074326"
       y="93.945297"
       id="text12977"><tspan
         sodipodi:role="line"
         id="tspan12975"
         x="83.074326"
         y="93.945297"
         style="text-align:start;text-anchor:start;stroke-width:0.26458332px">$\mathbf{w} + \Delta \mathbf{w} \rightarrow \mathbf{w}$</tspan></text>
  </g>
</svg>
