{
  "img/Fissuration-TiAl2O5__036_-_01542.tif": {
    "pressure": 99.6605, 
    "temperature": 1070.18
  }, 
  "img/Fissuration-TiAl2O5__036_-_01541.tif": {
    "pressure": 100.042, 
    "temperature": 1072.74
  }, 
  "img/Fissuration-TiAl2O5__036_-_01491.tif": {
    "pressure": 100.042, 
    "temperature": 1101.76
  }, 
  "img/Fissuration-TiAl2O5__036_-_01490.tif": {
    "pressure": 100.423, 
    "temperature": 1102.57
  }
}