# column: 1, label: it
# column: 2, label: broken
# column: 3, label: force
# column: 4, label: pos
0	0	-1.2261431322e+01	-4.6449842528e-01	
20	0	5.5783516921e+05	-4.6450242528e-01	
40	0	5.2612365475e+05	-4.6450642528e-01	
60	0	5.1126459531e+05	-4.6451042528e-01	
80	0	5.0346137297e+05	-4.6451442528e-01	
100	0	5.9211801170e+05	-4.6451842528e-01	
120	0	8.8921281016e+05	-4.6452242528e-01	
