<?xml version="1.0" encoding="UTF-8" standalone="no"?>
<!-- Created with matplotlib (http://matplotlib.org/) -->

<svg
   xmlns:dc="http://purl.org/dc/elements/1.1/"
   xmlns:cc="http://creativecommons.org/ns#"
   xmlns:rdf="http://www.w3.org/1999/02/22-rdf-syntax-ns#"
   xmlns:svg="http://www.w3.org/2000/svg"
   xmlns="http://www.w3.org/2000/svg"
   xmlns:xlink="http://www.w3.org/1999/xlink"
   xmlns:sodipodi="http://sodipodi.sourceforge.net/DTD/sodipodi-0.dtd"
   xmlns:inkscape="http://www.inkscape.org/namespaces/inkscape"
   height="623.88586pt"
   version="1.1"
   viewBox="0 0 1156.3704 623.88587"
   width="1156.3704pt"
   id="svg1433"
   sodipodi:docname="loss.svg"
   inkscape:version="0.92.3 (2405546, 2018-03-11)">
  <metadata
     id="metadata1437">
    <rdf:RDF>
      <cc:Work
         rdf:about="">
        <dc:format>image/svg+xml</dc:format>
        <dc:type
           rdf:resource="http://purl.org/dc/dcmitype/StillImage" />
        <dc:title></dc:title>
      </cc:Work>
    </rdf:RDF>
  </metadata>
  <sodipodi:namedview
     pagecolor="#ffffff"
     bordercolor="#666666"
     borderopacity="1"
     objecttolerance="10"
     gridtolerance="10"
     guidetolerance="10"
     inkscape:pageopacity="0"
     inkscape:pageshadow="2"
     inkscape:window-width="1916"
     inkscape:window-height="1041"
     id="namedview1435"
     showgrid="false"
     fit-margin-top="0"
     fit-margin-left="0"
     fit-margin-right="0"
     fit-margin-bottom="0"
     inkscape:zoom="0.54455939"
     inkscape:cx="882.63096"
     inkscape:cy="336.84104"
     inkscape:window-x="0"
     inkscape:window-y="18"
     inkscape:window-maximized="0"
     inkscape:current-layer="svg1433" />
  <defs
     id="defs1167"
     style="stroke-linecap:butt;stroke-linejoin:round">
    <style
       type="text/css"
       id="style1165">
*{stroke-linecap:butt;stroke-linejoin:round;}
  </style>
    <defs
       id="defs1397">
      <path
         d="M 9.421875,75.984375 H 18.40625 V 0 H 9.421875 Z"
         id="DejaVuSans-6c"
         inkscape:connector-curvature="0"
         style="stroke-linecap:butt;stroke-linejoin:round" />
      <path
         d="m 44.28125,53.078125 v -8.5 Q 40.484375,46.53125 36.375,47.5 q -4.09375,0.984375 -8.5,0.984375 -6.6875,0 -10.03125,-2.046875 Q 14.5,44.390625 14.5,40.28125 q 0,-3.125 2.390625,-4.90625 2.390625,-1.78125 9.625,-3.390625 l 3.078125,-0.6875 Q 39.15625,29.25 43.1875,25.515625 47.21875,21.78125 47.21875,15.09375 q 0,-7.625 -6.03125,-12.078125 -6.03125,-4.4375 -16.578125,-4.4375 -4.390625,0 -9.15625,0.859375 Q 10.6875,0.296875 5.421875,2 v 9.28125 q 4.984375,-2.59375 9.8125,-3.890625 4.828125,-1.28125 9.578125,-1.28125 6.34375,0 9.75,2.171875 3.421875,2.171875 3.421875,6.125 0,3.65625 -2.46875,5.609375 -2.453125,1.953125 -10.8125,3.765625 l -3.125,0.734375 q -8.34375,1.75 -12.0625,5.390625 -3.703125,3.640625 -3.703125,9.984375 0,7.71875 5.46875,11.90625 Q 16.75,56 26.8125,56 q 4.96875,0 9.359375,-0.734375 4.40625,-0.71875 8.109375,-2.1875 z"
         id="DejaVuSans-73"
         inkscape:connector-curvature="0"
         style="stroke-linecap:butt;stroke-linejoin:round" />
    </defs>
    <defs
       id="defs1306">
      <path
         inkscape:connector-curvature="0"
         style="stroke:#000000;stroke-width:0.80000001;stroke-linecap:butt;stroke-linejoin:round"
         id="m60584d358c"
         d="M 0,0 H -3.5" />
    </defs>
    <defs
       id="defs1325">
      <path
         style="stroke-linecap:butt;stroke-linejoin:round"
         inkscape:connector-curvature="0"
         id="DejaVuSans-35"
         d="m 10.796875,72.90625 h 38.71875 v -8.3125 h -29.6875 V 46.734375 q 2.140625,0.734375 4.28125,1.09375 2.15625,0.359375 4.3125,0.359375 Q 40.625,48.1875 47.75,41.5 54.890625,34.8125 54.890625,23.390625 54.890625,11.625 47.5625,5.09375 40.234375,-1.421875 26.90625,-1.421875 q -4.59375,0 -9.359375,0.78125 -4.75,0.78125 -9.828125,2.34375 V 11.625 q 4.390625,-2.390625 9.078125,-3.5625 4.6875,-1.171875 9.90625,-1.171875 8.453125,0 13.375,4.4375 4.9375,4.4375 4.9375,12.0625 0,7.609375 -4.9375,12.046875 -4.921875,4.453125 -13.375,4.453125 -3.953125,0 -7.890625,-0.875 -3.921875,-0.875 -8.015625,-2.734375 z" />
    </defs>
  </defs>
  <g
     id="patch_2"
     style="stroke-linecap:butt;stroke-linejoin:round"
     transform="translate(-85.597618,-86.6048)">
    <path
       d="M 172.44,645.2856 H 1241.568 V 87.0048 H 172.44 Z"
       style="fill:#ffffff;stroke-linecap:butt;stroke-linejoin:round"
       id="path1172"
       inkscape:connector-curvature="0" />
  </g>
  <g
     id="line2d_1"
     style="stroke-linecap:butt;stroke-linejoin:round"
     transform="translate(-85.597618,-86.6048)">
    <defs
       id="defs1176">
      <path
         d="M 0,0 V 3.5"
         id="mbf65fef6e1"
         style="stroke:#000000;stroke-width:0.80000001;stroke-linecap:butt;stroke-linejoin:round"
         inkscape:connector-curvature="0" />
    </defs>
    <g
       id="g1180"
       style="stroke-linecap:butt;stroke-linejoin:round">
      <use
         style="stroke:#000000;stroke-width:0.80000001;stroke-linecap:butt;stroke-linejoin:round"
         x="221.03673"
         xlink:href="#mbf65fef6e1"
         y="645.28558"
         id="use1178"
         width="100%"
         height="100%" />
    </g>
  </g>
  <use
     style="stroke:#000000;stroke-width:0.80000001;stroke-linecap:butt;stroke-linejoin:round"
     x="172.44"
     xlink:href="#m60584d358c"
     y="634.79346"
     id="use1308"
     width="100%"
     height="100%"
     transform="translate(-85.597618,-86.6048)" />
  <use
     style="stroke:#000000;stroke-width:0.80000001;stroke-linecap:butt;stroke-linejoin:round"
     x="172.44"
     xlink:href="#m60584d358c"
     y="530.31104"
     id="use1319"
     width="100%"
     height="100%"
     transform="translate(-85.597618,-86.6048)" />
  <use
     style="stroke:#000000;stroke-width:0.80000001;stroke-linecap:butt;stroke-linejoin:round"
     x="172.44"
     xlink:href="#m60584d358c"
     y="425.82855"
     id="use1335"
     width="100%"
     height="100%"
     transform="translate(-85.597618,-86.6048)" />
  <use
     style="stroke:#000000;stroke-width:0.80000001;stroke-linecap:butt;stroke-linejoin:round"
     x="172.44"
     xlink:href="#m60584d358c"
     y="321.3461"
     id="use1350"
     width="100%"
     height="100%"
     transform="translate(-85.597618,-86.6048)" />
  <use
     style="stroke:#000000;stroke-width:0.80000001;stroke-linecap:butt;stroke-linejoin:round"
     x="172.44"
     xlink:href="#m60584d358c"
     y="216.86365"
     id="use1365"
     width="100%"
     height="100%"
     transform="translate(-85.597618,-86.6048)" />
  <use
     style="stroke:#000000;stroke-width:0.80000001;stroke-linecap:butt;stroke-linejoin:round"
     x="172.44"
     xlink:href="#m60584d358c"
     y="112.3812"
     id="use1380"
     width="100%"
     height="100%"
     transform="translate(-85.597618,-86.6048)" />
  <g
     id="line2d_13"
     style="stroke-width:5.6692915;stroke-linecap:butt;stroke-linejoin:round;stroke-miterlimit:4;stroke-dasharray:none"
     transform="translate(-85.597618,-86.6048)">
    <path
       clip-path="url(#p2e08660455)"
       d="m 221.03673,112.3812 0.9729,78.03986 0.97291,62.19125 0.97291,49.41015 0.97291,39.18227 0.9729,31.29245 0.97291,25.28428 0.97291,20.7049 0.97291,17.18536 0.9729,14.44847 0.97291,12.29244 0.97291,10.57168 0.97291,9.18096 0.9729,8.0436 1.94582,13.4209 1.94581,10.74793 1.94582,8.80328 1.94581,7.34649 1.94582,6.2278 1.94581,5.35036 1.94582,4.64949 1.94581,4.08073 1.94582,3.61273 1.94581,3.22293 1.94582,2.89473 2.91872,3.83166 2.91872,3.33012 2.91872,2.92406 2.91873,2.59049 2.91872,2.31291 2.91872,2.07935 3.89163,2.46872 3.89163,2.18014 3.89163,1.94139 4.86454,2.14935 4.86454,1.895 5.83744,2.0003 5.83745,1.7563 6.81035,1.79891 6.81035,1.57939 7.78326,1.58683 8.75617,1.55977 9.72907,1.50816 10.70198,1.44043 12.6478,1.46853 13.6207,1.35842 15.56652,1.33123 17.51234,1.2782 20.43105,1.26508 23.34978,1.21832 27.24141,1.19017 31.13304,1.13247 36.97048,1.112 42.80793,1.05693 50.59119,1.01892 60.32026,0.98267 71.99515,0.94053 86.58877,0.89931 105.074,0.85935 128.42382,0.81861 92.4262,0.47894 v 0"
       style="fill:none;stroke:#1f77b4;stroke-width:5.6692915;stroke-linecap:square;stroke-linejoin:round;stroke-miterlimit:4;stroke-dasharray:none"
       id="path1411"
       inkscape:connector-curvature="0" />
  </g>
  <path
     inkscape:connector-curvature="0"
     id="path1414"
     style="fill:none;stroke:#000000;stroke-width:0.80000001;stroke-linecap:square;stroke-linejoin:miter"
     d="M 86.842378,558.6808 V 0.40000003" />
  <g
     id="patch_4"
     style="stroke-linecap:butt;stroke-linejoin:round"
     transform="translate(-85.597618,-86.6048)">
    <path
       d="M 1241.568,645.2856 V 87.0048"
       style="fill:none;stroke:#000000;stroke-width:0.80000001;stroke-linecap:square;stroke-linejoin:miter"
       id="path1417"
       inkscape:connector-curvature="0" />
  </g>
  <g
     id="patch_5"
     style="stroke-linecap:butt;stroke-linejoin:round"
     transform="translate(-85.597618,-86.6048)">
    <path
       d="M 172.44,645.2856 H 1241.568"
       style="fill:none;stroke:#000000;stroke-width:0.80000001;stroke-linecap:square;stroke-linejoin:miter"
       id="path1420"
       inkscape:connector-curvature="0" />
  </g>
  <g
     id="patch_6"
     style="stroke-linecap:butt;stroke-linejoin:round"
     transform="translate(-85.597618,-86.6048)">
    <path
       d="M 172.44,87.0048 H 1241.568"
       style="fill:none;stroke:#000000;stroke-width:0.80000001;stroke-linecap:square;stroke-linejoin:miter"
       id="path1423"
       inkscape:connector-curvature="0" />
  </g>
  <defs
     id="defs1431">
    <clipPath
       id="p2e08660455"
       style="stroke-linecap:butt;stroke-linejoin:round">
      <rect
         height="558.28082"
         width="1069.1281"
         x="172.44"
         y="87.004799"
         id="rect1428"
         style="stroke-linecap:butt;stroke-linejoin:round" />
    </clipPath>
  </defs>
  <text
     xml:space="preserve"
     style="font-style:normal;font-weight:normal;font-size:20px;line-height:125%;font-family:sans-serif;text-align:center;letter-spacing:0px;word-spacing:0px;text-anchor:middle;fill:#000000;fill-opacity:1;stroke:none;stroke-width:0.75px;stroke-linecap:butt;stroke-linejoin:miter;stroke-opacity:1"
     x="632.64984"
     y="619.72571"
     id="text1943"><tspan
       sodipodi:role="line"
       id="tspan1941"
       style="font-size:20px;text-align:center;text-anchor:middle;stroke-width:0.75px;stroke-linecap:butt;stroke-linejoin:round"
       x="632.64984"
       y="619.72571">Epoch</tspan></text>
  <text
     xml:space="preserve"
     style="font-style:normal;font-weight:normal;font-size:20px;line-height:125%;font-family:sans-serif;text-align:center;letter-spacing:0px;word-spacing:0px;text-anchor:middle;fill:#000000;fill-opacity:1;stroke:none;stroke-width:0.75px;stroke-linecap:butt;stroke-linejoin:miter;stroke-opacity:1"
     x="134.28796"
     y="594.12866"
     id="text1943-3"><tspan
       sodipodi:role="line"
       id="tspan1941-6"
       style="font-size:20px;text-align:center;text-anchor:middle;stroke-width:0.75px;stroke-linecap:butt;stroke-linejoin:round"
       x="134.28796"
       y="594.12866">0</tspan></text>
  <text
     xml:space="preserve"
     style="font-style:normal;font-weight:normal;font-size:20px;line-height:125%;font-family:sans-serif;text-align:center;letter-spacing:0px;word-spacing:0px;text-anchor:middle;fill:#000000;fill-opacity:1;stroke:none;stroke-width:0.75px;stroke-linecap:butt;stroke-linejoin:miter;stroke-opacity:1"
     x="329.79309"
     y="594.12866"
     id="text1943-3-7"><tspan
       sodipodi:role="line"
       id="tspan1941-6-5"
       style="font-size:20px;text-align:center;text-anchor:middle;stroke-width:0.75px;stroke-linecap:butt;stroke-linejoin:round"
       x="329.79309"
       y="594.12866">200</tspan></text>
  <g
     id="line2d_2"
     style="stroke-linecap:butt;stroke-linejoin:round"
     transform="translate(-85.597618,-86.6048)">
    <g
       id="g1194"
       style="stroke-linecap:butt;stroke-linejoin:round">
      <use
         style="stroke:#000000;stroke-width:0.80000001;stroke-linecap:butt;stroke-linejoin:round"
         x="415.61823"
         xlink:href="#mbf65fef6e1"
         y="645.28558"
         id="use1192"
         width="100%"
         height="100%" />
    </g>
  </g>
  <g
     id="line2d_3"
     style="stroke-linecap:butt;stroke-linejoin:round"
     transform="translate(-85.597618,-86.6048)">
    <g
       id="g1212"
       style="stroke-linecap:butt;stroke-linejoin:round">
      <use
         style="stroke:#000000;stroke-width:0.80000001;stroke-linecap:butt;stroke-linejoin:round"
         x="610.19971"
         xlink:href="#mbf65fef6e1"
         y="645.28558"
         id="use1210"
         width="100%"
         height="100%" />
    </g>
  </g>
  <g
     id="line2d_4"
     style="stroke-linecap:butt;stroke-linejoin:round"
     transform="translate(-85.597618,-86.6048)">
    <g
       id="g1230"
       style="stroke-linecap:butt;stroke-linejoin:round">
      <use
         style="stroke:#000000;stroke-width:0.80000001;stroke-linecap:butt;stroke-linejoin:round"
         x="804.78119"
         xlink:href="#mbf65fef6e1"
         y="645.28558"
         id="use1228"
         width="100%"
         height="100%" />
    </g>
  </g>
  <g
     id="line2d_5"
     style="stroke-linecap:butt;stroke-linejoin:round"
     transform="translate(-85.597618,-86.6048)">
    <g
       id="g1248"
       style="stroke-linecap:butt;stroke-linejoin:round">
      <use
         style="stroke:#000000;stroke-width:0.80000001;stroke-linecap:butt;stroke-linejoin:round"
         x="999.36267"
         xlink:href="#mbf65fef6e1"
         y="645.28558"
         id="use1246"
         width="100%"
         height="100%" />
    </g>
  </g>
  <g
     id="line2d_6"
     style="stroke-linecap:butt;stroke-linejoin:round"
     transform="translate(-85.597618,-86.6048)">
    <g
       id="g1266"
       style="stroke-linecap:butt;stroke-linejoin:round">
      <use
         style="stroke:#000000;stroke-width:0.80000001;stroke-linecap:butt;stroke-linejoin:round"
         x="1193.9442"
         xlink:href="#mbf65fef6e1"
         y="645.28558"
         id="use1264"
         width="100%"
         height="100%" />
    </g>
  </g>
  <text
     xml:space="preserve"
     style="font-style:normal;font-weight:normal;font-size:20px;line-height:125%;font-family:sans-serif;text-align:center;letter-spacing:0px;word-spacing:0px;text-anchor:middle;fill:#000000;fill-opacity:1;stroke:none;stroke-width:0.75px;stroke-linecap:butt;stroke-linejoin:miter;stroke-opacity:1"
     x="524.55267"
     y="594.12866"
     id="text1943-3-3"><tspan
       sodipodi:role="line"
       id="tspan1941-6-56"
       style="font-size:20px;text-align:center;text-anchor:middle;stroke-width:0.75px;stroke-linecap:butt;stroke-linejoin:round"
       x="524.55267"
       y="594.12866">400</tspan></text>
  <text
     xml:space="preserve"
     style="font-style:normal;font-weight:normal;font-size:20px;line-height:125%;font-family:sans-serif;text-align:center;letter-spacing:0px;word-spacing:0px;text-anchor:middle;fill:#000000;fill-opacity:1;stroke:none;stroke-width:0.75px;stroke-linecap:butt;stroke-linejoin:miter;stroke-opacity:1"
     x="719.43494"
     y="594.12866"
     id="text1943-3-2"><tspan
       sodipodi:role="line"
       id="tspan1941-6-9"
       style="font-size:20px;text-align:center;text-anchor:middle;stroke-width:0.75px;stroke-linecap:butt;stroke-linejoin:round"
       x="719.43494"
       y="594.12866">600</tspan></text>
  <text
     xml:space="preserve"
     style="font-style:normal;font-weight:normal;font-size:20px;line-height:125%;font-family:sans-serif;text-align:center;letter-spacing:0px;word-spacing:0px;text-anchor:middle;fill:#000000;fill-opacity:1;stroke:none;stroke-width:0.75px;stroke-linecap:butt;stroke-linejoin:miter;stroke-opacity:1"
     x="915.4491"
     y="594.12866"
     id="text1943-3-1"><tspan
       sodipodi:role="line"
       id="tspan1941-6-2"
       style="font-size:20px;text-align:center;text-anchor:middle;stroke-width:0.75px;stroke-linecap:butt;stroke-linejoin:round"
       x="915.4491"
       y="594.12866">800</tspan></text>
  <text
     xml:space="preserve"
     style="font-style:normal;font-weight:normal;font-size:20px;line-height:125%;font-family:sans-serif;text-align:center;letter-spacing:0px;word-spacing:0px;text-anchor:middle;fill:#000000;fill-opacity:1;stroke:none;stroke-width:0.75px;stroke-linecap:butt;stroke-linejoin:miter;stroke-opacity:1"
     x="1108.8314"
     y="594.12866"
     id="text1943-3-70"><tspan
       sodipodi:role="line"
       id="tspan1941-6-93"
       style="font-size:20px;text-align:center;text-anchor:middle;stroke-width:0.75px;stroke-linecap:butt;stroke-linejoin:round"
       x="1108.8314"
       y="594.12866">1000</tspan></text>
  <text
     xml:space="preserve"
     style="font-style:normal;font-weight:normal;font-size:20px;line-height:125%;font-family:sans-serif;text-align:end;letter-spacing:0px;word-spacing:0px;text-anchor:end;fill:#000000;fill-opacity:1;stroke:none;stroke-width:0.75px;stroke-linecap:butt;stroke-linejoin:miter;stroke-opacity:1"
     x="76.867126"
     y="553.46704"
     id="text1943-3-6"><tspan
       sodipodi:role="line"
       id="tspan1941-6-0"
       style="font-size:20px;text-align:end;text-anchor:end;stroke-width:0.75px;stroke-linecap:butt;stroke-linejoin:round"
       x="76.867126"
       y="553.46704">0</tspan></text>
  <text
     xml:space="preserve"
     style="font-style:normal;font-weight:normal;font-size:20px;line-height:125%;font-family:sans-serif;text-align:end;letter-spacing:0px;word-spacing:0px;text-anchor:end;fill:#000000;fill-opacity:1;stroke:none;stroke-width:0.75px;stroke-linecap:butt;stroke-linejoin:miter;stroke-opacity:1"
     x="76.867126"
     y="448.95047"
     id="text1943-3-6-6"><tspan
       sodipodi:role="line"
       id="tspan1941-6-0-2"
       style="font-size:20px;text-align:end;text-anchor:end;stroke-width:0.75px;stroke-linecap:butt;stroke-linejoin:round"
       x="76.867126"
       y="448.95047">50</tspan></text>
  <text
     xml:space="preserve"
     style="font-style:normal;font-weight:normal;font-size:20px;line-height:125%;font-family:sans-serif;text-align:end;letter-spacing:0px;word-spacing:0px;text-anchor:end;fill:#000000;fill-opacity:1;stroke:none;stroke-width:0.75px;stroke-linecap:butt;stroke-linejoin:miter;stroke-opacity:1"
     x="76.867126"
     y="344.96732"
     id="text1943-3-6-61"><tspan
       sodipodi:role="line"
       id="tspan1941-6-0-8"
       style="font-size:20px;text-align:end;text-anchor:end;stroke-width:0.75px;stroke-linecap:butt;stroke-linejoin:round"
       x="76.867126"
       y="344.96732">100</tspan></text>
  <text
     xml:space="preserve"
     style="font-style:normal;font-weight:normal;font-size:20px;line-height:125%;font-family:sans-serif;text-align:end;letter-spacing:0px;word-spacing:0px;text-anchor:end;fill:#000000;fill-opacity:1;stroke:none;stroke-width:0.75px;stroke-linecap:butt;stroke-linejoin:miter;stroke-opacity:1"
     x="76.867126"
     y="241.67281"
     id="text1943-3-6-7"><tspan
       sodipodi:role="line"
       id="tspan1941-6-0-9"
       style="font-size:20px;text-align:end;text-anchor:end;stroke-width:0.75px;stroke-linecap:butt;stroke-linejoin:round"
       x="76.867126"
       y="241.67281">150</tspan></text>
  <text
     xml:space="preserve"
     style="font-style:normal;font-weight:normal;font-size:20px;line-height:125%;font-family:sans-serif;text-align:end;letter-spacing:0px;word-spacing:0px;text-anchor:end;fill:#000000;fill-opacity:1;stroke:none;stroke-width:0.75px;stroke-linecap:butt;stroke-linejoin:miter;stroke-opacity:1"
     x="76.867126"
     y="138.3783"
     id="text1943-3-6-2"><tspan
       sodipodi:role="line"
       id="tspan1941-6-0-0"
       style="font-size:20px;text-align:end;text-anchor:end;stroke-width:0.75px;stroke-linecap:butt;stroke-linejoin:round"
       x="76.867126"
       y="138.3783">200</tspan></text>
  <text
     xml:space="preserve"
     style="font-style:normal;font-weight:normal;font-size:20px;line-height:125%;font-family:sans-serif;text-align:end;letter-spacing:0px;word-spacing:0px;text-anchor:end;fill:#000000;fill-opacity:1;stroke:none;stroke-width:0.75px;stroke-linecap:butt;stroke-linejoin:miter;stroke-opacity:1"
     x="76.867126"
     y="31.640621"
     id="text1943-3-6-23"><tspan
       sodipodi:role="line"
       id="tspan1941-6-0-7"
       style="font-size:20px;text-align:end;text-anchor:end;stroke-width:0.75px;stroke-linecap:butt;stroke-linejoin:round"
       x="76.867126"
       y="31.640621">250</tspan></text>
  <text
     xml:space="preserve"
     style="font-style:normal;font-weight:normal;font-size:20px;line-height:125%;font-family:sans-serif;text-align:center;letter-spacing:0px;word-spacing:0px;text-anchor:middle;fill:#000000;fill-opacity:1;stroke:none;stroke-width:0.75px;stroke-linecap:butt;stroke-linejoin:miter;stroke-opacity:1"
     x="-282.39005"
     y="15.195312"
     id="text1943-5"
     transform="rotate(-90)"><tspan
       sodipodi:role="line"
       id="tspan1941-9"
       style="font-size:20px;text-align:center;text-anchor:middle;stroke-width:0.75px;stroke-linecap:butt;stroke-linejoin:round"
       x="-282.39005"
       y="15.195312">loss</tspan></text>
  <text
     xml:space="preserve"
     style="font-style:normal;font-weight:normal;font-size:20px;line-height:125%;font-family:sans-serif;text-align:end;letter-spacing:0px;word-spacing:0px;text-anchor:end;fill:#000000;fill-opacity:1;stroke:none;stroke-width:0.75px;stroke-linecap:butt;stroke-linejoin:miter;stroke-opacity:1"
     x="1108.248"
     y="58.725708"
     id="text1943-5-3"><tspan
       sodipodi:role="line"
       id="tspan1941-9-6"
       style="font-size:20px;text-align:end;text-anchor:end;stroke-width:0.75px;stroke-linecap:butt;stroke-linejoin:round"
       x="1108.248"
       y="58.725708">gradient descent algorithm</tspan></text>
</svg>
