{
  "type": "FeatureCollection",
  "features": [
    {
      "type": "Feature",
      "properties": {
        "name": "Andrea y Carmen Calvo"
      },
      "geometry": {
        "type": "LineString",
        "coordinates": [
          [
            -59.151008,
            -37.295214
          ],
          [
            -59.147247,
            -37.297962
          ]
        ]
      }
    },
    {
      "type": "Feature",
      "properties": {
        "name": "Ángel y Mario Marzocca"
      },
      "geometry": {
        "type": "LineString",
        "coordinates": [
          [
            -59.154296,
            -37.297732
          ],
          [
            -59.150434,
            -37.294762
          ]
        ]
      }
    },
    {
      "type": "Feature",
      "properties": {
        "name": "Juan Roger Peña"
      },
      "geometry": {
        "type": "LineString",
        "coordinates": [
          [
            -59.152601,
            -37.299575
          ],
          [
            -59.149318,
            -37.296896
          ]
        ]
      }
    },
    {
      "type": "Feature",
      "properties": {
        "name": "María Eugenia Sanllorenti"
      },
      "geometry": {
        "type": "LineString",
        "coordinates": [
          [
            -59.150949,
            -37.294378
          ],
          [
            -59.155079,
            -37.297595
          ]
        ]
      }
    },
    {
      "type": "Feature",
      "properties": {
        "name": "María Graciela Toncovich"
      },
      "geometry": {
        "type": "LineString",
        "coordinates": [
          [
            -59.15274,
            -37.2978
          ],
          [
            -59.150434,
            -37.295974
          ]
        ]
      }
    },
    {
      "type": "Feature",
      "properties": {
        "name": "Omar Marocchi"
      },
      "geometry": {
        "type": "LineString",
        "coordinates": [
          [
            -59.151474,
            -37.30048
          ],
          [
            -59.14817,
            -37.297758
          ]
        ]
      }
    },
    {
      "type": "Feature",
      "properties": {
        "name": "Ricardo Gabriel del Río"
      },
      "geometry": {
        "type": "LineString",
        "coordinates": [
          [
            -59.150519,
            -37.294847
          ],
          [
            -59.146646,
            -37.297595
          ]
        ]
      }
    },
    {
      "type": "Feature",
      "properties": {
        "name": "Susana Valor"
      },
      "geometry": {
        "type": "LineString",
        "coordinates": [
          [
            -59.153824,
            -37.2978
          ],
          [
            -59.152665,
            -37.298688
          ]
        ]
      }
    }
  ]
}