id,primary-name,status
2895,African Journals Online (AJOL),past
15,APA,current
320,ACM,past
317,AIP,current
29705,CDL,current
71,Clarivate,current
4374,eLife,past
78,Elsevier,current
98,Hindawi,past
281,MIT Press,current
2399,OpenEdition,current
2516,Scielo,current
297,Springer,current
301,Informa,current
2209,VGTU,past
311,Wiley,past
239,BMJ,past
263,IEEE,past
179,Sage,past
266,IOP,past
374,Walter de Gruyter,past
635,Zhejiang University Press,past
408,University of California Press,past
221,AAAS,past
194,Thieme,past 
200, University of Chicago Press,past
276,Wolters Kluwer Health,past
109,INFORMS,past
175,The Royal Society,past
219,World Scientific Publishing,past
4690,Johns Hopkins University Press,past
340,PLOS,past
2086,Beilstein-Institut,current
15934,Center for Open Science,current
4099,Korean Council of Science Editors,current
14412,National Inquiry Services Center (NISC),current
286,Oxford University Press,current
27646,Pan Africa Science Journal,current