{
  "third_party_library": [
    {
      "name": "androidx.appcompat:appcompat:1.0.2",
      "url": "https://developer.android.com/jetpack/androidx/releases/appcompat",
      "license": "The Apache Software License, Version 2.0",
      "license_url": "http://www.apache.org/licenses/LICENSE-2.0.txt"
    },
    {
      "name": "androidx.legacy:legacy-support-v4:1.0.0",
      "url": "https://developer.android.com/topic/libraries/support-library/index",
      "license": "The Apache Software License, Version 2.0",
      "license_url": "http://www.apache.org/licenses/LICENSE-2.0.txt"
    },
    {
      "name": "androidx.core:core-ktx:1.3.0",
      "url": "https://developer.android.com/jetpack/androidx/releases/core",
      "license": "The Apache Software License, Version 2.0",
      "license_url": "http://www.apache.org/licenses/LICENSE-2.0.txt"
    },
    {
      "name": "androidx.legacy:legacy-support-v4:1.0.0",
      "url": "https://developer.android.com/topic/libraries/support-library/index",
      "license": "The Apache Software License, Version 2.0",
      "license_url": "http://www.apache.org/licenses/LICENSE-2.0.txt"
    },
    {
      "name": "androidx.constraintlayout:constraintlayout:1.1.3",
      "url": "https://androidstudio.googleblog.com/2018/08/constraintlayout-113.html",
      "license": "The Apache Software License, Version 2.0",
      "license_url": "http://www.apache.org/licenses/LICENSE-2.0.txt"
    },
    {
      "name": "com.google.android.exoplayer:exoplayer-core:2.7.2",
      "url": "https://github.com/google/ExoPlayer",
      "license": "The Apache Software License, Version 2.0",
      "license_url": "http://www.apache.org/licenses/LICENSE-2.0.txt"
    },
    {
      "name": "com.google.android.exoplayer:exoplayer-dash:2.7.2",
      "url": "https://github.com/google/ExoPlayer",
      "license": "The Apache Software License, Version 2.0",
      "license_url": "http://www.apache.org/licenses/LICENSE-2.0.txt"
    },
    {
      "name": "com.google.android.exoplayer:exoplayer-ui:2.7.2",
      "url": "https://github.com/google/ExoPlayer",
      "license": "The Apache Software License, Version 2.0",
      "license_url": "http://www.apache.org/licenses/LICENSE-2.0.txt"
    },
    {
      "name": "com.github.castorflex.smoothprogressbar:library:1.1.0",
      "url": "https://github.com/castorflex/SmoothProgressBar",
      "license": "The Apache Software License, Version 2.0",
      "license_url": "http://www.apache.org/licenses/LICENSE-2.0.txt"
    },
    {
      "name": "com.google.android.material:material:1.2.0-alpha06",
      "url": "https://developer.android.com/topic/libraries/support-library",
      "license": "The Apache Software License, Version 2.0",
      "license_url": "http://www.apache.org/licenses/LICENSE-2.0.txt"
    },
    {
      "name": "com.jakewharton:butterknife:10.1.0",
      "url": "https://github.com/JakeWharton/butterknife",
      "license": "The Apache Software License, Version 2.0",
      "license_url": "http://www.apache.org/licenses/LICENSE-2.0.txt"
    },
    {
      "name": "com.gitlab.manimaran:aboutusactivity:v1.3",
      "url": "https://gitlab.com/manimaran/aboutusactivity",
      "license": "GNU General Public License, Version 3.0",
      "license_url": "https://www.gnu.org/licenses/gpl-3.0.txt"
    },
    {
      "name": "com.gitlab.manimaran:crashreporter:v0.1",
      "url": "https://github.com/manimaran96/CrashReporter",
      "license": "GNU General Public License, Version 3.0",
      "license_url": "https://www.gnu.org/licenses/gpl-3.0.txt"
    },
    {
      "name": "com.squareup.retrofit2:retrofit:2.7.1",
      "url": "https://github.com/square/retrofit",
      "license": "The Apache Software License, Version 2.0",
      "license_url": "http://www.apache.org/licenses/LICENSE-2.0.txt"
    },
    {
      "name": "com.github.bumptech.glide:glide:4.11.0",
      "url": "https://github.com/bumptech/glide",
      "license": "The Apache Software License, Version 2.0",
      "license_url": "https://raw.githubusercontent.com/bumptech/glide/master/LICENSE"
    }

  ]
}

