<?xml version="1.0" encoding="utf-8"?>
<svg 
width="1220px" 
height="820px" 
viewbox="0 0 1220 820" 
xmlns="http://www.w3.org/2000/svg"
xmlns:xlink="http://www.w3.org/1999/xlink">

<title>Color chart</title>
<desc>Color chart</desc>

<rect id="1" x="0" y="0" width="1220" height="820" fill="rgb(0,0,0)" stroke="rgb(0,0,0)" stroke-width="1"/>
<!-- 4 rangées de 6 carrés -->
<rect id="1" x="20" y="20" width="180" height="180" fill="rgb(115,82,68)" stroke="rgb(115,82,68)" stroke-width="2"/> <!-- dark skin -->
<rect id="2" x="220" y="20" width="180" height="180" fill="rgb(194,150,130)" stroke="rgb(194,150,130)" stroke-width="2"/> <!-- light skin -->
<rect id="3" x="420" y="20" width="180" height="180" fill="rgb(98,122,157)" stroke="rgb(98,122,157)" stroke-width="2"/> <!-- blue sky -->
<rect id="4" x="620" y="20" width="180" height="180" fill="rgb(87,108,67)" stroke="rgb(87,108,67)" stroke-width="2"/>  <!-- foliage -->
<rect id="5" x="820" y="20" width="180" height="180" fill="rgb(133,128,177)" stroke="rgb(133,128,177)" stroke-width="2"/>  <!-- blue flower -->
<rect id="6" x="1020" y="20" width="180" height="180" fill="rgb(103,189,170)" stroke="rgb(103,189,170)" stroke-width="2"/>  <!-- bluish green -->

<rect id="7" x="20" y="220" width="180" height="180" fill="rgb(214,126,44)" stroke="rgb(214,126,44)" stroke-width="2"/>  <!-- orange -->
<rect id="8" x="220" y="220" width="180" height="180" fill="rgb(80,91,166)" stroke="rgb(80,91,166)" stroke-width="2"/>  <!-- purplish blue -->
<rect id="9" x="420" y="220" width="180" height="180" fill="rgb(193,90,99)" stroke="rgb(193,90,99)" stroke-width="2"/>  <!-- moderated red -->
<rect id="10" x="620" y="220" width="180" height="180" fill="rgb(94,60,108)" stroke="rgb(94,60,108)" stroke-width="2"/>  <!-- purple -->
<rect id="11" x="820" y="220" width="180" height="180" fill="rgb(157,188,64)" stroke="rgb(157,188,64)" stroke-width="2"/>  <!-- yellow green -->
<rect id="12" x="1020" y="220" width="180" height="180" fill="rgb(224,163,64)" stroke="rgb(224,163,64)" stroke-width="2"/>  <!-- orange yellow -->

<rect id="13" x="20" y="420" width="180" height="180" fill="rgb(56,61,150)" stroke="rgb(56,61,150)" stroke-width="2"/>  <!-- blue -->
<rect id="14" x="220" y="420" width="180" height="180" fill="rgb(70,148,73)" stroke="rgb(70,148,73)" stroke-width="2"/>  <!-- green -->
<rect id="15" x="420" y="420" width="180" height="180" fill="rgb(175,54,60)" stroke="rgb(175,54,60)" stroke-width="2"/>  <!-- red -->
<rect id="16" x="620" y="420" width="180" height="180" fill="rgb(231,199,31)" stroke="rgb(231,199,31)" stroke-width="2"/>  <!-- yellow -->
<rect id="17" x="820" y="420" width="180" height="180" fill="rgb(187,86,149)" stroke="rgb(187,86,149)" stroke-width="2"/>  <!-- magenta -->
<rect id="18" x="1020" y="420" width="180" height="180" fill="rgb(8,133,161)" stroke="rgb(8,133,161)" stroke-width="2"/>  <!-- cyan -->

<rect id="19" x="20" y="620" width="180" height="180" fill="rgb(243,243,242)" stroke="rgb(243,243,242)" stroke-width="2"/>  <!-- white 0.05 -->
<rect id="20" x="220" y="620" width="180" height="180" fill="rgb(200,200,200)" stroke="rgb(200,200,200)" stroke-width="2"/>  <!-- neutral 8 -->
<rect id="21" x="420" y="620" width="180" height="180" fill="rgb(160,160,160)" stroke="rgb(160,160,160)" stroke-width="2"/>  <!-- neutral 6.5 -->
<rect id="22" x="620" y="620" width="180" height="180" fill="rgb(122,122,121)" stroke="rgb(122,122,121)" stroke-width="2"/>  <!-- neutral 5 -->
<rect id="23" x="820" y="620" width="180" height="180" fill="rgb(85,85,85)" stroke="rgb(85,85,85)" stroke-width="2"/>  <!-- neutral 3.5 -->
<rect id="24" x="1020" y="620" width="180" height="180" fill="rgb(52,52,52)" stroke="rgb(52,52,52)" stroke-width="2"/>  <!-- black -->

</svg>