Time;UTC;UV;IR;R;G;B;C;Pressure;Temperature;pwmUV;currentUV;pwmIR;currentIR;pwmR;currentR;pwmG;currentG;pwmB;currentB;TSL2572intTime;TSL2572gain;TCS3472redIntTime;TCS3472redGain;TCS3472greenIntTime;TCS3472greenGain;TCS3472blueIntTime;TCS3472blueGain;TCS3472clearIntTime;TCS3472clearGain;VEML6070intTime;MS5803pressureADC;MS5803temperatureADC
1970-01-01T00:01:20;80;298;32895;4608;1323;3662;0;1021.4;20.54;255;255;180;195;180;195;180;195;180;195;210;0;204;0;204;0;204;0;204;0;12;0;0
1970-01-01T00:01:27;87;298;32898;4607;1330;3662;0;1020.3;20.52;255;255;180;195;180;195;180;195;180;195;210;0;204;0;204;0;204;0;204;0;12;0;0
1970-01-01T00:01:35;95;298;32615;4597;1330;3661;0;1021.4;20.54;255;255;180;195;180;195;180;195;180;195;210;0;204;0;204;0;204;0;204;0;12;0;0
1970-01-01T00:01:42;102;298;32750;4606;1330;3662;0;1020.3;20.54;255;255;180;195;180;195;180;195;180;195;210;0;204;0;204;0;204;0;204;0;12;0;0
1970-01-01T00:01:49;109;298;32674;4609;1330;3662;0;1020.3;20.54;255;255;180;195;180;195;180;195;180;195;210;0;204;0;204;0;204;0;204;0;12;0;0
1970-01-01T00:01:57;117;298;32686;4601;1330;3661;0;1020.3;20.44;255;255;180;195;180;195;180;195;180;195;210;0;204;0;204;0;204;0;204;0;12;0;0
1970-01-01T00:02:04;124;298;32546;4600;1330;3661;0;1017;20.47;255;255;180;195;180;195;180;195;180;195;210;0;204;0;204;0;204;0;204;0;12;0;0
1970-01-01T00:02:11;131;299;32613;4600;1330;3661;0;1020.3;20.54;255;255;180;195;180;195;180;195;180;195;210;0;204;0;204;0;204;0;204;0;12;0;0
1970-01-01T00:02:19;139;298;32612;4601;1330;3661;0;1020.3;20.54;255;255;180;195;180;195;180;195;180;195;210;0;204;0;204;0;204;0;204;0;12;0;0
1970-01-01T00:02:26;146;299;32830;4599;1330;3662;0;1020.3;20.54;255;255;180;195;180;195;180;195;180;195;210;0;204;0;204;0;204;0;204;0;12;0;0
1970-01-01T00:02:33;153;300;32559;4602;1330;3662;0;1020.3;20.54;255;255;180;195;180;195;180;195;180;195;210;0;204;0;204;0;204;0;204;0;12;0;0
1970-01-01T00:02:40;160;300;32661;4599;1330;3662;0;1020.3;20.56;255;255;180;195;180;195;180;195;180;195;210;0;204;0;204;0;204;0;204;0;12;0;0
1970-01-01T00:02:48;168;298;32591;4602;1330;3661;0;1021.4;20.54;255;255;180;195;180;195;180;195;180;195;210;0;204;0;204;0;204;0;204;0;12;0;0
1970-01-01T00:02:55;175;298;32696;4607;1328;3662;0;1017;20.47;255;255;180;195;180;195;180;195;180;195;210;0;204;0;204;0;204;0;204;0;12;0;0
1970-01-01T00:03:02;182;299;32842;4609;1326;3661;0;1018.1;20.45;255;255;180;195;180;195;180;195;180;195;210;0;204;0;204;0;204;0;204;0;12;0;0
1970-01-01T00:03:10;190;298;32816;4610;1330;3662;0;1017;20.47;255;255;180;195;180;195;180;195;180;195;210;0;204;0;204;0;204;0;204;0;12;0;0
1970-01-01T00:03:17;197;299;32671;4604;1330;3661;0;1021.4;20.54;255;255;180;195;180;195;180;195;180;195;210;0;204;0;204;0;204;0;204;0;12;0;0
1970-01-01T00:03:24;204;300;32676;4600;1330;3661;0;1020.3;20.56;255;255;180;195;180;195;180;195;180;195;210;0;204;0;204;0;204;0;204;0;12;0;0
1970-01-01T00:03:32;212;299;32572;4610;1330;3661;0;1021.4;20.56;255;255;180;195;180;195;180;195;180;195;210;0;204;0;204;0;204;0;204;0;12;0;0
1970-01-01T00:03:39;219;300;32649;4611;1330;3642;0;1021.4;20.56;255;255;180;195;180;195;180;195;180;195;210;0;204;0;204;0;204;0;204;0;12;0;0
1970-01-01T00:03:46;226;300;32890;4609;1330;3660;0;1020.3;20.56;255;255;180;195;180;195;180;195;180;195;210;0;204;0;204;0;204;0;204;0;12;0;0
1970-01-01T00:03:54;234;299;32677;4603;1330;3661;0;1020.3;20.56;255;255;180;195;180;195;180;195;180;195;210;0;204;0;204;0;204;0;204;0;12;0;0
1970-01-01T00:04:01;241;299;32539;4603;1330;3661;0;1017;20.47;255;255;180;195;180;195;180;195;180;195;210;0;204;0;204;0;204;0;204;0;12;0;0
1970-01-01T00:04:08;248;299;32748;4606;1330;3661;0;1018.1;20.51;255;255;180;195;180;195;180;195;180;195;210;0;204;0;204;0;204;0;204;0;12;0;0
1970-01-01T00:04:15;255;300;32662;4603;1330;3661;0;1020.3;20.52;255;255;180;195;180;195;180;195;180;195;210;0;204;0;204;0;204;0;204;0;12;0;0
1970-01-01T00:04:23;263;299;32657;4604;1330;3661;0;1020.3;20.56;255;255;180;195;180;195;180;195;180;195;210;0;204;0;204;0;204;0;204;0;12;0;0
1970-01-01T00:04:30;270;299;32799;4610;1323;3661;0;1020.3;20.58;255;255;180;195;180;195;180;195;180;195;210;0;204;0;204;0;204;0;204;0;12;0;0
1970-01-01T00:04:37;277;300;32891;4610;1323;3643;0;1020.3;20.56;255;255;180;195;180;195;180;195;180;195;210;0;204;0;204;0;204;0;204;0;12;0;0
1970-01-01T00:04:45;285;300;32886;4612;1323;3651;0;1021.5;20.58;255;255;180;195;180;195;180;195;180;195;210;0;204;0;204;0;204;0;204;0;12;0;0
1970-01-01T00:04:52;292;299;32886;4610;1323;3643;0;1020.3;20.58;255;255;180;195;180;195;180;195;180;195;210;0;204;0;204;0;204;0;204;0;12;0;0
1970-01-01T00:04:59;299;300;32888;4611;1323;3646;0;1017;20.51;255;255;180;195;180;195;180;195;180;195;210;0;204;0;204;0;204;0;204;0;12;0;0
1970-01-01T00:05:07;307;299;32889;4612;1323;3656;0;1018.2;20.49;255;255;180;195;180;195;180;195;180;195;210;0;204;0;204;0;204;0;204;0;12;0;0
1970-01-01T00:05:14;314;300;32889;4611;1323;3646;0;1019.2;20.52;255;255;180;195;180;195;180;195;180;195;210;0;204;0;204;0;204;0;204;0;12;0;0
1970-01-01T00:05:21;321;300;32890;4611;1326;3643;0;1021.5;20.56;255;255;180;195;180;195;180;195;180;195;210;0;204;0;204;0;204;0;204;0;12;0;0
1970-01-01T00:05:29;329;300;32865;4612;1328;3642;0;1021.5;20.58;255;255;180;195;180;195;180;195;180;195;210;0;204;0;204;0;204;0;204;0;12;0;0
1970-01-01T00:05:36;336;301;32887;4612;1323;3646;0;1020.4;20.58;255;255;180;195;180;195;180;195;180;195;210;0;204;0;204;0;204;0;204;0;12;0;0
1970-01-01T00:05:43;343;301;32887;4612;1326;3642;0;1020.4;20.58;255;255;180;195;180;195;180;195;180;195;210;0;204;0;204;0;204;0;204;0;12;0;0
1970-01-01T00:05:50;350;301;32886;4611;1325;3642;0;1020.4;20.58;255;255;180;195;180;195;180;195;180;195;210;0;204;0;204;0;204;0;204;0;12;0;0
1970-01-01T00:05:58;358;299;32882;4611;1330;3661;0;1019.2;20.49;255;255;180;195;180;195;180;195;180;195;210;0;204;0;204;0;204;0;204;0;12;0;0
1970-01-01T00:06:05;365;300;32586;4605;1330;3661;0;1018.2;20.51;255;255;180;195;180;195;180;195;180;195;210;0;204;0;204;0;204;0;204;0;12;0;0
1970-01-01T00:06:12;372;300;32579;4612;1330;3661;0;1019.2;20.49;255;255;180;195;180;195;180;195;180;195;210;0;204;0;204;0;204;0;204;0;12;0;0
1970-01-01T00:06:20;380;300;32621;4614;1328;3641;0;1020.4;20.56;255;255;180;195;180;195;180;195;180;195;210;0;204;0;204;0;204;0;204;0;12;0;0
1970-01-01T00:06:27;387;301;32897;4613;1325;3661;0;1020.4;20.59;255;255;180;195;180;195;180;195;180;195;210;0;204;0;204;0;204;0;204;0;12;0;0
1970-01-01T00:06:34;394;300;32798;4613;1323;3644;0;1021.5;20.59;255;255;180;195;180;195;180;195;180;195;210;0;204;0;204;0;204;0;204;0;12;0;0
1970-01-01T00:06:42;402;301;32882;4612;1330;3654;0;1020.4;20.59;255;255;180;195;180;195;180;195;180;195;210;0;204;0;204;0;204;0;204;0;12;0;0
1970-01-01T00:06:49;409;301;32748;4613;1330;3661;0;1020.4;20.59;255;255;180;195;180;195;180;195;180;195;210;0;204;0;204;0;204;0;204;0;12;0;0
1970-01-01T00:06:56;416;300;32657;4612;1330;3644;0;1020.4;20.59;255;255;180;195;180;195;180;195;180;195;210;0;204;0;204;0;204;0;204;0;12;0;0
1970-01-01T00:07:03;423;300;32849;4612;1330;3646;0;1018.2;20.49;255;255;180;195;180;195;180;195;180;195;210;0;204;0;204;0;204;0;204;0;12;0;0
1970-01-01T00:07:11;431;300;32852;4612;1330;3653;0;1018.2;20.51;255;255;180;195;180;195;180;195;180;195;210;0;204;0;204;0;204;0;204;0;12;0;0
1970-01-01T00:07:18;438;300;32747;4613;1330;3661;0;1020.4;20.51;255;255;180;195;180;195;180;195;180;195;210;0;204;0;204;0;204;0;204;0;12;0;0
1970-01-01T00:07:25;445;300;32724;4613;1330;3642;0;1020.4;20.61;255;255;180;195;180;195;180;195;180;195;210;0;204;0;204;0;204;0;204;0;12;0;0
1970-01-01T00:07:33;453;301;32886;4613;1325;3643;0;1020.4;20.59;255;255;180;195;180;195;180;195;180;195;210;0;204;0;204;0;204;0;204;0;12;0;0
1970-01-01T00:07:40;460;301;32888;4613;1324;3643;0;1021.5;20.61;255;255;180;195;180;195;180;195;180;195;210;0;204;0;204;0;204;0;204;0;12;0;0
1970-01-01T00:07:47;467;301;32884;4613;1329;3650;0;1020.4;20.59;255;255;180;195;180;195;180;195;180;195;210;0;204;0;204;0;204;0;204;0;12;0;0
1970-01-01T00:07:55;475;301;32786;4612;1329;3660;0;1021.5;20.61;255;255;180;195;180;195;180;195;180;195;210;0;204;0;204;0;204;0;204;0;12;0;0
1970-01-01T00:08:02;482;300;32577;4609;1330;3661;0;1017;20.51;255;255;180;195;180;195;180;195;180;195;210;0;204;0;204;0;204;0;204;0;12;0;0
1970-01-01T00:08:09;489;300;32706;4614;1330;3661;0;1020.4;20.52;255;255;180;195;180;195;180;195;180;195;210;0;204;0;204;0;204;0;204;0;12;0;0
1970-01-01T00:08:17;497;301;32665;4613;1330;3661;0;1018.2;20.51;255;255;180;195;180;195;180;195;180;195;210;0;204;0;204;0;204;0;204;0;12;0;0
1970-01-01T00:08:24;504;301;32604;4614;1328;3642;0;1019.3;20.56;255;255;180;195;180;195;180;195;180;195;210;0;204;0;204;0;204;0;204;0;12;0;0
1970-01-01T00:08:31;511;301;32876;4615;1323;3642;0;1020.4;20.61;255;255;180;195;180;195;180;195;180;195;210;0;204;0;204;0;204;0;204;0;12;0;0
1970-01-01T00:08:38;518;301;32882;4613;1323;3657;0;1020.4;20.61;255;255;180;195;180;195;180;195;180;195;210;0;204;0;204;0;204;0;204;0;12;0;0
1970-01-01T00:08:46;526;301;32884;4615;1326;3661;0;1020.4;20.61;255;255;180;195;180;195;180;195;180;195;210;0;204;0;204;0;204;0;204;0;12;0;0
1970-01-01T00:08:53;533;302;32794;4614;1330;3662;0;1020.4;20.61;255;255;180;195;180;195;180;195;180;195;210;0;204;0;204;0;204;0;204;0;12;0;0
1970-01-01T00:09:00;540;300;32655;4606;1330;3661;0;1020.4;20.61;255;255;180;195;180;195;180;195;180;195;210;0;204;0;204;0;204;0;204;0;12;0;0
1970-01-01T00:09:08;548;301;32591;4607;1327;3661;0;1017.1;20.54;255;255;180;195;180;195;180;195;180;195;210;0;204;0;204;0;204;0;204;0;12;0;0
1970-01-01T00:09:15;555;301;32878;4614;1323;3644;0;1019.3;20.52;255;255;180;195;180;195;180;195;180;195;210;0;204;0;204;0;204;0;204;0;12;0;0
1970-01-01T00:09:22;562;302;32884;4615;1329;3642;0;1019.3;20.54;255;255;180;195;180;195;180;195;180;195;210;0;204;0;204;0;204;0;204;0;12;0;0
1970-01-01T00:09:30;570;301;32869;4615;1323;3661;0;1020.4;20.61;255;255;180;195;180;195;180;195;180;195;210;0;204;0;204;0;204;0;204;0;12;0;0
1970-01-01T00:09:37;577;301;32873;4615;1323;3646;0;1020.4;20.63;255;255;180;195;180;195;180;195;180;195;210;0;204;0;204;0;204;0;204;0;12;0;0
1970-01-01T00:09:44;584;301;32883;4616;1326;3661;0;1020.4;20.63;255;255;180;195;180;195;180;195;180;195;210;0;204;0;204;0;204;0;204;0;12;0;0
1970-01-01T00:09:52;592;301;32744;4615;1326;3662;0;1020.4;20.63;255;255;180;195;180;195;180;195;180;195;210;0;204;0;204;0;204;0;204;0;12;0;0
1970-01-01T00:09:59;599;301;32873;4615;1323;3651;0;1020.4;20.63;255;255;180;195;180;195;180;195;180;195;210;0;204;0;204;0;204;0;204;0;12;0;0
1970-01-01T00:10:06;606;300;32876;4615;1322;3661;0;1020.4;20.63;255;255;180;195;180;195;180;195;180;195;210;0;204;0;204;0;204;0;204;0;12;0;0
1970-01-01T00:10:13;613;301;32853;4606;1330;3661;0;1019.3;20.54;255;255;180;195;180;195;180;195;180;195;210;0;204;0;204;0;204;0;204;0;12;0;0
1970-01-01T00:10:21;621;301;32614;4606;1330;3661;0;1018.2;20.58;255;255;180;195;180;195;180;195;180;195;210;0;204;0;204;0;204;0;204;0;12;0;0
1970-01-01T00:10:28;628;301;32670;4607;1330;3661;0;1020.4;20.58;255;255;180;195;180;195;180;195;180;195;210;0;204;0;204;0;204;0;204;0;12;0;0
1970-01-01T00:10:35;635;301;32548;4616;1330;3661;0;1020.4;20.65;255;255;180;195;180;195;180;195;180;195;210;0;204;0;204;0;204;0;204;0;12;0;0
1970-01-01T00:10:43;643;302;32667;4616;1329;3642;0;1020.4;20.63;255;255;180;195;180;195;180;195;180;195;210;0;204;0;204;0;204;0;204;0;12;0;0
1970-01-01T00:10:50;650;302;32874;4617;1322;3648;0;1021.5;20.65;255;255;180;195;180;195;180;195;180;195;210;0;204;0;204;0;204;0;204;0;12;0;0
1970-01-01T00:10:57;657;301;32876;4616;1329;3661;0;1020.4;20.63;255;255;180;195;180;195;180;195;180;195;210;0;204;0;204;0;204;0;204;0;12;0;0
1970-01-01T00:11:05;665;301;32683;4609;1329;3661;0;1020.4;20.54;255;255;180;195;180;195;180;195;180;195;210;0;204;0;204;0;204;0;204;0;12;0;0
1970-01-01T00:11:12;672;301;32785;4616;1326;3661;0;1019.3;20.54;255;255;180;195;180;195;180;195;180;195;210;0;204;0;204;0;204;0;204;0;12;0;0
1970-01-01T00:11:19;679;302;32819;4616;1330;3661;0;1017.1;20.58;255;255;180;195;180;195;180;195;180;195;210;0;204;0;204;0;204;0;204;0;12;0;0
1970-01-01T00:11:27;687;302;32641;4615;1323;3660;0;1020.4;20.63;255;255;180;195;180;195;180;195;180;195;210;0;204;0;204;0;204;0;204;0;12;0;0
1970-01-01T00:11:34;694;302;32854;4615;1323;3653;0;1020.4;20.65;255;255;180;195;180;195;180;195;180;195;210;0;204;0;204;0;204;0;204;0;12;0;0
1970-01-01T00:11:41;701;302;32876;4616;1322;3649;0;1021.5;20.67;255;255;180;195;180;195;180;195;180;195;210;0;204;0;204;0;204;0;204;0;12;0;0
1970-01-01T00:11:48;708;302;32866;4615;1329;3653;0;1020.4;20.65;255;255;180;195;180;195;180;195;180;195;210;0;204;0;204;0;204;0;204;0;12;0;0
1970-01-01T00:11:56;716;302;32756;4616;1329;3642;0;1020.4;20.65;255;255;180;195;180;195;180;195;180;195;210;0;204;0;204;0;204;0;204;0;12;0;0
1970-01-01T00:12:03;723;300;32879;4616;1322;3661;0;1020.4;20.65;255;255;180;195;180;195;180;195;180;195;210;0;204;0;204;0;204;0;204;0;12;0;0
1970-01-01T00:12:10;730;301;32871;4616;1323;3646;0;1017.1;20.56;255;255;180;195;180;195;180;195;180;195;210;0;204;0;204;0;204;0;204;0;12;0;0
1970-01-01T00:12:18;738;301;32873;4616;1323;3654;0;1018.3;20.56;255;255;180;195;180;195;180;195;180;195;210;0;204;0;204;0;204;0;204;0;12;0;0
1970-01-01T00:12:25;745;302;32877;4615;1323;3645;0;1019.3;20.56;255;255;180;195;180;195;180;195;180;195;210;0;204;0;204;0;204;0;204;0;12;0;0
1970-01-01T00:12:32;752;302;32880;4615;1329;3653;0;1020.5;20.67;255;255;180;195;180;195;180;195;180;195;210;0;204;0;204;0;204;0;204;0;12;0;0
1970-01-01T00:12:40;760;302;32738;4616;1328;3642;0;1020.4;20.65;255;255;180;195;180;195;180;195;180;195;210;0;204;0;204;0;204;0;204;0;12;0;0
1970-01-01T00:12:47;767;302;32873;4616;1323;3647;0;1021.5;20.67;255;255;180;195;180;195;180;195;180;195;210;0;204;0;204;0;204;0;204;0;12;0;0
1970-01-01T00:12:54;774;303;32871;4615;1327;3642;0;1020.5;20.67;255;255;180;195;180;195;180;195;180;195;210;0;204;0;204;0;204;0;204;0;12;0;0
1970-01-01T00:13:02;782;301;32873;4616;1322;3653;0;1020.4;20.65;255;255;180;195;180;195;180;195;180;195;210;0;204;0;204;0;204;0;204;0;12;0;0
1970-01-01T00:13:09;789;301;32876;4617;1327;3661;0;1018.2;20.59;255;255;180;195;180;195;180;195;180;195;210;0;204;0;204;0;204;0;204;0;12;0;0
1970-01-01T00:13:16;796;301;32718;4608;1329;3661;0;1018.2;20.59;255;255;180;195;180;195;180;195;180;195;210;0;204;0;204;0;204;0;204;0;12;0;0
1970-01-01T00:13:23;803;302;32569;4609;1329;3661;0;1021.6;20.67;255;255;180;195;180;195;180;195;180;195;210;0;204;0;204;0;204;0;204;0;12;0;0
1970-01-01T00:13:31;811;302;32542;4607;1329;3660;0;1020.4;20.65;255;255;180;195;180;195;180;195;180;195;210;0;204;0;204;0;204;0;204;0;12;0;0
1970-01-01T00:13:38;818;302;32569;4617;1329;3659;0;1021.5;20.68;255;255;180;195;180;195;180;195;180;195;210;0;204;0;204;0;204;0;204;0;12;0;0
1970-01-01T00:13:45;825;302;32706;4616;1329;3662;0;1020.5;20.68;255;255;180;195;180;195;180;195;180;195;210;0;204;0;204;0;204;0;204;0;12;0;0
1970-01-01T00:13:53;833;302;32599;4616;1330;3660;0;1019.4;20.67;255;255;180;195;180;195;180;195;180;195;210;0;204;0;204;0;204;0;204;0;12;0;0
1970-01-01T00:14:00;840;302;32704;4616;1329;3661;0;1021.6;20.68;255;255;180;195;180;195;180;195;180;195;210;0;204;0;204;0;204;0;204;0;12;0;0
1970-01-01T00:14:07;847;301;32525;4610;1330;3661;0;1020.5;20.67;255;255;180;195;180;195;180;195;180;195;210;0;204;0;204;0;204;0;204;0;12;0;0
1970-01-01T00:14:15;855;301;32695;4617;1329;3661;0;1017.2;20.58;255;255;180;195;180;195;180;195;180;195;210;0;204;0;204;0;204;0;204;0;12;0;0
1970-01-01T00:14:22;862;301;32636;4617;1329;3660;0;1019.3;20.58;255;255;180;195;180;195;180;195;180;195;210;0;204;0;204;0;204;0;204;0;12;0;0
1970-01-01T00:14:29;869;301;32637;4614;1329;3660;0;1019.4;20.58;255;255;180;195;180;195;180;195;180;195;210;0;204;0;204;0;204;0;204;0;12;0;0
1970-01-01T00:14:37;877;302;32602;4616;1329;3660;0;1020.5;20.67;255;255;180;195;180;195;180;195;180;195;210;0;204;0;204;0;204;0;204;0;12;0;0
1970-01-01T00:14:44;884;302;32585;4612;1329;3661;0;1021.6;20.68;255;255;180;195;180;195;180;195;180;195;210;0;204;0;204;0;204;0;204;0;12;0;0
1970-01-01T00:14:51;891;302;32577;4608;1329;3660;0;1020.5;20.68;255;255;180;195;180;195;180;195;180;195;210;0;204;0;204;0;204;0;204;0;12;0;0
1970-01-01T00:14:58;898;302;32627;4617;1329;3657;0;1020.5;20.68;255;255;180;195;180;195;180;195;180;195;210;0;204;0;204;0;204;0;204;0;12;0;0
1970-01-01T00:15:06;906;302;32681;4608;1329;3661;0;1021.6;20.68;255;255;180;195;180;195;180;195;180;195;210;0;204;0;204;0;204;0;204;0;12;0;0
1970-01-01T00:15:13;913;302;32566;4609;1329;3660;0;1019.3;20.58;255;255;180;195;180;195;180;195;180;195;210;0;204;0;204;0;204;0;204;0;12;0;0
1970-01-01T00:15:20;920;301;32630;4608;1329;3661;0;1019.4;20.58;255;255;180;195;180;195;180;195;180;195;210;0;204;0;204;0;204;0;204;0;12;0;0
1970-01-01T00:15:28;928;301;32545;4617;1330;3652;0;1018.3;20.59;255;255;180;195;180;195;180;195;180;195;210;0;204;0;204;0;204;0;204;0;12;0;0
1970-01-01T00:15:35;935;302;32734;4618;1329;3642;0;1019.4;20.7;255;255;180;195;180;195;180;195;180;195;210;0;204;0;204;0;204;0;204;0;12;0;0
1970-01-01T00:15:42;942;302;32872;4618;1330;3650;0;1020.5;20.7;255;255;180;195;180;195;180;195;180;195;210;0;204;0;204;0;204;0;204;0;12;0;0
1970-01-01T00:15:50;950;302;32788;4617;1329;3660;0;1021.6;20.68;255;255;180;195;180;195;180;195;180;195;210;0;204;0;204;0;204;0;204;0;12;0;0
1970-01-01T00:15:57;957;303;32522;4609;1329;3661;0;1020.5;20.7;255;255;180;195;180;195;180;195;180;195;210;0;204;0;204;0;204;0;204;0;12;0;0
1970-01-01T00:16:04;964;301;32576;4617;1323;3644;0;1020.5;20.7;255;255;180;195;180;195;180;195;180;195;210;0;204;0;204;0;204;0;204;0;12;0;0
1970-01-01T00:16:12;972;301;32874;4618;1329;3654;0;1020.5;20.59;255;255;180;195;180;195;180;195;180;195;210;0;204;0;204;0;204;0;204;0;12;0;0
1970-01-01T00:16:19;979;301;32694;4617;1329;3661;0;1017.2;20.59;255;255;180;195;180;195;180;195;180;195;210;0;204;0;204;0;204;0;204;0;12;0;0
1970-01-01T00:16:26;986;302;32532;4612;1329;3661;0;1019.4;20.59;255;255;180;195;180;195;180;195;180;195;210;0;204;0;204;0;204;0;204;0;12;0;0
1970-01-01T00:16:33;993;302;32525;4611;1329;3660;0;1021.6;20.68;255;255;180;195;180;195;180;195;180;195;210;0;204;0;204;0;204;0;204;0;12;0;0
1970-01-01T00:16:41;1001;302;32678;4610;1329;3661;0;1021.6;20.68;255;255;180;195;180;195;180;195;180;195;210;0;204;0;204;0;204;0;204;0;12;0;0
1970-01-01T00:16:48;1008;302;32538;4617;1327;3661;0;1020.5;20.7;255;255;180;195;180;195;180;195;180;195;210;0;204;0;204;0;204;0;204;0;12;0;0
1970-01-01T00:16:55;1015;303;32839;4618;1327;3652;0;1021.6;20.7;255;255;180;195;180;195;180;195;180;195;210;0;204;0;204;0;204;0;204;0;12;0;0
1970-01-01T00:17:03;1023;303;32714;4618;1329;3660;0;1020.5;20.7;255;255;180;195;180;195;180;195;180;195;210;0;204;0;204;0;204;0;204;0;12;0;0
1970-01-01T00:17:10;1030;302;32531;4610;1329;3661;0;1020.5;20.72;255;255;180;195;180;195;180;195;180;195;210;0;204;0;204;0;204;0;204;0;12;0;0
1970-01-01T00:17:17;1037;301;32551;4617;1323;3643;0;1019.4;20.61;255;255;180;195;180;195;180;195;180;195;210;0;204;0;204;0;204;0;204;0;12;0;0
1970-01-01T00:17:25;1045;301;32871;4618;1323;3643;0;1020.5;20.61;255;255;180;195;180;195;180;195;180;195;210;0;204;0;204;0;204;0;204;0;12;0;0
1970-01-01T00:17:32;1052;302;32870;4617;1329;3661;0;1021.6;20.61;255;255;180;195;180;195;180;195;180;195;210;0;204;0;204;0;204;0;204;0;12;0;0
1970-01-01T00:17:39;1059;302;32529;4618;1329;3660;0;1020.5;20.7;255;255;180;195;180;195;180;195;180;195;210;0;204;0;204;0;204;0;204;0;12;0;0
1970-01-01T00:17:47;1067;303;32554;4609;1329;3661;0;1021.6;20.72;255;255;180;195;180;195;180;195;180;195;210;0;204;0;204;0;204;0;204;0;12;0;0
1970-01-01T00:17:54;1074;302;32642;4617;1323;3644;0;1020.5;20.7;255;255;180;195;180;195;180;195;180;195;210;0;204;0;204;0;204;0;204;0;12;0;0
1970-01-01T00:18:01;1081;303;32832;4617;1329;3660;0;1020.5;20.72;255;255;180;195;180;195;180;195;180;195;210;0;204;0;204;0;204;0;204;0;12;0;0
1970-01-01T00:18:08;1088;302;32562;4611;1329;3661;0;1020.5;20.7;255;255;180;195;180;195;180;195;180;195;210;0;204;0;204;0;204;0;204;0;12;0;0
1970-01-01T00:18:16;1096;302;32615;4611;1329;3661;0;1021.6;20.72;255;255;180;195;180;195;180;195;180;195;210;0;204;0;204;0;204;0;204;0;12;0;0
1970-01-01T00:18:23;1103;302;32558;4611;1329;3661;0;1016.1;20.63;255;255;180;195;180;195;180;195;180;195;210;0;204;0;204;0;204;0;204;0;12;0;0
1970-01-01T00:18:30;1110;302;32659;4611;1329;3661;0;1019.4;20.61;255;255;180;195;180;195;180;195;180;195;210;0;204;0;204;0;204;0;204;0;12;0;0
1970-01-01T00:18:38;1118;302;32590;4611;1329;3661;0;1020.5;20.63;255;255;180;195;180;195;180;195;180;195;210;0;204;0;204;0;204;0;204;0;12;0;0
1970-01-01T00:18:45;1125;303;32644;4617;1323;3645;0;1020.5;20.72;255;255;180;195;180;195;180;195;180;195;210;0;204;0;204;0;204;0;204;0;12;0;0
1970-01-01T00:18:52;1132;302;32874;4619;1322;3652;0;1020.5;20.72;255;255;180;195;180;195;180;195;180;195;210;0;204;0;204;0;204;0;204;0;12;0;0
1970-01-01T00:19:00;1140;302;32867;4619;1323;3642;0;1021.6;20.72;255;255;180;195;180;195;180;195;180;195;210;0;204;0;204;0;204;0;204;0;12;0;0
1970-01-01T00:19:07;1147;303;32866;4617;1329;3643;0;1021.6;20.72;255;255;180;195;180;195;180;195;180;195;210;0;204;0;204;0;204;0;204;0;12;0;0
1970-01-01T00:19:14;1154;303;32871;4619;1325;3642;0;1020.5;20.72;255;255;180;195;180;195;180;195;180;195;210;0;204;0;204;0;204;0;204;0;12;0;0
1970-01-01T00:19:22;1162;302;32871;4618;1324;3642;0;1020.5;20.72;255;255;180;195;180;195;180;195;180;195;210;0;204;0;204;0;204;0;204;0;12;0;0
1970-01-01T00:19:29;1169;302;32871;4619;1329;3650;0;1017.2;20.63;255;255;180;195;180;195;180;195;180;195;210;0;204;0;204;0;204;0;204;0;12;0;0
1970-01-01T00:19:36;1176;302;32799;4618;1329;3661;0;1018.3;20.65;255;255;180;195;180;195;180;195;180;195;210;0;204;0;204;0;204;0;204;0;12;0;0
1970-01-01T00:19:43;1184;302;32550;4619;1329;3661;0;1019.4;20.63;255;255;180;195;180;195;180;195;180;195;210;0;204;0;204;0;204;0;204;0;12;0;0
1970-01-01T00:19:51;1191;302;32568;4619;1329;3661;0;1020.5;20.72;255;255;180;195;180;195;180;195;180;195;210;0;204;0;204;0;204;0;204;0;12;0;0
1970-01-01T00:19:58;1198;303;32583;4613;1329;3661;0;1020.5;20.74;255;255;180;195;180;195;180;195;180;195;210;0;204;0;204;0;204;0;204;0;12;0;0
1970-01-01T00:20:05;1205;303;32521;4614;1326;3661;0;1021.6;20.74;255;255;180;195;180;195;180;195;180;195;210;0;204;0;204;0;204;0;204;0;12;0;0
1970-01-01T00:20:13;1213;303;32822;4618;1327;3660;0;1020.5;20.72;255;255;180;195;180;195;180;195;180;195;210;0;204;0;204;0;204;0;204;0;12;0;0
1970-01-01T00:20:20;1220;303;32727;4611;1329;3661;0;1021.6;20.74;255;255;180;195;180;195;180;195;180;195;210;0;204;0;204;0;204;0;204;0;12;0;0
1970-01-01T00:20:27;1227;302;32555;4613;1328;3661;0;1020.5;20.72;255;255;180;195;180;195;180;195;180;195;210;0;204;0;204;0;204;0;204;0;12;0;0
1970-01-01T00:20:35;1235;301;32877;4620;1322;3661;0;1019.4;20.63;255;255;180;195;180;195;180;195;180;195;210;0;204;0;204;0;204;0;204;0;12;0;0
1970-01-01T00:20:42;1242;302;32871;4620;1325;3643;0;1018.3;20.67;255;255;180;195;180;195;180;195;180;195;210;0;204;0;204;0;204;0;204;0;12;0;0
1970-01-01T00:20:49;1249;303;32869;4619;1329;3661;0;1017.2;20.67;255;255;180;195;180;195;180;195;180;195;210;0;204;0;204;0;204;0;204;0;12;0;0
1970-01-01T00:20:57;1257;302;32544;4611;1329;3661;0;1020.5;20.72;255;255;180;195;180;195;180;195;180;195;210;0;204;0;204;0;204;0;204;0;12;0;0
1970-01-01T00:21:04;1264;303;32670;4618;1325;3661;0;1020.5;20.74;255;255;180;195;180;195;180;195;180;195;210;0;204;0;204;0;204;0;204;0;12;0;0
1970-01-01T00:21:11;1271;303;32874;4619;1323;3643;0;1020.5;20.75;255;255;180;195;180;195;180;195;180;195;210;0;204;0;204;0;204;0;204;0;12;0;0
1970-01-01T00:21:19;1279;303;32880;4619;1329;3660;0;1020.5;20.74;255;255;180;195;180;195;180;195;180;195;210;0;204;0;204;0;204;0;204;0;12;0;0
1970-01-01T00:21:26;1286;303;32549;4620;1329;3643;0;1021.6;20.75;255;255;180;195;180;195;180;195;180;195;210;0;204;0;204;0;204;0;204;0;12;0;0
1970-01-01T00:21:33;1293;304;32818;4621;1329;3642;0;1021.6;20.74;255;255;180;195;180;195;180;195;180;195;210;0;204;0;204;0;204;0;204;0;12;0;0
1970-01-01T00:21:40;1300;302;32876;4619;1322;3650;0;1020.5;20.75;255;255;180;195;180;195;180;195;180;195;210;0;204;0;204;0;204;0;204;0;12;0;0
1970-01-01T00:21:48;1308;302;32872;4619;1323;3645;0;1017.2;20.68;255;255;180;195;180;195;180;195;180;195;210;0;204;0;204;0;204;0;204;0;12;0;0
1970-01-01T00:21:55;1315;303;32876;4620;1322;3657;0;1019.4;20.63;255;255;180;195;180;195;180;195;180;195;210;0;204;0;204;0;204;0;204;0;12;0;0
1970-01-01T00:22:02;1322;303;32869;4619;1324;3644;0;1020.5;20.75;255;255;180;195;180;195;180;195;180;195;210;0;204;0;204;0;204;0;204;0;12;0;0
1970-01-01T00:22:10;1330;303;32864;4619;1329;3661;0;1020.5;20.74;255;255;180;195;180;195;180;195;180;195;210;0;204;0;204;0;204;0;204;0;12;0;0
1970-01-01T00:22:17;1337;303;32587;4620;1329;3654;0;1021.6;20.74;255;255;180;195;180;195;180;195;180;195;210;0;204;0;204;0;204;0;204;0;12;0;0
1970-01-01T00:22:24;1344;303;32731;4619;1329;3642;0;1020.5;20.75;255;255;180;195;180;195;180;195;180;195;210;0;204;0;204;0;204;0;204;0;12;0;0
1970-01-01T00:22:32;1352;303;32857;4619;1329;3659;0;1020.6;20.75;255;255;180;195;180;195;180;195;180;195;210;0;204;0;204;0;204;0;204;0;12;0;0
1970-01-01T00:22:39;1359;302;32688;4613;1329;3660;0;1020.6;20.75;255;255;180;195;180;195;180;195;180;195;210;0;204;0;204;0;204;0;204;0;12;0;0
1970-01-01T00:22:46;1366;302;32692;4612;1329;3661;0;1017.2;20.68;255;255;180;195;180;195;180;195;180;195;210;0;204;0;204;0;204;0;204;0;12;0;0
1970-01-01T00:22:54;1374;302;32597;4611;1329;3661;0;1019.4;20.65;255;255;180;195;180;195;180;195;180;195;210;0;204;0;204;0;204;0;204;0;12;0;0
1970-01-01T00:23:01;1381;303;32557;4616;1325;3659;0;1020.5;20.65;255;255;180;195;180;195;180;195;180;195;210;0;204;0;204;0;204;0;204;0;12;0;0
1970-01-01T00:23:08;1388;303;32871;4619;1329;3660;0;1020.6;20.72;255;255;180;195;180;195;180;195;180;195;210;0;204;0;204;0;204;0;204;0;12;0;0
1970-01-01T00:23:15;1395;303;32574;4614;1329;3661;0;1021.6;20.75;255;255;180;195;180;195;180;195;180;195;210;0;204;0;204;0;204;0;204;0;12;0;0
1970-01-01T00:23:23;1403;303;32854;4619;1325;3642;0;1020.6;20.75;255;255;180;195;180;195;180;195;180;195;210;0;204;0;204;0;204;0;204;0;12;0;0
1970-01-01T00:23:30;1410;303;32878;4619;1326;3643;0;1020.6;20.75;255;255;180;195;180;195;180;195;180;195;210;0;204;0;204;0;204;0;204;0;12;0;0
1970-01-01T00:23:37;1417;303;32866;4620;1329;3655;0;1020.5;20.75;255;255;180;195;180;195;180;195;180;195;210;0;204;0;204;0;204;0;204;0;12;0;0
1970-01-01T00:23:45;1425;302;32704;4620;1329;3660;0;1021.6;20.75;255;255;180;195;180;195;180;195;180;195;210;0;204;0;204;0;204;0;204;0;12;0;0
1970-01-01T00:23:52;1432;302;32593;4620;1329;3661;0;1017.2;20.68;255;255;180;195;180;195;180;195;180;195;210;0;204;0;204;0;204;0;204;0;12;0;0
1970-01-01T00:23:59;1439;302;32601;4614;1329;3660;0;1019.4;20.72;255;255;180;195;180;195;180;195;180;195;210;0;204;0;204;0;204;0;204;0;12;0;0
1970-01-01T00:24:07;1447;303;32846;4619;1322;3644;0;1020.5;20.67;255;255;180;195;180;195;180;195;180;195;210;0;204;0;204;0;204;0;204;0;12;0;0
1970-01-01T00:24:14;1454;302;32872;4621;1322;3650;0;1018.4;20.67;255;255;180;195;180;195;180;195;180;195;210;0;204;0;204;0;204;0;204;0;12;0;0
1970-01-01T00:24:21;1461;303;32872;4620;1322;3644;0;1020.6;20.74;255;255;180;195;180;195;180;195;180;195;210;0;204;0;204;0;204;0;204;0;12;0;0
1970-01-01T00:24:29;1469;303;32864;4619;1329;3661;0;1021.6;20.77;255;255;180;195;180;195;180;195;180;195;210;0;204;0;204;0;204;0;204;0;12;0;0
1970-01-01T00:24:36;1476;303;32599;4620;1329;3661;0;1021.7;20.77;255;255;180;195;180;195;180;195;180;195;210;0;204;0;204;0;204;0;204;0;12;0;0
1970-01-01T00:24:43;1483;304;32614;4614;1329;3660;0;1020.6;20.77;255;255;180;195;180;195;180;195;180;195;210;0;204;0;204;0;204;0;204;0;12;0;0
1970-01-01T00:24:51;1491;303;32714;4614;1329;3660;0;1020.6;20.77;255;255;180;195;180;195;180;195;180;195;210;0;204;0;204;0;204;0;204;0;12;0;0
1970-01-01T00:24:58;1498;302;32722;4619;1322;3649;0;1020.6;20.77;255;255;180;195;180;195;180;195;180;195;210;0;204;0;204;0;204;0;204;0;12;0;0
1970-01-01T00:25:05;1505;302;32872;4620;1329;3655;0;1019.5;20.67;255;255;180;195;180;195;180;195;180;195;210;0;204;0;204;0;204;0;204;0;12;0;0
1970-01-01T00:25:12;1512;302;32706;4612;1329;3660;0;1018.3;20.72;255;255;180;195;180;195;180;195;180;195;210;0;204;0;204;0;204;0;204;0;12;0;0
1970-01-01T00:25:20;1520;303;32553;4613;1329;3660;0;1019.5;20.67;255;255;180;195;180;195;180;195;180;195;210;0;204;0;204;0;204;0;204;0;12;0;0
1970-01-01T00:25:27;1527;303;32745;4619;1323;3652;0;1019.5;20.77;255;255;180;195;180;195;180;195;180;195;210;0;204;0;204;0;204;0;204;0;12;0;0
1970-01-01T00:25:34;1534;303;32868;4619;1329;3655;0;1020.6;20.77;255;255;180;195;180;195;180;195;180;195;210;0;204;0;204;0;204;0;204;0;12;0;0
1970-01-01T00:25:42;1542;303;32725;4620;1329;3661;0;1020.6;20.77;255;255;180;195;180;195;180;195;180;195;210;0;204;0;204;0;204;0;204;0;12;0;0
1970-01-01T00:25:49;1549;304;32668;4618;1329;3661;0;1020.6;20.77;255;255;180;195;180;195;180;195;180;195;210;0;204;0;204;0;204;0;204;0;12;0;0
1970-01-01T00:25:56;1556;303;32524;4614;1328;3660;0;1019.5;20.77;255;255;180;195;180;195;180;195;180;195;210;0;204;0;204;0;204;0;204;0;12;0;0
1970-01-01T00:26:04;1564;302;32812;4620;1322;3661;0;1020.6;20.79;255;255;180;195;180;195;180;195;180;195;210;0;204;0;204;0;204;0;204;0;12;0;0
1970-01-01T00:26:11;1571;303;32872;4619;1325;3642;0;1017.3;20.68;255;255;180;195;180;195;180;195;180;195;210;0;204;0;204;0;204;0;204;0;12;0;0
1970-01-01T00:26:18;1578;302;32871;4621;1323;3661;0;1019.5;20.68;255;255;180;195;180;195;180;195;180;195;210;0;204;0;204;0;204;0;204;0;12;0;0
1970-01-01T00:26:26;1586;303;32775;4612;1329;3661;0;1019.5;20.68;255;255;180;195;180;195;180;195;180;195;210;0;204;0;204;0;204;0;204;0;12;0;0
1970-01-01T00:26:33;1593;304;32551;4612;1329;3660;0;1020.6;20.79;255;255;180;195;180;195;180;195;180;195;210;0;204;0;204;0;204;0;204;0;12;0;0
1970-01-01T00:26:40;1600;303;32522;4615;1329;3660;0;1020.6;20.77;255;255;180;195;180;195;180;195;180;195;210;0;204;0;204;0;204;0;204;0;12;0;0
1970-01-01T00:26:47;1607;303;32767;4621;1323;3645;0;1020.6;20.79;255;255;180;195;180;195;180;195;180;195;210;0;204;0;204;0;204;0;204;0;12;0;0
1970-01-01T00:26:55;1615;303;32873;4621;1325;3661;0;1020.6;20.79;255;255;180;195;180;195;180;195;180;195;210;0;204;0;204;0;204;0;204;0;12;0;0
1970-01-01T00:27:02;1622;303;32775;4621;1322;3654;0;1020.6;20.79;255;255;180;195;180;195;180;195;180;195;210;0;204;0;204;0;204;0;204;0;12;0;0
1970-01-01T00:27:09;1629;302;32865;4621;1322;3659;0;1020.6;20.79;255;255;180;195;180;195;180;195;180;195;210;0;204;0;204;0;204;0;204;0;12;0;0
1970-01-01T00:27:17;1637;302;32873;4621;1326;3642;0;1019.5;20.68;255;255;180;195;180;195;180;195;180;195;210;0;204;0;204;0;204;0;204;0;12;0;0
1970-01-01T00:27:24;1644;302;32866;4621;1326;3643;0;1019.5;20.68;255;255;180;195;180;195;180;195;180;195;210;0;204;0;204;0;204;0;204;0;12;0;0
1970-01-01T00:27:31;1651;302;32863;4620;1329;3660;0;1016.2;20.72;255;255;180;195;180;195;180;195;180;195;210;0;204;0;204;0;204;0;204;0;12;0;0
1970-01-01T00:27:39;1659;302;32527;4615;1329;3660;0;1020.6;20.77;255;255;180;195;180;195;180;195;180;195;210;0;204;0;204;0;204;0;204;0;12;0;0
1970-01-01T00:27:46;1666;303;32873;4620;1323;3643;0;1020.6;20.81;255;255;180;195;180;195;180;195;180;195;210;0;204;0;204;0;204;0;204;0;12;0;0
1970-01-01T00:27:53;1673;303;32868;4621;1325;3642;0;1020.6;20.79;255;255;180;195;180;195;180;195;180;195;210;0;204;0;204;0;204;0;204;0;12;0;0
1970-01-01T00:28:01;1681;304;32871;4621;1329;3642;0;1021.7;20.81;255;255;180;195;180;195;180;195;180;195;210;0;204;0;204;0;204;0;204;0;12;0;0
1970-01-01T00:28:08;1688;302;32846;4620;1329;3660;0;1020.6;20.79;255;255;180;195;180;195;180;195;180;195;210;0;204;0;204;0;204;0;204;0;12;0;0
1970-01-01T00:28:15;1695;302;32609;4618;1329;3661;0;1017.2;20.72;255;255;180;195;180;195;180;195;180;195;210;0;204;0;204;0;204;0;204;0;12;0;0
1970-01-01T00:28:23;1703;303;32522;4615;1324;3654;0;1018.4;20.7;255;255;180;195;180;195;180;195;180;195;210;0;204;0;204;0;204;0;204;0;12;0;0
1970-01-01T00:28:30;1710;303;32875;4620;1322;3660;0;1019.5;20.7;255;255;180;195;180;195;180;195;180;195;210;0;204;0;204;0;204;0;204;0;12;0;0
1970-01-01T00:28:37;1717;303;32870;4621;1322;3645;0;1020.6;20.77;255;255;180;195;180;195;180;195;180;195;210;0;204;0;204;0;204;0;204;0;12;0;0
1970-01-01T00:28:44;1724;303;32875;4621;1329;3660;0;1020.6;20.79;255;255;180;195;180;195;180;195;180;195;210;0;204;0;204;0;204;0;204;0;12;0;0
1970-01-01T00:28:52;1732;303;32644;4617;1329;3661;0;1020.6;20.81;255;255;180;195;180;195;180;195;180;195;210;0;204;0;204;0;204;0;204;0;12;0;0
1970-01-01T00:28:59;1739;303;32530;4614;1329;3661;0;1020.6;20.79;255;255;180;195;180;195;180;195;180;195;210;0;204;0;204;0;204;0;204;0;12;0;0
1970-01-01T00:29:06;1746;302;32803;4613;1329;3660;0;1020.6;20.81;255;255;180;195;180;195;180;195;180;195;210;0;204;0;204;0;204;0;204;0;12;0;0
1970-01-01T00:29:14;1754;302;32551;4616;1327;3660;0;1018.4;20.74;255;255;180;195;180;195;180;195;180;195;210;0;204;0;204;0;204;0;204;0;12;0;0
1970-01-01T00:29:21;1761;302;32870;4620;1322;3642;0;1017.3;20.74;255;255;180;195;180;195;180;195;180;195;210;0;204;0;204;0;204;0;204;0;12;0;0
1970-01-01T00:29:28;1768;303;32869;4622;1323;3644;0;1020.6;20.7;255;255;180;195;180;195;180;195;180;195;210;0;204;0;204;0;204;0;204;0;12;0;0
1970-01-01T00:29:36;1776;303;32874;4621;1325;3661;0;1020.6;20.77;255;255;180;195;180;195;180;195;180;195;210;0;204;0;204;0;204;0;204;0;12;0;0
1970-01-01T00:29:43;1783;303;32774;4620;1322;3649;0;1021.7;20.82;255;255;180;195;180;195;180;195;180;195;210;0;204;0;204;0;204;0;204;0;12;0;0
1970-01-01T00:29:50;1790;304;32867;4621;1328;3652;0;1020.6;20.81;255;255;180;195;180;195;180;195;180;195;210;0;204;0;204;0;204;0;204;0;12;0;0
1970-01-01T00:29:58;1798;304;32754;4619;1329;3661;0;1020.6;20.81;255;255;180;195;180;195;180;195;180;195;210;0;204;0;204;0;204;0;204;0;12;0;0
1970-01-01T00:30:05;1805;303;32524;4614;1329;3661;0;1021.7;20.82;255;255;180;195;180;195;180;195;180;195;210;0;204;0;204;0;204;0;204;0;12;0;0
1970-01-01T00:30:12;1812;303;32528;4614;1329;3661;0;1020.6;20.81;255;255;180;195;180;195;180;195;180;195;210;0;204;0;204;0;204;0;204;0;12;0;0
1970-01-01T00:30:19;1819;302;32537;4615;1328;3660;0;1018.4;20.75;255;255;180;195;180;195;180;195;180;195;210;0;204;0;204;0;204;0;204;0;12;0;0
1970-01-01T00:30:27;1827;303;32874;4621;1323;3661;0;1018.4;20.72;255;255;180;195;180;195;180;195;180;195;210;0;204;0;204;0;204;0;204;0;12;0;0
1970-01-01T00:30:34;1834;302;32870;4622;1322;3643;0;1018.4;20.72;255;255;180;195;180;195;180;195;180;195;210;0;204;0;204;0;204;0;204;0;12;0;0
1970-01-01T00:30:41;1841;303;32877;4621;1325;3643;0;1020.6;20.77;255;255;180;195;180;195;180;195;180;195;210;0;204;0;204;0;204;0;204;0;12;0;0
1970-01-01T00:30:49;1849;303;32869;4621;1326;3643;0;1020.6;20.82;255;255;180;195;180;195;180;195;180;195;210;0;204;0;204;0;204;0;204;0;12;0;0
1970-01-01T00:30:56;1856;303;32867;4621;1329;3645;0;1021.7;20.82;255;255;180;195;180;195;180;195;180;195;210;0;204;0;204;0;204;0;204;0;12;0;0
1970-01-01T00:31:03;1863;303;32819;4619;1329;3660;0;1019.5;20.82;255;255;180;195;180;195;180;195;180;195;210;0;204;0;204;0;204;0;204;0;12;0;0
1970-01-01T00:31:11;1871;303;32574;4614;1329;3660;0;1020.6;20.82;255;255;180;195;180;195;180;195;180;195;210;0;204;0;204;0;204;0;204;0;12;0;0
1970-01-01T00:31:18;1878;303;32619;4620;1323;3645;0;1020.6;20.82;255;255;180;195;180;195;180;195;180;195;210;0;204;0;204;0;204;0;204;0;12;0;0
1970-01-01T00:31:25;1885;302;32829;4622;1329;3660;0;1016.2;20.74;255;255;180;195;180;195;180;195;180;195;210;0;204;0;204;0;204;0;204;0;12;0;0
1970-01-01T00:31:33;1893;303;32606;4616;1326;3658;0;1018.4;20.75;255;255;180;195;180;195;180;195;180;195;210;0;204;0;204;0;204;0;204;0;12;0;0
1970-01-01T00:31:40;1900;303;32864;4623;1323;3643;0;1019.5;20.72;255;255;180;195;180;195;180;195;180;195;210;0;204;0;204;0;204;0;204;0;12;0;0
1970-01-01T00:31:47;1907;303;32867;4622;1329;3654;0;1019.5;20.75;255;255;180;195;180;195;180;195;180;195;210;0;204;0;204;0;204;0;204;0;12;0;0
1970-01-01T00:31:54;1914;303;32708;4616;1329;3660;0;1020.6;20.81;255;255;180;195;180;195;180;195;180;195;210;0;204;0;204;0;204;0;204;0;12;0;0
1970-01-01T00:32:02;1922;303;32801;4622;1324;3642;0;1020.6;20.82;255;255;180;195;180;195;180;195;180;195;210;0;204;0;204;0;204;0;204;0;12;0;0
1970-01-01T00:32:09;1929;304;32869;4622;1329;3660;0;1020.6;20.82;255;255;180;195;180;195;180;195;180;195;210;0;204;0;204;0;204;0;204;0;12;0;0
1970-01-01T00:32:16;1936;304;32583;4615;1328;3660;0;1020.6;20.82;255;255;180;195;180;195;180;195;180;195;210;0;204;0;204;0;204;0;204;0;12;0;0
1970-01-01T00:32:24;1944;303;32723;4622;1323;3643;0;1021.7;20.82;255;255;180;195;180;195;180;195;180;195;210;0;204;0;204;0;204;0;204;0;12;0;0
1970-01-01T00:32:31;1951;302;32872;4622;1329;3661;0;1020.6;20.82;255;255;180;195;180;195;180;195;180;195;210;0;204;0;204;0;204;0;204;0;12;0;0
1970-01-01T00:32:38;1958;302;32563;4616;1329;3660;0;1018.4;20.74;255;255;180;195;180;195;180;195;180;195;210;0;204;0;204;0;204;0;204;0;12;0;0
1970-01-01T00:32:46;1966;303;32708;4621;1328;3661;0;1018.4;20.77;255;255;180;195;180;195;180;195;180;195;210;0;204;0;204;0;204;0;204;0;12;0;0
1970-01-01T00:32:53;1973;303;32766;4623;1328;3661;0;1018.4;20.77;255;255;180;195;180;195;180;195;180;195;210;0;204;0;204;0;204;0;204;0;12;0;0
1970-01-01T00:33:00;1980;303;32708;4621;1322;3661;0;1020.6;20.81;255;255;180;195;180;195;180;195;180;195;210;0;204;0;204;0;204;0;204;0;12;0;0
1970-01-01T00:33:08;1988;303;32871;4621;1328;3653;0;1020.6;20.84;255;255;180;195;180;195;180;195;180;195;210;0;204;0;204;0;204;0;204;0;12;0;0
1970-01-01T00:33:15;1995;304;32702;4623;1329;3656;0;1020.6;20.84;255;255;180;195;180;195;180;195;180;195;210;0;204;0;204;0;204;0;204;0;12;0;0
1970-01-01T00:33:22;2002;303;32691;4617;1328;3660;0;1020.6;20.82;255;255;180;195;180;195;180;195;180;195;210;0;204;0;204;0;204;0;204;0;12;0;0
1970-01-01T00:33:30;2010;304;32791;4622;1322;3644;0;1020.6;20.84;255;255;180;195;180;195;180;195;180;195;210;0;204;0;204;0;204;0;204;0;12;0;0
1970-01-01T00:33:37;2017;304;32869;4622;1323;3643;0;1020.6;20.84;255;255;180;195;180;195;180;195;180;195;210;0;204;0;204;0;204;0;204;0;12;0;0
1970-01-01T00:33:44;2024;303;32869;4622;1329;3651;0;1020.6;20.84;255;255;180;195;180;195;180;195;180;195;210;0;204;0;204;0;204;0;204;0;12;0;0
1970-01-01T00:33:51;2031;303;32754;4618;1329;3661;0;1020.6;20.74;255;255;180;195;180;195;180;195;180;195;210;0;204;0;204;0;204;0;204;0;12;0;0
1970-01-01T00:33:59;2039;303;32553;4615;1329;3661;0;1017.3;20.77;255;255;180;195;180;195;180;195;180;195;210;0;204;0;204;0;204;0;204;0;12;0;0
1970-01-01T00:34:06;2046;303;32527;4615;1329;3661;0;1020.6;20.75;255;255;180;195;180;195;180;195;180;195;210;0;204;0;204;0;204;0;204;0;12;0;0
1970-01-01T00:34:13;2053;303;32562;4620;1329;3660;0;1020.6;20.84;255;255;180;195;180;195;180;195;180;195;210;0;204;0;204;0;204;0;204;0;12;0;0
1970-01-01T00:34:21;2061;303;32711;4615;1329;3661;0;1021.7;20.84;255;255;180;195;180;195;180;195;180;195;210;0;204;0;204;0;204;0;204;0;12;0;0
1970-01-01T00:34:28;2068;304;32576;4614;1329;3661;0;1020.6;20.84;255;255;180;195;180;195;180;195;180;195;210;0;204;0;204;0;204;0;204;0;12;0;0
1970-01-01T00:34:35;2075;304;32667;4622;1322;3648;0;1020.6;20.84;255;255;180;195;180;195;180;195;180;195;210;0;204;0;204;0;204;0;204;0;12;0;0
1970-01-01T00:34:43;2083;304;32873;4622;1328;3660;0;1021.7;20.84;255;255;180;195;180;195;180;195;180;195;210;0;204;0;204;0;204;0;204;0;12;0;0
1970-01-01T00:34:50;2090;302;32565;4623;1329;3660;0;1020.6;20.84;255;255;180;195;180;195;180;195;180;195;210;0;204;0;204;0;204;0;204;0;12;0;0
1970-01-01T00:34:57;2097;303;32591;4622;1329;3662;0;1017.4;20.75;255;255;180;195;180;195;180;195;180;195;210;0;204;0;204;0;204;0;204;0;12;0;0
1970-01-01T00:35:05;2105;303;32528;4617;1326;3660;0;1018.4;20.79;255;255;180;195;180;195;180;195;180;195;210;0;204;0;204;0;204;0;204;0;12;0;0
1970-01-01T00:35:12;2112;303;32869;4623;1327;3642;0;1017.4;20.79;255;255;180;195;180;195;180;195;180;195;210;0;204;0;204;0;204;0;204;0;12;0;0
1970-01-01T00:35:19;2119;304;32876;4623;1323;3643;0;1021.7;20.82;255;255;180;195;180;195;180;195;180;195;210;0;204;0;204;0;204;0;204;0;12;0;0
1970-01-01T00:35:26;2126;304;32868;4623;1323;3642;0;1020.7;20.86;255;255;180;195;180;195;180;195;180;195;210;0;204;0;204;0;204;0;204;0;12;0;0
1970-01-01T00:35:34;2134;304;32875;4622;1329;3647;0;1020.6;20.86;255;255;180;195;180;195;180;195;180;195;210;0;204;0;204;0;204;0;204;0;12;0;0
1970-01-01T00:35:41;2141;304;32778;4624;1326;3642;0;1019.6;20.86;255;255;180;195;180;195;180;195;180;195;210;0;204;0;204;0;204;0;204;0;12;0;0
1970-01-01T00:35:48;2148;303;32872;4623;1322;3643;0;1020.7;20.86;255;255;180;195;180;195;180;195;180;195;210;0;204;0;204;0;204;0;204;0;12;0;0
1970-01-01T00:35:56;2156;303;32874;4623;1329;3643;0;1018.4;20.81;255;255;180;195;180;195;180;195;180;195;210;0;204;0;204;0;204;0;204;0;12;0;0
1970-01-01T00:36:03;2163;304;32863;4624;1323;3642;0;1018.5;20.75;255;255;180;195;180;195;180;195;180;195;210;0;204;0;204;0;204;0;204;0;12;0;0
1970-01-01T00:36:10;2170;303;32872;4623;1329;3661;0;1019.5;20.75;255;255;180;195;180;195;180;195;180;195;210;0;204;0;204;0;204;0;204;0;12;0;0
1970-01-01T00:36:18;2178;303;32648;4624;1329;3661;0;1020.7;20.79;255;255;180;195;180;195;180;195;180;195;210;0;204;0;204;0;204;0;204;0;12;0;0
1970-01-01T00:36:25;2185;304;32590;4617;1328;3661;0;1019.6;20.84;255;255;180;195;180;195;180;195;180;195;210;0;204;0;204;0;204;0;204;0;12;0;0
1970-01-01T00:36:32;2192;304;32766;4623;1325;3644;0;1020.7;20.86;255;255;180;195;180;195;180;195;180;195;210;0;204;0;204;0;204;0;204;0;12;0;0
1970-01-01T00:36:40;2200;304;32833;4622;1328;3661;0;1020.7;20.88;255;255;180;195;180;195;180;195;180;195;210;0;204;0;204;0;204;0;204;0;12;0;0
1970-01-01T00:36:47;2207;304;32557;4617;1328;3661;0;1020.7;20.86;255;255;180;195;180;195;180;195;180;195;210;0;204;0;204;0;204;0;204;0;12;0;0
1970-01-01T00:36:54;2214;304;32771;4623;1322;3644;0;1021.8;20.86;255;255;180;195;180;195;180;195;180;195;210;0;204;0;204;0;204;0;204;0;12;0;0
1970-01-01T00:37:01;2221;303;32866;4623;1329;3652;0;1019.5;20.75;255;255;180;195;180;195;180;195;180;195;210;0;204;0;204;0;204;0;204;0;12;0;0
1970-01-01T00:37:09;2229;303;32725;4618;1328;3660;0;1019.6;20.77;255;255;180;195;180;195;180;195;180;195;210;0;204;0;204;0;204;0;204;0;12;0;0
1970-01-01T00:37:16;2236;304;32867;4622;1328;3660;0;1019.6;20.77;255;255;180;195;180;195;180;195;180;195;210;0;204;0;204;0;204;0;204;0;12;0;0
1970-01-01T00:37:23;2243;304;32632;4617;1329;3661;0;1019.6;20.77;255;255;180;195;180;195;180;195;180;195;210;0;204;0;204;0;204;0;204;0;12;0;0
1970-01-01T00:37:31;2251;304;32587;4623;1323;3661;0;1020.7;20.86;255;255;180;195;180;195;180;195;180;195;210;0;204;0;204;0;204;0;204;0;12;0;0
1970-01-01T00:37:38;2258;304;32867;4623;1322;3660;0;1020.7;20.86;255;255;180;195;180;195;180;195;180;195;210;0;204;0;204;0;204;0;204;0;12;0;0
1970-01-01T00:37:45;2265;304;32871;4623;1328;3660;0;1020.7;20.88;255;255;180;195;180;195;180;195;180;195;210;0;204;0;204;0;204;0;204;0;12;0;0
