0 0 26 0 0.23 48 1
15 0 26 2 0.56 48 1
30 0 25 5 0.71 48 1
45 0 25 8 0.89 48 1
60 0 25 11 0.95 48 1
75 0 25 14 0.89 48 1
90 0 25 17 0.83 48 1
105 0 25 19 0.86 48 1
120 0 25 23 1.07 48 1
135 0 25 26 1.25 48 1
150 0 25 28 1.43 48 1
165 0 25 31 1.67 48 1
180 0 25 35 2.27 48 1
195 0 25 37 2.21 48 1
210 0 25 39 2.12 48 1
225 0 25 43 2.24 48 1
240 0 25 46 2.33 48 1
255 0 25 50 2.39 48 1

0 15 25 21 0.20 48 1
15 15 25 499 0.56 48 1
30 15 25 1178 0.83 48 1
45 15 25 1767 1.10 48 1
60 15 25 2127 1.31 48 1
75 15 25 2868 1.43 48 1
90 15 25 3536 1.55 48 1
105 15 25 4125 1.31 48 1
120 15 25 4494 1.16 48 1
135 15 25 5233 1.37 48 1
150 15 25 5892 1.67 48 1
165 15 25 6471 2.18 48 1
180 15 25 6861 2.48 48 1
195 15 25 7607 2.33 48 1
210 15 25 8239 2.27 48 1
225 15 25 8826 2.42 48 1
240 15 25 9223 2.51 48 1
255 15 25 9967 2.60 48 1

0 30 25 0 0.14 48 1
15 30 25 1127 0.68 48 1
30 30 25 1867 0.71 48 1
45 30 25 3283 0.47 48 1
60 30 25 4511 1.01 48 1
75 30 25 5639 1.43 48 1
90 30 25 6389 1.67 48 1
105 30 25 7810 1.49 48 1
120 30 25 9020 1.13 48 1
135 30 25 10146 1.37 48 1
150 30 25 10913 1.64 48 1
165 30 25 12332 2.33 48 1
180 30 25 13527 2.42 48 1
195 30 25 14650 2.15 48 1
210 30 25 15445 2.33 48 1
225 30 25 16857 2.45 48 1
240 30 25 18021 2.57 48 1
255 30 25 19140 2.66 48 1

0 45 25 5629 0.14 48 1
15 45 25 1579 0.11 48 1
30 45 25 3284 0.47 48 1
45 45 25 4934 1.01 48 1
60 45 25 6115 1.34 48 1
75 45 25 8175 1.34 48 1
90 45 25 9856 0.74 48 1
105 45 25 11491 1.04 48 1
120 45 25 12707 1.88 48 1
135 45 25 14785 2.18 48 1
150 45 25 16431 1.79 48 1
165 45 25 18047 1.82 48 1
180 45 25 19320 2.03 48 1
195 45 25 21353 2.21 48 1
210 45 25 22973 2.66 48 1
225 45 25 24608 2.51 48 1
240 45 25 25910 2.63 48 1
255 45 25 27886 2.72 48 1

0 60 25 0 0.17 48 1
15 60 25 2126 0.71 48 1
30 60 25 3764 0.74 48 1
45 60 25 6376 0.41 48 1
60 60 25 8497 0.50 48 1
75 60 25 10619 1.34 48 1
90 60 25 12309 1.73 48 1
105 60 25 14862 1.55 48 1
120 60 25 16969 1.16 48 1
135 60 25 19075 1.64 48 1
150 60 25 20827 2.36 48 1
165 60 25 23314 1.88 48 1
180 60 25 25430 2.03 48 1
195 60 25 26658 2.21 48 1
210 60 25 29319 2.69 48 1
225 60 25 31795 2.51 48 1
240 60 25 33888 2.63 48 1
255 60 25 35154 2.75 48 1

0 75 25 6406 0.14 48 1
15 75 25 2592 0.68 48 1
30 75 25 5185 0.71 48 1
45 75 25 6671 0.29 48 1
60 75 25 9962 0.50 48 1
75 75 25 12955 1.28 48 1
90 75 25 15544 1.73 48 1
105 75 25 17092 1.82 48 1
120 75 25 20371 1.19 48 1
135 75 25 23293 1.85 48 1
150 75 25 25841 2.39 48 1
165 75 25 27506 1.91 48 1
180 75 25 30734 2.06 48 1
195 75 25 33586 2.27 48 1
210 75 25 36186 2.72 48 1
225 75 25 37837 2.57 48 1
240 75 25 41062 2.69 48 1
255 75 25 43887 2.78 48 1

0 90 25 0 0.14 48 1
15 90 25 1939 0.56 48 1
30 90 25 5756 0.11 48 1
45 90 25 9111 0.68 48 1
60 90 25 12143 1.28 48 1
75 90 25 14140 1.55 48 1
90 90 25 17944 0.95 48 1
105 90 25 21194 1.04 48 1
120 90 25 24249 2.03 48 1
135 90 25 26287 1.94 48 1
150 90 25 30102 1.67 48 1
165 90 25 33298 2.12 48 1
180 90 25 36290 2.48 48 1
195 90 25 38431 2.27 48 1
210 90 25 42201 2.45 48 1
225 90 26 45342 2.69 48 1
240 90 26 48345 2.72 48 1
255 90 26 50540 2.84 48 1

0 105 25 3053 0.14 48 1
15 105 25 3461 0.35 48 1
30 105 25 6923 0.11 48 1
45 105 25 9378 0.86 48 1
60 105 25 13698 1.34 48 1
75 105 25 17285 1.49 48 1
90 105 25 20694 0.92 48 1
105 105 25 23250 1.04 48 1
120 105 25 27546 2.03 48 1
135 105 25 31054 2.09 48 1
150 105 25 34464 1.70 48 1
165 105 25 37041 2.09 48 1
180 105 25 41295 2.42 48 1
195 105 26 44742 2.30 48 1
210 105 26 48157 2.72 48 1
225 105 26 50821 2.63 48 1
240 105 26 55009 2.75 48 1
255 105 26 58445 2.87 48 1

0 120 25 0 0.20 48 1
15 120 25 2704 0.71 48 1
30 120 25 7596 0.92 48 1
45 120 25 11626 1.10 48 1
60 120 25 15492 0.95 48 1
75 120 25 18316 0.50 48 1
90 120 25 23167 1.04 48 1
105 120 25 27039 1.88 48 1
120 120 25 30916 2.12 48 1
135 120 25 33806 1.55 48 1
150 120 26 38613 1.70 48 1
165 120 26 42437 2.51 48 1
180 120 26 46259 2.15 48 1
195 120 26 49244 2.33 48 1
210 120 26 53911 2.66 48 1
225 120 26 57747 2.66 48 1
240 120 26 61542 2.90 48 1
255 120 26 64611 2.90 48 1

0 135 25 0 0.17 48 1
15 135 25 4269 0.08 48 1
30 135 25 8542 0.20 48 1
45 135 25 11911 0.26 48 1
60 135 25 17084 1.10 48 1
75 135 25 21300 1.58 48 1
90 135 25 25589 1.76 48 1
105 135 25 29025 1.16 48 1
120 135 25 34066 1.25 48 1
135 135 26 38279 2.24 48 1
150 135 26 40738 2.27 48 1
165 135 26 46059 1.94 48 1
180 135 26 50936 2.66 48 1
195 135 26 55142 2.36 48 1
210 135 26 57704 2.54 48 1
225 135 26 62973 2.69 48 1
240 135 26 65535 2.84 48 1
255 135 26 65535 2.96 48 1

0 150 25 28900 0.14 48 1
15 150 25 3985 0.08 48 1
30 150 25 9319 0.59 48 1
45 150 25 13967 1.04 48 1
60 150 25 16816 1.40 48 1
75 150 25 22637 0.98 48 1
90 150 25 27879 0.98 48 1
105 150 25 32477 2.00 48 1
120 150 26 35436 1.37 48 1
135 150 26 41258 1.70 48 1
150 150 26 46299 2.45 48 1
165 150 26 50889 1.97 48 1
180 150 26 53933 2.75 48 1
195 150 26 59665 2.39 48 1
210 150 26 64628 2.69 48 1
225 150 26 65535 2.72 48 1
240 150 27 65535 2.87 48 1
255 150 27 65535 2.99 48 1

0 165 25 0 0.14 48 1
15 165 25 5046 0.71 48 1
30 165 25 8467 0.65 48 1
45 165 25 14800 0.14 48 1
60 165 25 20135 1.07 48 1
75 165 25 25171 1.64 48 1
90 165 25 28637 1.46 48 1
105 165 26 34937 1.01 48 1
120 165 26 40154 2.21 48 1
135 165 26 45109 1.52 48 1
150 165 26 48713 2.51 48 1
165 165 26 54995 2.00 48 1
180 165 26 59971 2.87 48 1
195 165 26 64968 2.42 48 1
210 165 27 65535 2.60 48 1
225 165 27 65535 3.02 48 1
240 165 27 65535 2.90 48 1
255 165 27 65535 3.02 48 1

0 180 25 22710 0.14 48 1
15 180 25 5345 0.50 48 1
30 180 25 10836 0.92 48 1
45 180 25 16240 1.19 48 1
60 180 25 20319 0.59 48 1
75 180 25 27004 1.34 48 1
90 180 26 32362 1.79 48 1
105 180 26 37723 1.04 48 1
120 180 26 41840 2.24 48 1
135 180 26 48433 1.52 48 1
150 180 26 53693 2.57 48 1
165 180 26 59034 2.03 48 1
180 180 26 63262 2.24 48 1
195 180 27 65535 3.02 48 1
210 180 27 65535 2.63 48 1
225 180 27 65535 2.81 48 1
240 180 27 65535 2.93 48 1
255 180 27 65535 3.05 48 1

0 195 25 0 0.17 48 1
15 195 25 5776 0.47 48 1
30 195 25 10446 0.11 48 1
45 195 25 17302 1.01 48 1
60 195 25 22996 1.43 48 1
75 195 26 28760 0.74 48 1
90 195 26 33540 1.64 48 1
105 195 26 40172 1.70 48 1
120 195 26 45845 1.97 48 1
135 195 26 49254 1.55 48 1
150 195 26 56398 2.60 48 1
165 195 27 62778 2.03 48 1
180 195 27 65535 2.24 48 1
195 195 27 65535 2.99 48 1
210 195 27 65535 2.66 48 1
225 195 27 65535 2.81 48 1
240 195 27 65535 2.96 48 1
255 195 28 65535 3.08 48 1

0 210 25 13326 0.20 48 1
15 210 25 6127 0.08 48 1
30 210 25 12250 0.41 48 1
45 210 25 16092 1.16 48 1
60 210 26 23720 1.40 48 1
75 210 26 30494 0.53 48 1
90 210 26 36542 1.85 48 1
105 210 26 40467 1.07 48 1
120 210 26 48119 2.27 48 1
135 210 26 54595 1.55 48 1
150 210 26 60531 2.63 48 1
165 210 27 64555 2.18 48 1
180 210 27 65535 2.27 48 1
195 210 27 65535 2.48 48 1
210 210 27 65535 2.69 48 1
225 210 27 65535 3.05 48 1
240 210 28 65535 3.11 48 1
255 210 28 65535 3.11 48 1

0 225 26 0 0.23 48 1
15 225 25 4434 0.08 48 1
30 225 25 12573 0.38 48 1
45 225 26 19417 1.13 48 1
60 225 26 25811 1.43 48 1
75 225 26 30368 0.53 48 1
90 225 26 38430 1.85 48 1
105 225 26 45045 1.07 48 1
120 225 26 51335 2.30 48 1
135 225 27 55958 1.58 48 1
150 225 27 63987 2.15 48 1
165 225 27 65535 2.60 48 1
180 225 27 65535 2.30 48 1
195 225 27 65535 2.51 48 1
210 225 27 65535 2.69 48 1
225 225 28 65535 2.87 48 1
240 225 28 65535 3.02 48 1
255 225 28 65535 3.14 48 1

0 240 26 666 0.23 48 1
15 240 26 6792 0.44 48 1
30 240 26 13638 0.92 48 1
45 240 26 18776 1.13 48 1
60 240 26 27185 0.53 48 1
75 240 26 33917 1.70 48 1
90 240 26 40614 0.77 48 1
105 240 26 45914 2.12 48 1
120 240 26 54019 1.67 48 1
135 240 27 60567 1.58 48 1
150 240 27 65535 2.03 48 1
165 240 27 65535 2.09 48 1
180 240 27 65535 2.99 48 1
195 240 27 65535 3.02 48 1
210 240 28 65535 3.02 48 1
225 240 28 65535 3.20 48 1
240 240 28 65535 3.17 48 1
255 240 28 65535 3.17 48 1

0 255 26 0 0.20 48 1
15 255 26 5851 0.14 48 1
30 255 26 14334 0.17 48 1
45 255 26 21432 1.04 48 1
60 255 26 25581 1.43 48 1
75 255 26 34528 0.62 48 1
90 255 26 42670 1.94 48 1
105 255 26 49670 1.10 48 1
120 255 27 54001 1.91 48 1
135 255 27 62824 2.48 48 1
150 255 27 65535 1.91 48 1
165 255 27 65535 2.12 48 1
180 255 28 65535 2.33 48 1
195 255 28 65535 2.54 48 1
210 255 28 65535 2.75 48 1
225 255 28 65535 2.93 48 1
240 255 28 65535 3.08 48 1
255 255 29 65535 3.20 48 1

