0 0 27 0 0.02 152 2
15 0 27 3 0.44 152 2
30 0 26 5 0.83 152 2
45 0 26 8 0.92 152 2
60 0 26 11 1.22 152 2
75 0 26 14 1.16 152 2
90 0 26 18 0.74 152 2
105 0 26 21 0.86 152 2
120 0 26 23 1.19 152 2
135 0 26 26 1.67 152 2
150 0 26 29 1.88 152 2
165 0 26 32 1.79 152 2
180 0 26 35 1.64 152 2
195 0 26 39 1.76 152 2
210 0 26 41 1.88 152 2
225 0 26 45 1.97 152 2
240 0 26 47 2.03 152 2
255 0 26 50 2.09 152 2

0 15 26 0 0.02 152 2
15 15 26 727 0.44 152 2
30 15 26 1447 0.80 152 2
45 15 26 2185 1.07 152 2
60 15 26 2895 1.28 152 2
75 15 26 3643 1.13 152 2
90 15 26 4373 1.07 152 2
105 15 26 5102 0.95 152 2
120 15 26 5831 1.13 152 2
135 15 26 6560 1.34 152 2
150 15 26 7285 1.49 152 2
165 15 26 8018 1.64 152 2
180 15 26 8730 1.82 152 2
195 15 26 9460 1.97 152 2
210 15 26 10187 2.09 152 2
225 15 26 10916 2.18 152 2
240 15 26 11645 2.27 152 2
255 15 26 12375 2.33 152 2

0 30 26 0 0.11 152 2
15 30 26 1297 0.47 152 2
30 30 26 2595 0.53 152 2
45 30 26 3894 0.62 152 2
60 30 26 5192 0.62 152 2
75 30 26 6490 0.56 152 2
90 30 26 7787 0.74 152 2
105 30 26 9055 0.95 152 2
120 30 26 10351 1.16 152 2
135 30 26 11648 1.34 152 2
150 30 26 12947 1.52 152 2
165 30 26 14242 1.73 152 2
180 30 26 15536 1.88 152 2
195 30 26 16848 2.00 152 2
210 30 26 18128 2.15 152 2
225 30 26 19450 2.27 152 2
240 30 26 20718 2.36 152 2
255 30 26 22013 2.42 152 2

0 45 26 0 0.02 152 2
15 45 26 1788 0.32 152 2
30 45 26 3578 0.47 152 2
45 45 26 5329 0.62 152 2
60 45 26 7156 0.59 152 2
75 45 26 8928 0.80 152 2
90 45 26 10731 0.95 152 2
105 45 26 12518 1.61 152 2
120 45 26 14303 1.76 152 2
135 45 26 16088 1.52 152 2
150 45 26 17838 1.76 152 2
165 45 26 19621 1.88 152 2
180 45 26 21401 2.00 152 2
195 45 26 23182 2.12 152 2
210 45 26 24970 2.27 152 2
225 45 26 26746 2.36 152 2
240 45 26 28533 2.48 152 2
255 45 26 30307 2.48 152 2

0 60 26 0 0.05 152 2
15 60 26 2215 0.14 152 2
30 60 26 4392 0.17 152 2
45 60 26 6646 0.20 152 2
60 60 26 8861 0.41 152 2
75 60 26 11073 0.62 152 2
90 60 26 13285 0.77 152 2
105 60 26 15458 0.95 152 2
120 60 26 17673 1.22 152 2
135 60 26 19876 1.43 152 2
150 60 26 22081 1.58 152 2
165 60 26 24326 1.79 152 2
180 60 26 26509 1.97 152 2
195 60 26 28698 2.12 152 2
210 60 26 30902 2.24 152 2
225 60 26 33098 2.36 152 2
240 60 26 35298 2.48 152 2
255 60 26 37498 2.54 152 2

0 75 26 0 0.14 152 2
15 75 26 2605 0.20 152 2
30 75 26 5213 0.50 152 2
45 75 26 7818 0.62 152 2
60 75 26 10423 0.71 152 2
75 75 26 13025 0.71 152 2
90 75 26 15579 0.83 152 2
105 75 26 18178 1.01 152 2
120 75 26 20817 1.22 152 2
135 75 26 23413 1.40 152 2
150 75 26 26004 1.64 152 2
165 75 26 28582 1.82 152 2
180 75 26 31147 2.36 152 2
195 75 26 33731 2.21 152 2
210 75 26 36317 2.30 152 2
225 75 26 38897 2.42 152 2
240 75 26 41477 2.54 152 2
255 75 26 44057 2.60 152 2

0 90 26 0 0.02 152 2
15 90 26 2961 0.83 152 2
30 90 26 5924 1.07 152 2
45 90 26 8884 1.19 152 2
60 90 26 11840 1.37 152 2
75 90 26 14795 1.55 152 2
90 90 26 17748 1.67 152 2
105 90 26 20649 1.76 152 2
120 90 26 23595 1.67 152 2
135 90 26 26542 1.55 152 2
150 90 26 29488 1.67 152 2
165 90 26 32467 1.85 152 2
180 90 26 35402 2.12 152 2
195 90 26 38296 2.24 152 2
210 90 26 41229 2.54 152 2
225 90 27 44161 2.66 152 2
240 90 27 47088 2.57 152 2
255 90 27 50005 2.66 152 2

0 105 26 0 0.11 152 2
15 105 26 3260 0.77 152 2
30 105 26 6571 0.92 152 2
45 105 26 9856 1.10 152 2
60 105 26 13136 1.37 152 2
75 105 26 16412 1.58 152 2
90 105 26 19687 1.70 152 2
105 105 26 22955 1.58 152 2
120 105 26 26181 1.28 152 2
135 105 26 29444 1.49 152 2
150 105 26 32743 1.67 152 2
165 105 26 35997 1.88 152 2
180 105 27 39218 2.39 152 2
195 105 27 42465 2.57 152 2
210 105 27 45710 2.57 152 2
225 105 27 48962 2.51 152 2
240 105 27 52188 2.63 152 2
255 105 27 55423 2.72 152 2

0 120 26 0 0.11 152 2
15 120 26 3591 0.74 152 2
30 120 26 7184 0.83 152 2
45 120 26 10771 0.35 152 2
60 120 26 14359 0.47 152 2
75 120 26 17940 0.56 152 2
90 120 26 21516 0.95 152 2
105 120 26 25089 1.34 152 2
120 120 26 28653 1.88 152 2
135 120 26 32184 2.21 152 2
150 120 26 35742 2.21 152 2
165 120 27 39321 1.88 152 2
180 120 27 42858 2.06 152 2
195 120 27 46407 2.21 152 2
210 120 27 49941 2.60 152 2
225 120 27 53481 2.72 152 2
240 120 27 57011 2.63 152 2
255 120 27 60531 2.72 152 2

0 135 26 0 0.08 152 2
15 135 26 3889 0.83 152 2
30 135 26 7729 1.01 152 2
45 135 26 11628 1.25 152 2
60 135 26 15513 1.40 152 2
75 135 26 19377 1.46 152 2
90 135 26 23236 1.22 152 2
105 135 26 27087 1.07 152 2
120 135 26 30909 1.28 152 2
135 135 27 34751 1.91 152 2
150 135 27 38606 2.39 152 2
165 135 27 42425 2.33 152 2
180 135 27 46262 2.09 152 2
195 135 27 50070 2.27 152 2
210 135 27 53892 2.42 152 2
225 135 27 57706 2.69 152 2
240 135 27 61501 2.69 152 2
255 135 27 65285 2.78 152 2

0 150 26 0 0.02 152 2
15 150 26 4157 0.56 152 2
30 150 26 8307 0.68 152 2
45 150 26 12450 0.62 152 2
60 150 26 16589 0.32 152 2
75 150 26 20667 0.71 152 2
90 150 26 24804 1.37 152 2
105 150 26 28962 1.88 152 2
120 150 27 33070 2.15 152 2
135 150 27 37156 1.88 152 2
150 150 27 41257 1.73 152 2
165 150 27 45364 1.91 152 2
180 150 27 49434 2.60 152 2
195 150 27 53521 2.30 152 2
210 150 27 57596 2.45 152 2
225 150 27 61666 2.66 152 2
240 150 28 65535 2.78 152 2
255 150 28 65535 2.81 152 2

0 165 26 0 0.11 152 2
15 165 26 4418 0.83 152 2
30 165 26 8825 1.04 152 2
45 165 26 13224 1.19 152 2
60 165 26 17619 1.43 152 2
75 165 26 21957 1.49 152 2
90 165 27 26381 0.95 152 2
105 165 27 30749 1.58 152 2
120 165 27 35100 2.18 152 2
135 165 27 39465 2.03 152 2
150 165 27 43810 1.73 152 2
165 165 27 48161 2.09 152 2
180 165 27 52502 2.60 152 2
195 165 27 56837 2.33 152 2
210 165 28 61146 2.54 152 2
225 165 28 65466 2.63 152 2
240 165 28 65535 2.78 152 2
255 165 28 65535 2.87 152 2

0 180 26 0 0.11 152 2
15 180 26 4659 0.17 152 2
30 180 26 9310 0.11 152 2
45 180 26 13953 0.41 152 2
60 180 26 18585 1.07 152 2
75 180 26 23189 1.52 152 2
90 180 27 27813 1.85 152 2
105 180 27 32433 1.58 152 2
120 180 27 37030 1.31 152 2
135 180 27 41633 2.03 152 2
150 180 27 46190 2.39 152 2
165 180 27 50806 1.97 152 2
180 180 27 55326 2.36 152 2
195 180 28 59929 2.39 152 2
210 180 28 64411 2.54 152 2
225 180 28 65535 2.90 152 2
240 180 28 65535 2.81 152 2
255 180 28 65535 2.90 152 2

0 195 26 0 0.02 152 2
15 195 26 4889 0.08 152 2
30 195 26 9767 0.17 152 2
45 195 26 14635 0.56 152 2
60 195 26 19433 0.98 152 2
75 195 27 24302 1.52 152 2
90 195 27 29185 1.88 152 2
105 195 27 34014 1.76 152 2
120 195 27 38841 1.31 152 2
135 195 27 43631 2.00 152 2
150 195 27 48472 2.45 152 2
165 195 28 53222 2.00 152 2
180 195 28 58059 2.63 152 2
195 195 28 62772 2.39 152 2
210 195 28 65535 2.57 152 2
225 195 28 65535 2.72 152 2
240 195 28 65535 2.84 152 2
255 195 29 65535 2.96 152 2

0 210 27 0 0.05 152 2
15 210 26 5109 0.47 152 2
30 210 26 10212 0.74 152 2
45 210 27 15304 1.04 152 2
60 210 27 20384 1.43 152 2
75 210 27 25424 1.70 152 2
90 210 27 30498 1.34 152 2
105 210 27 35550 1.04 152 2
120 210 27 40601 2.15 152 2
135 210 27 45599 2.00 152 2
150 210 27 50677 2.15 152 2
165 210 28 55669 2.24 152 2
180 210 28 60677 2.24 152 2
195 210 28 65535 2.60 152 2
210 210 28 65535 2.57 152 2
225 210 28 65535 2.75 152 2
240 210 29 65535 2.87 152 2
255 210 29 65535 2.99 152 2

0 225 27 0 0.11 152 2
15 225 26 5327 0.86 152 2
30 225 27 10643 1.04 152 2
45 225 27 15951 1.25 152 2
60 225 27 21196 1.46 152 2
75 225 27 26524 0.92 152 2
90 225 27 31793 0.89 152 2
105 225 27 37063 1.97 152 2
120 225 27 42282 2.09 152 2
135 225 28 47500 1.58 152 2
150 225 28 52781 2.57 152 2
165 225 28 58026 2.06 152 2
180 225 28 63101 2.72 152 2
195 225 28 65535 2.45 152 2
210 225 28 65535 2.99 152 2
225 225 29 65535 2.78 152 2
240 225 29 65535 2.90 152 2
255 225 29 65535 3.02 152 2

0 240 27 0 0.02 152 2
15 240 27 5531 0.14 152 2
30 240 27 11056 0.11 152 2
45 240 27 16566 0.20 152 2
60 240 27 22063 0.53 152 2
75 240 27 27523 1.13 152 2
90 240 27 33013 1.79 152 2
105 240 27 38459 2.12 152 2
120 240 27 43943 1.55 152 2
135 240 28 49316 1.61 152 2
150 240 28 54837 2.63 152 2
165 240 28 60171 2.06 152 2
180 240 28 65534 2.69 152 2
195 240 29 65535 2.48 152 2
210 240 29 65535 3.08 152 2
225 240 29 65535 2.81 152 2
240 240 29 65535 2.93 152 2
255 240 29 65535 3.05 152 2

0 255 27 0 0.11 152 2
15 255 27 5741 0.65 152 2
30 255 27 11473 1.07 152 2
45 255 27 17194 1.22 152 2
60 255 27 22898 1.28 152 2
75 255 27 28586 0.68 152 2
90 255 27 34282 1.34 152 2
105 255 27 39966 2.12 152 2
120 255 28 45543 1.76 152 2
135 255 28 51166 1.64 152 2
150 255 28 56896 2.63 152 2
165 255 28 62345 2.09 152 2
180 255 28 65535 2.93 152 2
195 255 29 65535 2.48 152 2
210 255 29 65535 2.69 152 2
225 255 29 65535 2.84 152 2
240 255 29 65535 3.11 152 2
255 255 30 65535 3.08 152 2

