0 0 27 0 0.05 204 2
15 0 27 1 0.20 204 2
30 0 27 3 0.56 204 2
45 0 27 4 1.04 204 2
60 0 26 6 0.89 204 2
75 0 26 7 0.71 204 2
90 0 26 9 1.46 204 2
105 0 26 10 0.98 204 2
120 0 26 12 1.64 204 2
135 0 26 13 1.34 204 2
150 0 26 14 1.37 204 2
165 0 26 16 1.94 204 2
180 0 26 17 1.64 204 2
195 0 26 19 1.76 204 2
210 0 26 21 2.03 204 2
225 0 26 22 1.97 204 2
240 0 26 24 2.03 204 2
255 0 26 25 2.09 204 2

0 15 26 0 0.14 204 2
15 15 26 363 0.35 204 2
30 15 26 728 0.80 204 2
45 15 26 1092 1.01 204 2
60 15 26 1457 0.53 204 2
75 15 26 1822 1.37 204 2
90 15 26 2187 0.83 204 2
105 15 26 2542 1.43 204 2
120 15 26 2916 1.58 204 2
135 15 26 3281 1.28 204 2
150 15 26 3636 1.97 204 2
165 15 26 4000 1.67 204 2
180 15 26 4373 2.24 204 2
195 15 26 4738 1.97 204 2
210 15 26 5094 2.30 204 2
225 15 26 5458 2.18 204 2
240 15 26 5823 2.27 204 2
255 15 26 6188 2.33 204 2

0 30 26 0 0.14 204 2
15 30 26 649 0.77 204 2
30 30 26 1298 0.44 204 2
45 30 26 1947 1.04 204 2
60 30 26 2581 0.86 204 2
75 30 26 3230 1.25 204 2
90 30 26 3894 1.25 204 2
105 30 26 4542 1.10 204 2
120 30 26 5176 1.79 204 2
135 30 26 5824 1.31 204 2
150 30 26 6487 2.00 204 2
165 30 26 7136 1.70 204 2
180 30 26 7769 2.21 204 2
195 30 26 8417 2.03 204 2
210 30 26 9066 2.33 204 2
225 30 26 9713 2.27 204 2
240 30 26 10360 2.42 204 2
255 30 26 11007 2.42 204 2

0 45 26 0 0.08 204 2
15 45 26 894 0.83 204 2
30 45 26 1789 0.17 204 2
45 45 26 2664 1.16 204 2
60 45 26 3579 0.44 204 2
75 45 26 4472 1.46 204 2
90 45 26 5366 0.77 204 2
105 45 26 6260 1.73 204 2
120 45 26 7134 1.19 204 2
135 45 26 8027 1.64 204 2
150 45 26 8939 1.73 204 2
165 45 26 9813 1.76 204 2
180 45 26 10704 1.94 204 2
195 45 26 11593 2.27 204 2
210 45 26 12506 2.21 204 2
225 45 26 13376 2.36 204 2
240 45 26 14267 2.42 204 2
255 45 26 15156 2.48 204 2

0 60 26 0 0.02 204 2
15 60 26 1108 0.68 204 2
30 60 26 2205 0.56 204 2
45 60 26 3325 1.16 204 2
60 60 26 4431 0.56 204 2
75 60 26 5538 1.49 204 2
90 60 26 6622 0.77 204 2
105 60 26 7750 1.82 204 2
120 60 26 8856 1.19 204 2
135 60 26 9958 2.09 204 2
150 60 26 11039 1.61 204 2
165 60 26 12142 2.30 204 2
180 60 26 13246 1.94 204 2
195 60 26 14368 2.51 204 2
210 60 26 15451 2.24 204 2
225 60 26 16551 2.51 204 2
240 60 26 17652 2.48 204 2
255 60 26 18750 2.54 204 2

0 75 26 0 0.02 204 2
15 75 26 1303 0.14 204 2
30 75 26 2606 0.95 204 2
45 75 26 3910 0.23 204 2
60 75 26 5211 1.22 204 2
75 75 26 6514 1.01 204 2
90 75 26 7786 1.58 204 2
105 75 26 9086 1.16 204 2
120 75 26 10412 1.85 204 2
135 75 26 11710 1.52 204 2
150 75 26 13006 1.88 204 2
165 75 26 14279 1.85 204 2
180 75 26 15574 2.00 204 2
195 75 26 16868 2.15 204 2
210 75 26 18181 2.30 204 2
225 75 26 19451 2.45 204 2
240 75 27 20744 2.51 204 2
255 75 27 22034 2.60 204 2

0 90 26 0 0.02 204 2
15 90 26 1481 0.32 204 2
30 90 26 2950 0.92 204 2
45 90 26 4441 0.83 204 2
60 90 26 5921 1.16 204 2
75 90 26 7400 1.07 204 2
90 90 26 8874 1.52 204 2
105 90 26 10324 1.16 204 2
120 90 26 11799 1.97 204 2
135 90 26 13298 1.46 204 2
150 90 26 14768 2.30 204 2
165 90 26 16214 1.85 204 2
180 90 26 17684 2.48 204 2
195 90 27 19150 2.18 204 2
210 90 27 20620 2.51 204 2
225 90 27 22085 2.51 204 2
240 90 27 23561 2.57 204 2
255 90 27 25006 2.66 204 2

0 105 26 0 0.02 204 2
15 105 26 1643 0.14 204 2
30 105 26 3287 1.01 204 2
45 105 26 4929 0.44 204 2
60 105 26 6535 1.37 204 2
75 105 26 8175 0.62 204 2
90 105 26 9846 1.70 204 2
105 105 26 11482 1.07 204 2
120 105 26 13117 2.03 204 2
135 105 26 14722 1.49 204 2
150 105 26 16354 2.27 204 2
165 105 27 18006 1.88 204 2
180 105 27 19629 2.06 204 2
195 105 27 21237 2.39 204 2
210 105 27 22877 2.39 204 2
225 105 27 24482 2.69 204 2
240 105 27 26101 2.63 204 2
255 105 27 27717 2.72 204 2

0 120 26 0 0.08 204 2
15 120 26 1796 0.17 204 2
30 120 26 3593 0.95 204 2
45 120 26 5352 0.77 204 2
60 120 26 7181 1.22 204 2
75 120 26 8971 1.13 204 2
90 120 26 10761 1.55 204 2
105 120 26 12548 1.25 204 2
120 120 26 14332 2.06 204 2
135 120 27 16095 1.49 204 2
150 120 27 17874 2.06 204 2
165 120 27 19655 1.97 204 2
180 120 27 21427 2.06 204 2
195 120 27 23212 2.57 204 2
210 120 27 24984 2.39 204 2
225 120 27 26745 2.57 204 2
240 120 27 28513 2.63 204 2
255 120 27 30276 2.72 204 2

0 135 26 0 0.11 204 2
15 135 26 1911 0.14 204 2
30 135 26 3885 1.10 204 2
45 135 26 5823 0.26 204 2
60 135 26 7758 1.43 204 2
75 135 26 9660 0.62 204 2
90 135 26 11599 1.76 204 2
105 135 27 13546 1.04 204 2
120 135 27 15470 2.12 204 2
135 135 27 17393 1.52 204 2
150 135 27 19311 2.24 204 2
165 135 27 21226 2.00 204 2
180 135 27 23134 2.09 204 2
195 135 27 25045 2.72 204 2
210 135 27 26950 2.42 204 2
225 135 27 28858 2.57 204 2
240 135 27 30761 2.75 204 2
255 135 28 32660 2.78 204 2

0 150 26 0 0.14 204 2
15 150 26 2079 0.77 204 2
30 150 26 4155 0.29 204 2
45 150 26 6227 1.19 204 2
60 150 26 8264 0.65 204 2
75 150 26 10363 1.55 204 2
90 150 27 12427 1.31 204 2
105 150 27 14486 1.43 204 2
120 150 27 16524 2.06 204 2
135 150 27 18581 1.52 204 2
150 150 27 20635 2.18 204 2
165 150 27 22685 2.33 204 2
180 150 27 24727 2.12 204 2
195 150 27 26767 2.30 204 2
210 150 27 28805 2.75 204 2
225 150 28 30842 2.60 204 2
240 150 28 32870 2.72 204 2
255 150 28 34889 2.81 204 2

0 165 26 0 0.14 204 2
15 165 26 2209 0.14 204 2
30 165 26 4413 1.04 204 2
45 165 26 6614 0.23 204 2
60 165 26 8777 1.49 204 2
75 165 27 11007 0.62 204 2
90 165 27 13198 1.79 204 2
105 165 27 15383 1.61 204 2
120 165 27 17564 1.31 204 2
135 165 27 19740 2.33 204 2
150 165 27 21914 1.82 204 2
165 165 27 24087 1.94 204 2
180 165 27 26257 2.15 204 2
195 165 28 28428 2.78 204 2
210 165 28 30586 2.48 204 2
225 165 28 32741 2.66 204 2
240 165 28 34887 2.78 204 2
255 165 28 37025 2.87 204 2

0 180 27 0 0.14 204 2
15 180 26 2331 0.71 204 2
30 180 26 4658 0.83 204 2
45 180 26 6979 0.98 204 2
60 180 27 9298 1.10 204 2
75 180 27 11613 1.52 204 2
90 180 27 13899 0.86 204 2
105 180 27 16213 2.03 204 2
120 180 27 18516 1.43 204 2
135 180 27 20821 1.55 204 2
150 180 27 23110 2.51 204 2
165 180 27 25395 2.09 204 2
180 180 28 27674 2.18 204 2
195 180 28 29973 2.36 204 2
210 180 28 32251 2.84 204 2
225 180 28 34518 2.72 204 2
240 180 28 36779 2.81 204 2
255 180 28 39029 2.90 204 2

0 195 27 0 0.14 204 2
15 195 26 2445 0.68 204 2
30 195 26 4884 0.86 204 2
45 195 27 7322 1.01 204 2
60 195 27 9717 0.35 204 2
75 195 27 12151 1.64 204 2
90 195 27 14582 0.92 204 2
105 195 27 17001 1.91 204 2
120 195 27 19426 2.09 204 2
135 195 27 21834 1.55 204 2
150 195 27 24240 1.79 204 2
165 195 28 26637 2.69 204 2
180 195 28 29031 2.42 204 2
195 195 28 31421 2.39 204 2
210 195 28 33805 2.57 204 2
225 195 28 36181 2.72 204 2
240 195 28 38521 2.84 204 2
255 195 29 40899 2.96 204 2

0 210 27 0 0.14 204 2
15 210 27 2556 0.14 204 2
30 210 27 5107 1.01 204 2
45 210 27 7652 0.38 204 2
60 210 27 10193 1.49 204 2
75 210 27 12729 0.89 204 2
90 210 27 15257 1.43 204 2
105 210 27 17782 2.03 204 2
120 210 27 20296 1.58 204 2
135 210 27 22805 1.55 204 2
150 210 28 25309 2.30 204 2
165 210 28 27803 2.69 204 2
180 210 28 30300 2.30 204 2
195 210 28 32783 2.42 204 2
210 210 28 35311 2.60 204 2
225 210 29 37787 2.75 204 2
240 210 29 40260 2.87 204 2
255 210 29 42718 2.99 204 2

0 225 27 0 0.11 204 2
15 225 27 2632 0.74 204 2
30 225 27 5323 0.77 204 2
45 225 27 7977 1.04 204 2
60 225 27 10624 0.95 204 2
75 225 27 13243 1.70 204 2
90 225 27 15892 0.98 204 2
105 225 27 18528 1.46 204 2
120 225 27 21158 2.27 204 2
135 225 28 23785 2.12 204 2
150 225 28 26409 1.85 204 2
165 225 28 29016 2.03 204 2
180 225 28 31612 2.27 204 2
195 225 28 34143 2.45 204 2
210 225 29 36792 2.63 204 2
225 225 29 39359 2.84 204 2
240 225 29 41923 2.93 204 2
255 225 29 44476 3.02 204 2

0 240 27 0 0.05 204 2
15 240 27 2766 0.41 204 2
30 240 27 5477 1.01 204 2
45 240 27 8283 0.89 204 2
60 240 27 11032 1.40 204 2
75 240 27 13775 1.46 204 2
90 240 27 16508 0.86 204 2
105 240 27 19235 2.09 204 2
120 240 28 21949 2.30 204 2
135 240 28 24663 2.21 204 2
150 240 28 27363 1.85 204 2
165 240 28 30130 2.06 204 2
180 240 28 32820 2.27 204 2
195 240 29 35510 2.48 204 2
210 240 29 38091 2.66 204 2
225 240 29 40853 2.81 204 2
240 240 29 43510 2.93 204 2
255 240 29 46154 3.05 204 2

0 255 27 0 0.02 204 2
15 255 27 2848 0.26 204 2
30 255 27 5736 1.01 204 2
45 255 27 8598 0.38 204 2
60 255 27 11452 1.46 204 2
75 255 27 14296 0.83 204 2
90 255 27 17133 1.61 204 2
105 255 28 19962 2.09 204 2
120 255 28 22779 1.55 204 2
135 255 28 25589 1.64 204 2
150 255 28 28423 1.88 204 2
165 255 28 31254 2.48 204 2
180 255 29 34060 2.84 204 2
195 255 29 36740 3.05 204 2
210 255 29 39615 3.11 204 2
225 255 29 42375 3.11 204 2
240 255 29 45067 3.08 204 2
255 255 30 47857 3.11 204 2

