0 0 26 0 0.23 230 3
15 0 26 4 0.47 230 3
30 0 26 10 0.80 230 3
45 0 26 15 0.14 230 3
60 0 26 21 1.22 230 3
75 0 25 28 0.83 230 3
90 0 25 32 1.19 230 3
105 0 25 39 1.55 230 3
120 0 25 45 1.04 230 3
135 0 25 51 1.94 230 3
150 0 25 56 1.52 230 3
165 0 25 62 1.61 230 3
180 0 25 66 2.27 230 3
195 0 25 73 1.94 230 3
210 0 25 79 2.12 230 3
225 0 25 84 2.27 230 3
240 0 25 91 2.33 230 3
255 0 25 99 2.39 230 3

0 15 25 0 0.23 230 3
15 15 25 1152 0.56 230 3
30 15 25 2305 0.23 230 3
45 15 25 3459 1.13 230 3
60 15 25 4615 0.95 230 3
75 15 25 5764 1.13 230 3
90 15 25 6920 1.64 230 3
105 15 25 8075 1.07 230 3
120 15 25 9229 1.19 230 3
135 15 25 10383 2.09 230 3
150 15 25 11513 1.67 230 3
165 15 25 12665 1.79 230 3
180 15 25 13818 2.21 230 3
195 15 25 14971 2.30 230 3
210 15 25 16125 2.27 230 3
225 15 25 17276 2.42 230 3
240 15 25 18431 2.60 230 3
255 15 25 19592 2.60 230 3

0 30 25 0 0.26 230 3
15 30 25 2134 0.44 230 3
30 30 25 3797 0.89 230 3
45 30 25 5366 0.77 230 3
60 30 25 6936 0.50 230 3
75 30 25 8503 1.43 230 3
90 30 25 10074 1.49 230 3
105 30 25 11635 0.92 230 3
120 30 25 13173 1.70 230 3
135 30 25 14742 2.09 230 3
150 30 25 16315 2.03 230 3
165 30 25 17860 1.79 230 3
180 30 25 19432 2.00 230 3
195 30 25 21012 2.63 230 3
210 30 25 22580 2.33 230 3
225 30 25 24150 2.45 230 3
240 30 25 25720 2.57 230 3
255 30 25 26624 2.66 230 3

0 45 25 0 0.23 230 3
15 45 25 2372 0.08 230 3
30 45 25 3959 0.77 230 3
45 45 25 5528 1.10 230 3
60 45 25 7062 0.68 230 3
75 45 25 8633 0.86 230 3
90 45 25 10198 1.67 230 3
105 45 25 11796 1.55 230 3
120 45 25 13359 1.19 230 3
135 45 25 14930 2.15 230 3
150 45 25 16475 1.88 230 3
165 45 25 18044 1.82 230 3
180 45 25 19608 2.24 230 3
195 45 25 21179 2.42 230 3
210 45 25 22744 2.36 230 3
225 45 25 24312 2.51 230 3
240 45 25 25875 2.72 230 3
255 45 25 26624 2.72 230 3

0 60 25 0 0.17 230 3
15 60 25 2486 0.68 230 3
30 60 25 4071 0.80 230 3
45 60 25 5631 0.74 230 3
60 60 25 7179 0.65 230 3
75 60 25 8746 1.55 230 3
90 60 25 10313 0.68 230 3
105 60 25 11903 1.85 230 3
120 60 25 13469 1.61 230 3
135 60 25 15033 1.40 230 3
150 60 25 16582 2.30 230 3
165 60 25 18151 1.82 230 3
180 60 25 19718 2.03 230 3
195 60 25 21285 2.57 230 3
210 60 25 22854 2.36 230 3
225 60 25 24416 2.51 230 3
240 60 26 25993 2.75 230 3
255 60 26 26624 2.75 230 3

0 75 25 0 0.17 230 3
15 75 25 2564 0.77 230 3
30 75 25 4135 0.23 230 3
45 75 25 5700 1.01 230 3
60 75 25 7255 1.19 230 3
75 75 25 8831 0.50 230 3
90 75 25 10395 1.73 230 3
105 75 25 11966 1.40 230 3
120 75 25 13531 1.16 230 3
135 75 25 15101 2.24 230 3
150 75 25 16647 1.79 230 3
165 75 25 18213 1.85 230 3
180 75 25 19781 2.63 230 3
195 75 26 21350 2.24 230 3
210 75 26 22932 2.42 230 3
225 75 26 24486 2.57 230 3
240 75 26 26051 2.78 230 3
255 75 26 26624 2.78 230 3

0 90 25 0 0.17 230 3
15 90 25 2601 0.71 230 3
30 90 25 4163 0.11 230 3
45 90 25 5732 1.04 230 3
60 90 25 7298 1.28 230 3
75 90 25 8859 0.47 230 3
90 90 25 10430 1.67 230 3
105 90 25 11999 1.79 230 3
120 90 25 13564 1.19 230 3
135 90 25 15108 1.91 230 3
150 90 25 16682 2.33 230 3
165 90 26 18245 1.88 230 3
180 90 26 19831 2.09 230 3
195 90 26 21384 2.54 230 3
210 90 26 22952 2.45 230 3
225 90 26 24521 2.60 230 3
240 90 26 26083 2.75 230 3
255 90 26 26624 2.84 230 3

0 105 25 0 0.26 230 3
15 105 25 2609 0.50 230 3
30 105 25 4178 0.89 230 3
45 105 25 5743 0.17 230 3
60 105 25 7307 1.25 230 3
75 105 25 8874 1.46 230 3
90 105 25 10420 1.07 230 3
105 105 25 11988 1.13 230 3
120 105 25 13571 2.12 230 3
135 105 26 15139 1.82 230 3
150 105 26 16703 1.67 230 3
165 105 26 18262 2.06 230 3
180 105 26 19827 2.72 230 3
195 105 26 21399 2.36 230 3
210 105 26 22966 2.48 230 3
225 105 26 24533 2.66 230 3
240 105 26 26097 2.87 230 3
255 105 26 26624 2.87 230 3

0 120 25 0 0.20 230 3
15 120 25 2617 0.74 230 3
30 120 25 4186 0.59 230 3
45 120 25 5754 0.92 230 3
60 120 25 7317 1.40 230 3
75 120 25 8865 0.86 230 3
90 120 25 10433 1.25 230 3
105 120 26 12011 1.97 230 3
120 120 26 13577 1.49 230 3
135 120 26 15142 1.46 230 3
150 120 26 16699 2.12 230 3
165 120 26 18273 2.54 230 3
180 120 26 19836 2.12 230 3
195 120 26 21408 2.33 230 3
210 120 26 22973 2.51 230 3
225 120 26 24539 2.81 230 3
240 120 26 26108 2.81 230 3
255 120 26 26624 2.90 230 3

0 135 25 0 0.17 230 3
15 135 25 2624 0.77 230 3
30 135 25 4190 0.53 230 3
45 135 25 5757 0.95 230 3
60 135 25 7298 1.37 230 3
75 135 25 8868 0.80 230 3
90 135 26 10446 1.22 230 3
105 135 26 12011 2.03 230 3
120 135 26 13581 1.64 230 3
135 135 26 15140 1.46 230 3
150 135 26 16706 2.00 230 3
165 135 26 18276 2.66 230 3
180 135 26 19841 2.24 230 3
195 135 26 21413 2.36 230 3
210 135 26 22977 2.54 230 3
225 135 26 24545 2.96 230 3
240 135 27 26117 2.93 230 3
255 135 27 26624 2.96 230 3

0 150 25 0 0.23 230 3
15 150 25 2631 0.47 230 3
30 150 25 4196 0.98 230 3
45 150 25 5759 0.83 230 3
60 150 26 7320 0.47 230 3
75 150 26 8890 1.46 230 3
90 150 26 10451 1.82 230 3
105 150 26 12005 1.46 230 3
120 150 26 13578 1.25 230 3
135 150 26 15147 1.64 230 3
150 150 26 16707 1.73 230 3
165 150 26 18281 2.45 230 3
180 150 26 19848 2.84 230 3
195 150 26 21405 2.66 230 3
210 150 27 22981 2.57 230 3
225 150 27 24551 2.72 230 3
240 150 27 26118 2.87 230 3
255 150 27 26624 2.99 230 3

0 165 26 0 0.26 230 3
15 165 25 2632 0.71 230 3
30 165 25 4197 0.35 230 3
45 165 26 5763 0.86 230 3
60 165 26 7307 1.46 230 3
75 165 26 8885 1.37 230 3
90 165 26 10451 0.77 230 3
105 165 26 12017 1.22 230 3
120 165 26 13577 2.09 230 3
135 165 26 15141 2.42 230 3
150 165 26 16708 2.36 230 3
165 165 26 18284 2.00 230 3
180 165 26 19851 2.21 230 3
195 165 27 21402 2.42 230 3
210 165 27 22988 2.60 230 3
225 165 27 24556 2.75 230 3
240 165 27 26128 2.90 230 3
255 165 27 26624 3.02 230 3

0 180 26 0 0.20 230 3
15 180 26 2638 0.62 230 3
30 180 26 4198 0.56 230 3
45 180 26 5764 0.53 230 3
60 180 26 7327 1.40 230 3
75 180 26 8889 1.61 230 3
90 180 26 10448 1.25 230 3
105 180 26 12013 1.01 230 3
120 180 26 13580 1.31 230 3
135 180 26 15142 2.03 230 3
150 180 26 16718 2.42 230 3
165 180 27 18261 2.75 230 3
180 180 27 19856 2.87 230 3
195 180 27 21422 2.90 230 3
210 180 27 22988 2.96 230 3
225 180 27 24556 3.08 230 3
240 180 27 26129 3.05 230 3
255 180 27 26624 3.05 230 3

0 195 26 0 0.17 230 3
15 195 26 2638 0.08 230 3
30 195 26 4180 0.86 230 3
45 195 26 5753 1.19 230 3
60 195 26 7325 0.98 230 3
75 195 26 8882 0.56 230 3
90 195 26 10450 1.58 230 3
105 195 26 12020 2.03 230 3
120 195 26 13574 2.24 230 3
135 195 26 15152 2.33 230 3
150 195 27 16721 2.30 230 3
165 195 27 18261 2.33 230 3
180 195 27 19861 2.33 230 3
195 195 27 21425 2.48 230 3
210 195 27 22992 3.08 230 3
225 195 27 24565 3.08 230 3
240 195 27 26126 3.05 230 3
255 195 28 26624 3.08 230 3

0 210 26 0 0.17 230 3
15 210 26 2641 0.44 230 3
30 210 26 4177 0.50 230 3
45 210 26 5764 1.19 230 3
60 210 26 7325 1.31 230 3
75 210 26 8888 0.92 230 3
90 210 26 10453 0.80 230 3
105 210 26 12015 1.34 230 3
120 210 26 13575 1.91 230 3
135 210 27 15161 2.36 230 3
150 210 27 16723 2.66 230 3
165 210 27 18292 2.81 230 3
180 210 27 19862 2.93 230 3
195 210 27 21382 2.99 230 3
210 210 27 22996 3.08 230 3
225 210 28 24561 3.11 230 3
240 210 28 26136 3.05 230 3
255 210 28 26624 3.11 230 3

0 225 26 0 0.23 230 3
15 225 26 2639 0.65 230 3
30 225 26 4200 0.32 230 3
45 225 26 5761 1.16 230 3
60 225 26 7320 1.40 230 3
75 225 26 8890 1.13 230 3
90 225 26 10448 1.31 230 3
105 225 26 12019 1.04 230 3
120 225 27 13590 1.31 230 3
135 225 27 15129 1.55 230 3
150 225 27 16722 1.82 230 3
165 225 27 18256 2.09 230 3
180 225 27 19859 2.30 230 3
195 225 27 21379 2.51 230 3
210 225 28 23000 2.69 230 3
225 225 28 24559 2.87 230 3
240 225 28 26136 3.02 230 3
255 225 28 26624 3.14 230 3

0 240 26 0 0.23 230 3
15 240 26 2643 0.05 230 3
30 240 26 4200 0.95 230 3
45 240 26 5743 0.92 230 3
60 240 26 7316 0.47 230 3
75 240 26 8875 1.55 230 3
90 240 26 10449 1.91 230 3
105 240 27 12022 1.88 230 3
120 240 27 13587 1.40 230 3
135 240 27 15129 1.58 230 3
150 240 27 16727 1.82 230 3
165 240 27 18248 2.09 230 3
180 240 27 19865 2.33 230 3
195 240 28 21382 2.54 230 3
210 240 28 22999 2.72 230 3
225 240 28 24567 2.90 230 3
240 240 28 26131 3.05 230 3
255 240 28 26624 3.17 230 3

0 255 26 0 0.23 230 3
15 255 26 2641 0.38 230 3
30 255 26 4204 0.98 230 3
45 255 26 5760 0.23 230 3
60 255 26 7322 1.22 230 3
75 255 26 8883 1.70 230 3
90 255 26 10445 1.73 230 3
105 255 27 12006 1.28 230 3
120 255 27 13593 1.34 230 3
135 255 27 15125 1.58 230 3
150 255 27 16727 1.85 230 3
165 255 27 18247 2.09 230 3
180 255 28 19866 2.33 230 3
195 255 28 21436 2.54 230 3
210 255 28 22994 2.75 230 3
225 255 28 24570 2.93 230 3
240 255 28 26137 3.20 230 3
255 255 29 26624 3.20 230 3

