0 0 27 33214 0.11 48 3
15 0 26 19 0.17 48 3
30 0 26 41 0.38 48 3
45 0 26 64 0.71 48 3
60 0 26 80 1.04 48 3
75 0 26 108 1.28 48 3
90 0 26 129 1.46 48 3
105 0 26 152 1.55 48 3
120 0 26 171 1.58 48 3
135 0 26 194 1.55 48 3
150 0 26 221 1.49 48 3
165 0 26 233 1.79 48 3
180 0 26 260 1.73 48 3
195 0 26 288 1.76 48 3
210 0 26 308 1.88 48 3
225 0 26 323 1.97 48 3
240 0 26 348 2.03 48 3
255 0 26 378 2.09 48 3

0 15 26 0 0.02 48 3
15 15 26 3262 0.59 48 3
30 15 26 10187 0.68 48 3
45 15 26 16461 0.65 48 3
60 15 26 21970 0.62 48 3
75 15 26 25520 0.53 48 3
90 15 26 32465 0.77 48 3
105 15 26 38688 0.92 48 3
120 15 26 44183 1.10 48 3
135 15 26 47385 1.34 48 3
150 15 26 54350 1.49 48 3
165 15 26 60791 1.64 48 3
180 15 26 65535 1.82 48 3
195 15 26 65535 1.97 48 3
210 15 26 65535 2.09 48 3
225 15 26 65535 2.18 48 3
240 15 26 65535 2.27 48 3
255 15 26 65535 2.33 48 3

0 30 25 13748 0.02 48 3
15 30 25 9850 0.68 48 3
30 30 25 19632 0.80 48 3
45 30 25 25846 0.80 48 3
60 30 25 38208 1.22 48 3
75 30 25 49289 1.37 48 3
90 30 25 59152 1.46 48 3
105 30 25 65289 1.19 48 3
120 30 25 65535 1.25 48 3
135 30 25 65535 1.40 48 3
150 30 26 65535 1.52 48 3
165 30 26 65535 1.70 48 3
180 30 26 65535 1.85 48 3
195 30 26 65535 2.03 48 3
210 30 26 65535 2.15 48 3
225 30 26 65535 2.24 48 3
240 30 26 65535 2.36 48 3
255 30 26 65535 2.42 48 3

0 45 25 1 0.08 48 3
15 45 25 9208 0.74 48 3
30 45 25 26351 0.80 48 3
45 45 25 40807 0.89 48 3
60 45 25 54224 0.89 48 3
75 45 25 63285 0.86 48 3
90 45 25 65535 0.89 48 3
105 45 25 65535 0.98 48 3
120 45 25 65535 1.19 48 3
135 45 26 65535 1.37 48 3
150 45 26 65535 1.55 48 3
165 45 26 65535 1.73 48 3
180 45 26 65535 1.91 48 3
195 45 26 65535 2.09 48 3
210 45 26 65535 2.21 48 3
225 45 26 65535 2.39 48 3
240 45 26 65535 2.48 48 3
255 45 26 65535 2.48 48 3

0 60 25 1734 0.08 48 3
15 60 25 16841 0.14 48 3
30 60 25 30227 0.14 48 3
45 60 25 39629 0.23 48 3
60 60 25 55196 0.41 48 3
75 60 25 65535 0.56 48 3
90 60 25 65535 0.77 48 3
105 60 26 65535 0.95 48 3
120 60 26 65535 1.19 48 3
135 60 26 65535 1.43 48 3
150 60 26 65535 1.61 48 3
165 60 26 65535 1.76 48 3
180 60 26 65535 1.97 48 3
195 60 26 65535 2.12 48 3
210 60 26 65535 2.27 48 3
225 60 26 65535 2.54 48 3
240 60 26 65535 2.54 48 3
255 60 26 65535 2.54 48 3

0 75 25 0 0.08 48 3
15 75 25 14679 0.26 48 3
30 75 25 30762 0.41 48 3
45 75 25 43301 0.53 48 3
60 75 25 50542 0.89 48 3
75 75 26 65535 1.28 48 3
90 75 26 65535 1.52 48 3
105 75 26 65535 1.82 48 3
120 75 26 65535 1.94 48 3
135 75 26 65535 1.82 48 3
150 75 26 65535 1.64 48 3
165 75 26 65535 1.82 48 3
180 75 26 65535 2.00 48 3
195 75 26 65535 2.15 48 3
210 75 26 65535 2.30 48 3
225 75 26 65535 2.42 48 3
240 75 26 65535 2.60 48 3
255 75 26 65535 2.60 48 3

0 90 26 0 0.02 48 3
15 90 25 18497 0.50 48 3
30 90 26 26547 0.71 48 3
45 90 26 42362 0.89 48 3
60 90 26 56238 1.22 48 3
75 90 26 65535 1.55 48 3
90 90 26 65535 1.73 48 3
105 90 26 65535 1.82 48 3
120 90 26 65535 1.61 48 3
135 90 26 65535 1.49 48 3
150 90 26 65535 1.67 48 3
165 90 26 65535 1.88 48 3
180 90 26 65535 2.42 48 3
195 90 26 65535 2.45 48 3
210 90 26 65535 2.33 48 3
225 90 26 65535 2.48 48 3
240 90 26 65535 2.57 48 3
255 90 26 65535 2.66 48 3

0 105 26 65535 0.11 48 3
15 105 26 17799 0.59 48 3
30 105 26 31539 0.83 48 3
45 105 26 44079 1.13 48 3
60 105 26 52704 1.40 48 3
75 105 26 65535 1.55 48 3
90 105 26 65535 1.58 48 3
105 105 26 65535 1.16 48 3
120 105 26 65535 1.28 48 3
135 105 26 65535 1.67 48 3
150 105 26 65535 2.30 48 3
165 105 26 65535 2.06 48 3
180 105 26 65535 2.06 48 3
195 105 26 65535 2.24 48 3
210 105 26 65535 2.72 48 3
225 105 27 65535 2.51 48 3
240 105 27 65535 2.63 48 3
255 105 27 65535 2.72 48 3

0 120 26 0 0.02 48 3
15 120 26 19087 0.59 48 3
30 120 26 28855 0.77 48 3
45 120 26 44374 0.74 48 3
60 120 26 56895 0.53 48 3
75 120 26 65535 0.56 48 3
90 120 26 65535 1.04 48 3
105 120 26 65535 1.58 48 3
120 120 26 65535 2.03 48 3
135 120 26 65535 2.21 48 3
150 120 26 65535 1.76 48 3
165 120 26 65535 1.88 48 3
180 120 26 65535 2.42 48 3
195 120 27 65535 2.45 48 3
210 120 27 65535 2.39 48 3
225 120 27 65535 2.54 48 3
240 120 27 65535 2.72 48 3
255 120 27 65535 2.72 48 3

0 135 26 38592 -0.01 48 3
15 135 26 19471 0.62 48 3
30 135 26 32134 0.74 48 3
45 135 26 39299 0.98 48 3
60 135 26 55223 1.34 48 3
75 135 26 65535 1.64 48 3
90 135 26 65535 1.73 48 3
105 135 26 65535 1.37 48 3
120 135 26 65535 1.25 48 3
135 135 26 65535 1.67 48 3
150 135 26 65535 2.39 48 3
165 135 27 65535 2.03 48 3
180 135 27 65535 2.09 48 3
195 135 27 65535 2.60 48 3
210 135 27 65535 2.42 48 3
225 135 27 65535 2.57 48 3
240 135 27 65535 2.78 48 3
255 135 27 65535 2.78 48 3

0 150 26 0 0.02 48 3
15 150 26 12592 0.83 48 3
30 150 26 31000 1.01 48 3
45 150 26 44865 0.59 48 3
60 150 26 57362 0.50 48 3
75 150 26 65535 1.37 48 3
90 150 26 65535 1.82 48 3
105 150 26 65535 1.37 48 3
120 150 26 65535 1.31 48 3
135 150 26 65535 2.27 48 3
150 150 27 65535 1.79 48 3
165 150 27 65535 1.94 48 3
180 150 27 65535 2.60 48 3
195 150 27 65535 2.30 48 3
210 150 27 65535 2.87 48 3
225 150 27 65535 2.60 48 3
240 150 27 65535 2.84 48 3
255 150 28 65535 2.81 48 3

0 165 26 8955 0.11 48 3
15 165 26 19794 0.71 48 3
30 165 26 32463 1.04 48 3
45 165 26 41525 0.92 48 3
60 165 26 57154 0.35 48 3
75 165 26 65535 1.25 48 3
90 165 26 65535 1.85 48 3
105 165 26 65535 1.67 48 3
120 165 26 65535 1.25 48 3
135 165 27 65535 2.21 48 3
150 165 27 65535 2.03 48 3
165 165 27 65535 1.97 48 3
180 165 27 65535 2.57 48 3
195 165 27 65535 2.33 48 3
210 165 27 65535 2.69 48 3
225 165 27 65535 2.66 48 3
240 165 28 65535 2.78 48 3
255 165 28 65535 2.87 48 3

0 180 26 0 0.02 48 3
15 180 26 15758 0.17 48 3
30 180 26 32672 0.38 48 3
45 180 26 45187 0.98 48 3
60 180 26 57698 1.37 48 3
75 180 26 65535 1.67 48 3
90 180 26 65535 1.22 48 3
105 180 26 65535 1.13 48 3
120 180 27 65535 2.18 48 3
135 180 27 65535 1.55 48 3
150 180 27 65535 2.15 48 3
165 180 27 65535 1.97 48 3
180 180 27 65535 2.39 48 3
195 180 27 65535 2.36 48 3
210 180 28 65535 2.93 48 3
225 180 28 65535 2.69 48 3
240 180 28 65535 2.81 48 3
255 180 28 65535 2.90 48 3

0 195 26 1 0.11 48 3
15 195 26 20264 0.14 48 3
30 195 26 27854 0.53 48 3
45 195 26 43563 0.98 48 3
60 195 26 57789 1.49 48 3
75 195 26 65535 1.67 48 3
90 195 26 65535 1.07 48 3
105 195 27 65535 1.94 48 3
120 195 27 65535 1.67 48 3
135 195 27 65535 1.79 48 3
150 195 27 65535 2.21 48 3
165 195 27 65535 2.03 48 3
180 195 27 65535 2.21 48 3
195 195 28 65535 2.72 48 3
210 195 28 65535 2.57 48 3
225 195 28 65535 2.72 48 3
240 195 28 65535 2.96 48 3
255 195 28 65535 2.96 48 3

0 210 26 65535 0.11 48 3
15 210 26 18630 0.14 48 3
30 210 26 32882 0.50 48 3
45 210 26 45279 1.07 48 3
60 210 26 53902 1.52 48 3
75 210 26 65535 1.31 48 3
90 210 27 65535 0.83 48 3
105 210 27 65535 2.03 48 3
120 210 27 65535 1.34 48 3
135 210 27 65535 2.30 48 3
150 210 27 65535 1.79 48 3
165 210 27 65535 2.72 48 3
180 210 28 65535 2.27 48 3
195 210 28 65535 2.42 48 3
210 210 28 65535 2.60 48 3
225 210 28 65535 2.99 48 3
240 210 28 65535 2.87 48 3
255 210 29 65535 2.99 48 3

0 225 26 0 0.11 48 3
15 225 26 20313 0.11 48 3
30 225 26 29679 0.47 48 3
45 225 26 45369 1.13 48 3
60 225 26 57848 1.52 48 3
75 225 27 65535 1.01 48 3
90 225 27 65535 1.31 48 3
105 225 27 65535 2.06 48 3
120 225 27 65535 1.34 48 3
135 225 27 65535 2.42 48 3
150 225 27 65535 1.82 48 3
165 225 28 65535 2.06 48 3
180 225 28 65535 2.87 48 3
195 225 28 65535 2.48 48 3
210 225 28 65535 2.63 48 3
225 225 29 65535 2.78 48 3
240 225 29 65535 2.90 48 3
255 225 29 65535 3.02 48 3

0 240 26 44562 -0.01 48 3
15 240 26 20526 0.74 48 3
30 240 26 33022 0.53 48 3
45 240 26 45395 0.35 48 3
60 240 27 55689 1.37 48 3
75 240 27 65535 1.64 48 3
90 240 27 65535 0.89 48 3
105 240 27 65535 2.09 48 3
120 240 27 65535 1.55 48 3
135 240 27 65535 2.12 48 3
150 240 28 65535 2.63 48 3
165 240 28 65535 2.06 48 3
180 240 28 65535 2.27 48 3
195 240 28 65535 2.48 48 3
210 240 29 65535 2.66 48 3
225 240 29 65535 2.81 48 3
240 240 29 65535 2.93 48 3
255 240 29 65535 3.05 48 3

0 255 26 0 0.05 48 3
15 255 26 12725 0.56 48 3
30 255 26 31496 0.86 48 3
45 255 26 45445 1.28 48 3
60 255 27 57995 1.31 48 3
75 255 27 65535 0.77 48 3
90 255 27 65535 1.94 48 3
105 255 27 65535 1.07 48 3
120 255 27 65535 2.30 48 3
135 255 28 65535 1.79 48 3
150 255 28 65535 1.94 48 3
165 255 28 65535 2.63 48 3
180 255 28 65535 2.93 48 3
195 255 29 65535 2.93 48 3
210 255 29 65535 2.96 48 3
225 255 29 65535 3.11 48 3
240 255 29 65535 3.11 48 3
255 255 30 65535 3.08 48 3

