0 0 30 0 -0.19 210 2
15 0 30 4 -0.16 210 2
30 0 29 8 0.20 210 2
45 0 29 11 0.20 210 2
60 0 29 15 0.08 210 2
75 0 29 19 0.50 210 2
90 0 29 23 0.14 210 2
105 0 29 27 0.56 210 2
120 0 29 31 0.56 210 2
135 0 29 34 0.44 210 2
150 0 29 38 0.89 210 2
165 0 29 42 0.65 210 2
180 0 29 46 0.92 210 2
195 0 29 50 0.86 210 2
210 0 29 54 0.95 210 2
225 0 29 57 1.01 210 2
240 0 29 61 1.07 210 2
255 0 29 64 1.10 210 2

0 15 29 0 -0.28 210 2
15 15 29 2804 0.11 210 2
30 15 29 5609 0.14 210 2
45 15 29 8426 0.11 210 2
60 15 29 11351 0.41 210 2
75 15 29 14042 0.26 210 2
90 15 29 16999 0.56 210 2
105 15 29 19651 0.44 210 2
120 15 29 22691 0.86 210 2
135 15 29 25130 0.50 210 2
150 15 29 28195 1.04 210 2
165 15 29 30755 0.74 210 2
180 15 29 33701 1.16 210 2
195 15 29 36214 0.95 210 2
210 15 29 39205 1.22 210 2
225 15 29 41854 1.13 210 2
240 15 29 44704 1.28 210 2
255 15 29 47104 1.25 210 2

0 30 29 0 -0.28 210 2
15 30 29 4531 -0.10 210 2
30 30 29 7315 0.20 210 2
45 30 29 10322 0.02 210 2
60 30 29 12828 0.41 210 2
75 30 29 15864 0.17 210 2
90 30 29 18335 0.56 210 2
105 30 29 21422 0.50 210 2
120 30 29 23836 0.65 210 2
135 30 29 26921 0.62 210 2
150 30 29 29370 0.77 210 2
165 30 29 32420 0.80 210 2
180 30 29 34878 0.86 210 2
195 30 29 37919 0.98 210 2
210 30 29 40561 1.07 210 2
225 30 29 43418 1.16 210 2
240 30 29 46142 1.25 210 2
255 30 29 47104 1.28 210 2

0 45 29 0 -0.28 210 2
15 45 29 4721 -0.13 210 2
30 45 29 7672 0.20 210 2
45 45 29 10232 -0.01 210 2
60 45 29 13316 0.44 210 2
75 45 29 15744 0.11 210 2
90 45 29 18795 0.68 210 2
105 45 29 21246 0.29 210 2
120 45 29 24334 0.80 210 2
135 45 29 26832 0.53 210 2
150 45 29 29831 0.83 210 2
165 45 29 32369 0.74 210 2
180 45 29 35329 0.92 210 2
195 45 29 38067 0.98 210 2
210 45 29 40825 1.10 210 2
225 45 29 43572 1.19 210 2
240 45 29 46315 1.25 210 2
255 45 29 47104 1.31 210 2

0 60 29 0 -0.28 210 2
15 60 29 4770 0.11 210 2
30 60 29 7527 0.08 210 2
45 60 29 10373 0.35 210 2
60 60 29 13134 0.20 210 2
75 60 29 15816 0.56 210 2
90 60 29 18676 0.29 210 2
105 60 29 21439 0.77 210 2
120 60 29 24345 0.44 210 2
135 60 29 26909 0.98 210 2
150 60 29 29866 0.65 210 2
165 60 29 32497 1.16 210 2
180 60 29 35375 0.89 210 2
195 60 29 37919 1.13 210 2
210 60 29 40873 1.10 210 2
225 60 29 43525 1.31 210 2
240 60 29 46357 1.28 210 2
255 60 29 47104 1.31 210 2

0 75 29 0 -0.25 210 2
15 75 29 4920 0.11 210 2
30 75 29 7554 -0.13 210 2
45 75 29 10487 0.35 210 2
60 75 29 13066 0.14 210 2
75 75 29 16074 0.56 210 2
90 75 29 18632 0.23 210 2
105 75 29 21528 0.77 210 2
120 75 29 24149 0.41 210 2
135 75 29 27157 0.98 210 2
150 75 29 29820 0.68 210 2
165 75 29 32619 0.92 210 2
180 75 29 35314 0.92 210 2
195 75 29 38144 1.16 210 2
210 75 29 40896 1.13 210 2
225 75 29 43637 1.28 210 2
240 75 29 46381 1.28 210 2
255 75 29 47104 1.34 210 2

0 90 29 0 -0.25 210 2
15 90 29 4811 0.11 210 2
30 90 29 7566 0.11 210 2
45 90 29 10404 0.29 210 2
60 90 29 13087 -0.01 210 2
75 90 29 16118 0.56 210 2
90 90 29 18588 0.17 210 2
105 90 29 21646 0.77 210 2
120 90 29 24119 0.44 210 2
135 90 29 27167 0.86 210 2
150 90 29 29587 0.65 210 2
165 90 29 32664 0.89 210 2
180 90 29 35160 1.10 210 2
195 90 29 38162 0.98 210 2
210 90 29 40756 1.34 210 2
225 90 29 43657 1.19 210 2
240 90 29 46370 1.34 210 2
255 90 29 47104 1.34 210 2

0 105 29 0 -0.25 210 2
15 105 29 4826 0.05 210 2
30 105 29 7633 0.17 210 2
45 105 29 10341 0.32 210 2
60 105 29 13104 0.20 210 2
75 105 29 15966 0.56 210 2
90 105 29 18696 0.29 210 2
105 105 29 21474 0.80 210 2
120 105 29 24155 0.41 210 2
135 105 29 27152 1.01 210 2
150 105 29 29786 0.65 210 2
165 105 29 32656 1.19 210 2
180 105 29 35245 0.89 210 2
195 105 29 38171 1.01 210 2
210 105 29 40836 1.13 210 2
225 105 29 43663 1.22 210 2
240 105 29 46387 1.28 210 2
255 105 29 47104 1.34 210 2

0 120 29 0 -0.25 210 2
15 120 29 4836 0.20 210 2
30 120 29 7799 0.08 210 2
45 120 29 10349 0.35 210 2
60 120 29 13374 0.41 210 2
75 120 29 15867 0.23 210 2
90 120 29 18947 0.68 210 2
105 120 29 21368 0.29 210 2
120 120 29 24443 0.80 210 2
135 120 29 26868 0.71 210 2
150 120 29 29938 0.65 210 2
165 120 29 32399 1.07 210 2
180 120 29 35434 0.89 210 2
195 120 29 37952 1.28 210 2
210 120 29 40937 1.13 210 2
225 120 29 43587 1.31 210 2
240 120 29 46409 1.31 210 2
255 120 29 47104 1.34 210 2

0 135 29 0 -0.19 210 2
15 135 29 4878 -0.01 210 2
30 135 29 7606 0.23 210 2
45 135 29 10503 -0.13 210 2
60 135 29 13107 0.50 210 2
75 135 29 15952 0.14 210 2
90 135 29 18688 0.65 210 2
105 135 29 21569 0.50 210 2
120 135 29 24215 0.68 210 2
135 135 29 26999 0.53 210 2
150 135 29 29919 0.98 210 2
165 135 29 32572 0.80 210 2
180 135 29 35431 0.92 210 2
195 135 29 37971 1.19 210 2
210 135 29 40931 1.13 210 2
225 135 29 43576 1.37 210 2
240 135 29 46413 1.31 210 2
255 135 29 47104 1.37 210 2

0 150 29 0 -0.16 210 2
15 150 29 4959 0.08 210 2
30 150 29 7605 0.17 210 2
45 150 29 10449 0.26 210 2
60 150 29 13125 0.41 210 2
75 150 29 16006 0.35 210 2
90 150 29 18664 0.65 210 2
105 150 29 21415 0.38 210 2
120 150 29 24390 0.86 210 2
135 150 29 26984 0.53 210 2
150 150 29 29953 1.10 210 2
165 150 29 32409 0.80 210 2
180 150 29 35439 1.22 210 2
195 150 29 37995 1.04 210 2
210 150 29 40930 1.28 210 2
225 150 29 43593 1.25 210 2
240 150 29 46420 1.31 210 2
255 150 29 47104 1.37 210 2

0 165 29 0 -0.16 210 2
15 165 29 4973 -0.13 210 2
30 165 29 7614 0.23 210 2
45 165 29 10463 0.05 210 2
60 165 29 13122 0.47 210 2
75 165 29 16066 0.29 210 2
90 165 29 18757 0.65 210 2
105 165 29 21499 0.47 210 2
120 165 29 24300 0.74 210 2
135 165 29 27090 0.62 210 2
150 165 29 29957 0.83 210 2
165 165 29 32515 0.83 210 2
180 165 29 35452 0.92 210 2
195 165 29 38095 1.07 210 2
210 165 29 40933 1.13 210 2
225 165 29 43598 1.34 210 2
240 165 30 46426 1.31 210 2
255 165 30 47104 1.37 210 2

0 180 29 0 -0.16 210 2
15 180 29 4972 0.11 210 2
30 180 29 7625 -0.16 210 2
45 180 29 10573 0.35 210 2
60 180 29 13134 0.02 210 2
75 180 29 16011 0.59 210 2
90 180 29 18654 0.20 210 2
105 180 29 21602 0.77 210 2
120 180 29 24219 0.44 210 2
135 180 29 27005 0.92 210 2
150 180 29 29962 0.68 210 2
165 180 29 32547 0.83 210 2
180 180 29 35458 0.92 210 2
195 180 29 37962 1.13 210 2
210 180 29 40946 1.16 210 2
225 180 30 43602 1.25 210 2
240 180 30 46428 1.31 210 2
255 180 30 47104 1.37 210 2

0 195 29 0 -0.16 210 2
15 195 29 4873 -0.16 210 2
30 195 29 7633 0.26 210 2
45 195 29 10380 -0.04 210 2
60 195 29 13259 0.50 210 2
75 195 29 15888 0.23 210 2
90 195 29 18814 0.68 210 2
105 195 29 21384 0.47 210 2
120 195 29 24473 0.80 210 2
135 195 29 26903 0.59 210 2
150 195 29 29963 0.92 210 2
165 195 29 32382 0.83 210 2
180 195 29 35456 0.98 210 2
195 195 30 37972 1.04 210 2
210 195 30 40956 1.16 210 2
225 195 30 43691 1.25 210 2
240 195 30 46425 1.31 210 2
255 195 30 47104 1.37 210 2

0 210 29 0 -0.16 210 2
15 210 29 4874 0.08 210 2
30 210 29 7833 0.17 210 2
45 210 29 10393 0.26 210 2
60 210 29 13437 0.02 210 2
75 210 29 15896 0.53 210 2
90 210 29 18907 0.20 210 2
105 210 29 21399 0.77 210 2
120 210 29 24450 0.47 210 2
135 210 29 26975 0.92 210 2
150 210 29 29835 0.71 210 2
165 210 29 32709 0.98 210 2
180 210 30 35372 0.95 210 2
195 210 30 38198 1.07 210 2
210 210 30 40790 1.16 210 2
225 210 30 43691 1.25 210 2
240 210 30 46407 1.34 210 2
255 210 30 47104 1.37 210 2

0 225 30 0 -0.19 210 2
15 225 29 4876 -0.16 210 2
30 225 29 7686 0.32 210 2
45 225 29 10399 -0.10 210 2
60 225 29 13256 0.56 210 2
75 225 29 16030 0.02 210 2
90 225 29 18680 0.77 210 2
105 225 29 21591 0.29 210 2
120 225 29 24274 0.98 210 2
135 225 29 27222 0.53 210 2
150 225 29 29709 1.16 210 2
165 225 30 32717 0.77 210 2
180 225 30 35293 1.31 210 2
195 225 30 38201 1.04 210 2
210 225 30 40795 1.40 210 2
225 225 30 43702 1.25 210 2
240 225 30 46415 1.34 210 2
255 225 30 47104 1.40 210 2

0 240 30 0 -0.19 210 2
15 240 29 4876 -0.19 210 2
30 240 29 7734 0.29 210 2
45 240 29 10406 0.05 210 2
60 240 29 13182 0.53 210 2
75 240 29 15943 0.32 210 2
90 240 29 18805 0.71 210 2
105 240 29 21611 0.50 210 2
120 240 29 24260 0.74 210 2
135 240 29 27127 0.68 210 2
150 240 30 29900 0.89 210 2
165 240 30 32716 0.83 210 2
180 240 30 35362 0.95 210 2
195 240 30 38205 1.07 210 2
210 240 30 40911 1.16 210 2
225 240 30 43697 1.31 210 2
240 240 30 46414 1.34 210 2
255 240 31 47104 1.40 210 2

0 255 30 0 -0.22 210 2
15 255 29 4875 0.05 210 2
30 255 29 7692 0.20 210 2
45 255 29 10408 0.26 210 2
60 255 29 13231 0.47 210 2
75 255 29 15902 0.35 210 2
90 255 29 18646 0.71 210 2
105 255 29 21646 0.32 210 2
120 255 29 24186 0.71 210 2
135 255 30 27227 0.62 210 2
150 255 30 29641 1.01 210 2
165 255 30 32728 0.80 210 2
180 255 30 35208 1.25 210 2
195 255 30 38210 1.04 210 2
210 255 30 40964 1.40 210 2
225 255 30 43694 1.25 210 2
240 255 31 46440 1.34 210 2
255 255 31 47104 1.40 210 2

