0 0 27 0 0.11 204 0
15 0 27 0 0.17 204 0
30 0 27 0 0.92 204 0
45 0 27 0 0.56 204 0
60 0 26 0 1.01 204 0
75 0 26 0 1.19 204 0
90 0 26 0 0.71 204 0
105 0 26 1 1.55 204 0
120 0 26 1 1.25 204 0
135 0 26 1 1.22 204 0
150 0 26 1 1.88 204 0
165 0 26 1 1.52 204 0
180 0 26 1 1.64 204 0
195 0 26 1 1.94 204 0
210 0 26 1 1.88 204 0
225 0 26 1 1.97 204 0
240 0 26 1 2.09 204 0
255 0 26 2 2.09 204 0

0 15 26 0 0.02 204 0
15 15 26 23 0.41 204 0
30 15 26 45 0.74 204 0
45 15 26 68 1.07 204 0
60 15 26 90 0.50 204 0
75 15 26 114 1.25 204 0
90 15 26 137 1.37 204 0
105 15 26 159 0.95 204 0
120 15 26 182 1.49 204 0
135 15 26 205 1.94 204 0
150 15 26 228 1.52 204 0
165 15 26 250 1.64 204 0
180 15 26 273 2.06 204 0
195 15 26 295 2.09 204 0
210 15 26 319 2.09 204 0
225 15 26 341 2.18 204 0
240 15 26 364 2.33 204 0
255 15 26 386 2.33 204 0

0 30 26 0 0.02 204 0
15 30 26 40 0.80 204 0
30 30 26 81 0.62 204 0
45 30 26 122 0.41 204 0
60 30 26 162 1.25 204 0
75 30 26 203 1.31 204 0
90 30 26 242 0.71 204 0
105 30 26 284 1.46 204 0
120 30 26 324 1.88 204 0
135 30 26 365 1.61 204 0
150 30 26 404 1.55 204 0
165 30 26 445 1.85 204 0
180 30 26 486 2.27 204 0
195 30 26 526 2.03 204 0
210 30 26 566 2.15 204 0
225 30 26 607 2.36 204 0
240 30 26 647 2.36 204 0
255 30 26 688 2.42 204 0

0 45 26 0 0.14 204 0
15 45 26 56 0.11 204 0
30 45 26 112 0.80 204 0
45 45 26 168 1.16 204 0
60 45 26 222 0.98 204 0
75 45 26 279 0.68 204 0
90 45 26 335 1.58 204 0
105 45 26 391 1.64 204 0
120 45 26 447 1.19 204 0
135 45 26 502 1.37 204 0
150 45 26 557 2.12 204 0
165 45 26 614 1.88 204 0
180 45 26 669 1.91 204 0
195 45 26 725 2.09 204 0
210 45 26 780 2.45 204 0
225 45 26 836 2.33 204 0
240 45 26 892 2.42 204 0
255 45 26 947 2.48 204 0

0 60 26 0 0.11 204 0
15 60 26 69 0.14 204 0
30 60 26 139 0.92 204 0
45 60 26 206 1.04 204 0
60 60 26 277 0.35 204 0
75 60 26 346 1.28 204 0
90 60 26 415 1.70 204 0
105 60 26 483 1.28 204 0
120 60 26 552 1.19 204 0
135 60 26 622 1.85 204 0
150 60 26 692 2.18 204 0
165 60 26 759 1.79 204 0
180 60 26 828 1.97 204 0
195 60 26 897 2.18 204 0
210 60 26 966 2.51 204 0
225 60 26 1036 2.54 204 0
240 60 26 1103 2.48 204 0
255 60 26 1172 2.54 204 0

0 75 26 0 0.02 204 0
15 75 26 81 0.53 204 0
30 75 26 163 0.38 204 0
45 75 26 244 1.10 204 0
60 75 26 324 1.31 204 0
75 75 26 407 0.83 204 0
90 75 26 488 0.92 204 0
105 75 26 570 1.82 204 0
120 75 26 649 1.91 204 0
135 75 26 731 1.40 204 0
150 75 26 813 1.64 204 0
165 75 26 894 1.94 204 0
180 75 26 975 2.48 204 0
195 75 26 1055 2.54 204 0
210 75 26 1135 2.33 204 0
225 75 27 1216 2.42 204 0
240 75 27 1297 2.51 204 0
255 75 27 1377 2.60 204 0

0 90 26 0 0.11 204 0
15 90 26 91 0.35 204 0
30 90 26 183 1.01 204 0
45 90 26 278 1.10 204 0
60 90 26 370 0.71 204 0
75 90 26 463 0.80 204 0
90 90 26 553 1.61 204 0
105 90 26 646 1.85 204 0
120 90 26 739 1.61 204 0
135 90 26 831 1.46 204 0
150 90 26 923 1.67 204 0
165 90 26 1015 2.06 204 0
180 90 27 1106 2.51 204 0
195 90 27 1198 2.42 204 0
210 90 27 1289 2.33 204 0
225 90 27 1381 2.48 204 0
240 90 27 1472 2.57 204 0
255 90 27 1564 2.66 204 0

0 105 26 0 0.11 204 0
15 105 26 103 0.14 204 0
30 105 26 204 0.95 204 0
45 105 26 308 1.19 204 0
60 105 26 411 0.83 204 0
75 105 26 513 0.74 204 0
90 105 26 614 0.98 204 0
105 105 26 718 1.82 204 0
120 105 26 820 2.03 204 0
135 105 26 922 1.73 204 0
150 105 27 1024 1.67 204 0
165 105 27 1125 1.88 204 0
180 105 27 1226 2.15 204 0
195 105 27 1328 2.60 204 0
210 105 27 1430 2.60 204 0
225 105 27 1532 2.51 204 0
240 105 27 1632 2.63 204 0
255 105 27 1734 2.72 204 0

0 120 26 0 0.05 204 0
15 120 26 112 0.59 204 0
30 120 26 225 0.17 204 0
45 120 26 337 1.22 204 0
60 120 26 449 1.22 204 0
75 120 26 559 0.62 204 0
90 120 26 671 1.28 204 0
105 120 26 783 1.91 204 0
120 120 26 895 1.91 204 0
135 120 27 1008 1.49 204 0
150 120 27 1119 1.67 204 0
165 120 27 1230 2.03 204 0
180 120 27 1341 2.57 204 0
195 120 27 1452 2.51 204 0
210 120 27 1562 2.39 204 0
225 120 27 1673 2.54 204 0
240 120 27 1784 2.63 204 0
255 120 27 1894 2.72 204 0

0 135 26 0 0.02 204 0
15 135 26 122 0.32 204 0
30 135 26 243 0.77 204 0
45 135 26 362 1.25 204 0
60 135 26 485 1.19 204 0
75 135 26 606 0.77 204 0
90 135 26 727 1.76 204 0
105 135 27 847 1.91 204 0
120 135 27 968 1.49 204 0
135 135 27 1087 1.49 204 0
150 135 27 1207 1.70 204 0
165 135 27 1327 2.18 204 0
180 135 27 1447 2.66 204 0
195 135 27 1567 2.63 204 0
210 135 27 1686 2.42 204 0
225 135 27 1805 2.57 204 0
240 135 27 1924 2.69 204 0
255 135 28 2043 2.78 204 0

0 150 26 0 0.02 204 0
15 150 26 130 0.17 204 0
30 150 26 260 0.98 204 0
45 150 26 390 1.10 204 0
60 150 26 519 0.59 204 0
75 150 26 648 0.98 204 0
90 150 27 777 1.76 204 0
105 150 27 905 1.82 204 0
120 150 27 1034 1.37 204 0
135 150 27 1163 1.73 204 0
150 150 27 1291 1.73 204 0
165 150 27 1419 1.91 204 0
180 150 27 1547 2.12 204 0
195 150 27 1675 2.30 204 0
210 150 27 1802 2.45 204 0
225 150 28 1930 2.60 204 0
240 150 28 2057 2.72 204 0
255 150 28 2183 2.81 204 0

0 165 26 0 0.02 204 0
15 165 26 138 0.14 204 0
30 165 26 273 0.86 204 0
45 165 26 411 1.22 204 0
60 165 27 551 1.31 204 0
75 165 27 689 0.98 204 0
90 165 27 826 0.80 204 0
105 165 27 962 1.22 204 0
120 165 27 1099 1.97 204 0
135 165 27 1235 2.30 204 0
150 165 27 1371 2.48 204 0
165 165 27 1507 2.60 204 0
180 165 27 1643 2.72 204 0
195 165 28 1778 2.84 204 0
210 165 28 1914 2.87 204 0
225 165 28 2049 2.84 204 0
240 165 28 2182 2.78 204 0
255 165 28 2317 2.87 204 0

0 180 27 0 0.05 204 0
15 180 26 146 0.35 204 0
30 180 26 291 0.50 204 0
45 180 27 437 1.13 204 0
60 180 27 582 1.49 204 0
75 180 27 726 1.49 204 0
90 180 27 871 1.16 204 0
105 180 27 1015 1.07 204 0
120 180 27 1159 1.31 204 0
135 180 27 1303 1.52 204 0
150 180 27 1446 1.79 204 0
165 180 27 1590 1.97 204 0
180 180 28 1733 2.18 204 0
195 180 28 1876 2.36 204 0
210 180 28 2016 2.54 204 0
225 180 28 2157 2.66 204 0
240 180 28 2301 2.81 204 0
255 180 28 2443 2.90 204 0

0 195 27 0 0.05 204 0
15 195 27 153 0.71 204 0
30 195 27 306 0.23 204 0
45 195 27 456 0.80 204 0
60 195 27 609 1.43 204 0
75 195 27 762 1.67 204 0
90 195 27 913 1.70 204 0
105 195 27 1064 1.64 204 0
120 195 27 1216 1.52 204 0
135 195 27 1366 1.52 204 0
150 195 28 1517 1.79 204 0
165 195 28 1668 2.00 204 0
180 195 28 1817 2.81 204 0
195 195 28 1967 2.39 204 0
210 195 28 2116 2.57 204 0
225 195 28 2264 2.72 204 0
240 195 28 2412 2.84 204 0
255 195 29 2560 2.96 204 0

0 210 27 0 0.14 204 0
15 210 27 160 0.83 204 0
30 210 27 319 0.83 204 0
45 210 27 477 0.17 204 0
60 210 27 638 0.98 204 0
75 210 27 796 1.61 204 0
90 210 27 955 1.85 204 0
105 210 27 1113 2.06 204 0
120 210 27 1271 2.27 204 0
135 210 27 1429 2.39 204 0
150 210 28 1586 2.57 204 0
165 210 28 1743 2.57 204 0
180 210 28 1899 2.30 204 0
195 210 28 2055 2.42 204 0
210 210 28 2211 2.60 204 0
225 210 29 2366 2.75 204 0
240 210 29 2520 2.87 204 0
255 210 29 2674 2.99 204 0

0 225 27 0 0.14 204 0
15 225 27 167 0.80 204 0
30 225 27 333 0.98 204 0
45 225 27 499 0.41 204 0
60 225 27 665 0.80 204 0
75 225 27 830 0.86 204 0
90 225 27 995 1.55 204 0
105 225 27 1159 1.97 204 0
120 225 27 1323 2.24 204 0
135 225 28 1487 2.39 204 0
150 225 28 1650 2.57 204 0
165 225 28 1812 2.48 204 0
180 225 28 1978 2.33 204 0
195 225 28 2141 2.45 204 0
210 225 29 2302 2.63 204 0
225 225 29 2460 2.93 204 0
240 225 29 2624 2.90 204 0
255 225 29 2783 3.02 204 0

0 240 27 0 0.08 204 0
15 240 27 173 0.53 204 0
30 240 27 346 1.07 204 0
45 240 27 517 0.89 204 0
60 240 27 688 0.65 204 0
75 240 27 861 1.58 204 0
90 240 27 1033 1.94 204 0
105 240 27 1204 2.00 204 0
120 240 28 1375 1.82 204 0
135 240 28 1545 1.79 204 0
150 240 28 1715 1.91 204 0
165 240 28 1885 2.06 204 0
180 240 28 2050 2.36 204 0
195 240 29 2222 2.75 204 0
210 240 29 2389 3.05 204 0
225 240 29 2556 2.81 204 0
240 240 29 2722 2.93 204 0
255 240 29 2888 3.05 204 0

0 255 27 0 0.02 204 0
15 255 27 180 0.68 204 0
30 255 27 359 1.04 204 0
45 255 27 538 0.38 204 0
60 255 27 716 1.16 204 0
75 255 27 894 1.73 204 0
90 255 27 1072 1.79 204 0
105 255 28 1250 2.06 204 0
120 255 28 1427 2.06 204 0
135 255 28 1603 2.00 204 0
150 255 28 1778 2.06 204 0
165 255 28 1951 2.27 204 0
180 255 29 2130 2.63 204 0
195 255 29 2304 3.02 204 0
210 255 29 2474 2.84 204 0
225 255 29 2650 2.84 204 0
240 255 30 2822 2.99 204 0
255 255 30 2993 3.11 204 0

