0 0 27 104 0.65 12 
15 0 27 0 1.19 12 
30 0 27 0 1.34 12 
45 0 27 0 1.52 12 
60 0 27 0 1.73 12 
75 0 27 0 1.61 12 
90 0 27 0 1.76 12 
105 0 27 0 1.82 12 
120 0 27 0 1.82 12 
135 0 27 0 1.91 12 
150 0 27 0 2.03 12 
165 0 27 0 2.21 12 
180 0 27 0 2.36 12 
195 0 27 0 2.51 12 
210 0 27 0 2.63 12 
225 0 27 0 2.78 12 
240 0 27 0 2.84 12 
255 0 27 0 2.90 12 

0 15 27 0 0.65 12 
15 15 27 2 0.89 12 
30 15 27 5 1.04 12 
45 15 27 8 1.13 12 
60 15 27 11 1.16 12 
75 15 27 14 1.25 12 
90 15 27 16 1.28 12 
105 15 27 20 1.40 12 
120 15 27 23 1.58 12 
135 15 27 26 1.82 12 
150 15 27 29 2.03 12 
165 15 27 32 2.21 12 
180 15 27 35 2.42 12 
195 15 27 38 2.57 12 
210 15 27 40 2.75 12 
225 15 27 43 2.90 12 
240 15 27 47 3.05 12 
255 15 27 50 3.17 12 

0 30 27 0 0.68 12 
15 30 27 6 0.68 12 
30 30 27 13 0.92 12 
45 30 27 20 1.10 12 
60 30 27 25 1.31 12 
75 30 27 32 1.52 12 
90 30 27 40 1.67 12 
105 30 27 47 1.85 12 
120 30 27 54 2.09 12 
135 30 27 61 2.33 12 
150 30 27 67 2.57 12 
165 30 27 74 2.78 12 
180 30 27 79 2.96 12 
195 30 27 87 3.08 12 
210 30 27 94 3.05 12 
225 30 27 101 3.08 12 
240 30 27 108 3.17 12 
255 30 27 115 3.20 12 

0 45 27 0 0.65 12 
15 45 27 10 0.77 12 
30 45 27 18 1.01 12 
45 45 27 30 1.19 12 
60 45 27 43 1.40 12 
75 45 27 54 1.55 12 
90 45 27 65 1.58 12 
105 45 27 75 1.64 12 
120 45 27 86 1.73 12 
135 45 27 97 2.48 12 
150 45 27 105 2.57 12 
165 45 27 118 2.69 12 
180 45 27 130 2.87 12 
195 45 27 141 3.05 12 
210 45 27 151 3.17 12 
225 45 27 162 3.23 12 
240 45 27 173 3.23 12 
255 45 27 184 3.23 12 

0 60 27 51 0.65 12 
15 60 27 12 0.44 12 
30 60 27 29 0.47 12 
45 60 27 45 0.53 12 
60 60 27 59 0.71 12 
75 60 27 74 0.98 12 
90 60 27 89 1.16 12 
105 60 27 104 1.61 12 
120 60 27 115 1.91 12 
135 60 27 132 2.18 12 
150 60 27 149 2.48 12 
165 60 27 164 2.81 12 
180 60 27 179 2.99 12 
195 60 27 194 3.14 12 
210 60 27 208 3.23 12 
225 60 27 223 3.26 12 
240 60 27 234 3.23 12 
255 60 27 251 3.26 12 

0 75 27 5 0.68 12 
15 75 27 19 0.65 12 
30 75 27 38 1.16 12 
45 75 27 57 1.31 12 
60 75 27 76 1.46 12 
75 75 27 96 1.46 12 
90 75 27 110 1.16 12 
105 75 27 131 1.40 12 
120 75 27 153 1.61 12 
135 75 27 172 1.85 12 
150 75 27 191 2.06 12 
165 75 27 210 2.27 12 
180 75 27 229 2.45 12 
195 75 27 249 2.66 12 
210 75 27 264 2.84 12 
225 75 27 285 2.99 12 
240 75 27 306 3.17 12 
255 75 27 325 3.26 12 

0 90 28 0 0.65 12 
15 90 28 20 1.01 12 
30 90 28 41 1.25 12 
45 90 28 62 1.46 12 
60 90 28 78 1.67 12 
75 90 28 102 1.85 12 
90 90 28 126 2.06 12 
105 90 27 147 2.27 12 
120 90 27 168 2.42 12 
135 90 27 189 2.57 12 
150 90 27 211 2.75 12 
165 90 27 232 2.69 12 
180 90 27 249 2.75 12 
195 90 27 273 3.17 12 
210 90 27 297 3.26 12 
225 90 27 319 3.23 12 
240 90 27 340 3.23 12 
255 90 27 363 3.29 12 

0 105 28 0 0.65 12 
15 105 28 21 0.41 12 
30 105 28 36 0.56 12 
45 105 28 60 1.04 12 
60 105 28 83 1.49 12 
75 105 28 104 1.79 12 
90 105 28 125 2.00 12 
105 105 28 147 2.24 12 
120 105 28 168 2.39 12 
135 105 28 189 2.48 12 
150 105 28 206 2.30 12 
165 105 28 230 2.24 12 
180 105 28 254 2.45 12 
195 105 28 275 2.63 12 
210 105 28 297 2.81 12 
225 105 28 319 2.99 12 
240 105 28 341 3.17 12 
255 105 28 363 3.29 12 

0 120 28 91 0.65 12 
15 120 28 18 0.98 12 
30 120 28 42 1.10 12 
45 120 28 63 1.19 12 
60 120 28 84 1.13 12 
75 120 28 105 1.67 12 
90 120 28 126 1.70 12 
105 120 28 148 1.73 12 
120 120 28 163 1.73 12 
135 120 28 187 1.82 12 
150 120 28 211 2.06 12 
165 120 28 232 2.24 12 
180 120 28 254 2.45 12 
195 120 28 276 2.63 12 
210 120 28 298 2.81 12 
225 120 28 320 2.99 12 
240 120 28 337 3.14 12 
255 120 28 362 3.29 12 

0 135 28 0 0.65 12 
15 135 28 24 0.68 12 
30 135 28 49 0.41 12 
45 135 28 75 0.83 12 
60 135 28 100 1.34 12 
75 135 28 125 1.67 12 
90 135 28 143 2.00 12 
105 135 28 172 2.27 12 
120 135 28 199 2.45 12 
135 135 28 225 2.63 12 
150 135 28 251 2.78 12 
165 135 28 277 2.84 12 
180 135 28 303 2.57 12 
195 135 28 329 2.66 12 
210 135 28 350 2.84 12 
225 135 28 380 3.02 12 
240 135 28 408 3.17 12 
255 135 28 435 3.29 12 

0 150 28 0 0.68 12 
15 150 28 24 0.83 12 
30 150 28 49 0.56 12 
45 150 28 74 0.74 12 
60 150 28 95 1.46 12 
75 150 28 123 1.85 12 
90 150 28 151 2.00 12 
105 150 28 176 1.97 12 
120 150 28 202 1.64 12 
135 150 28 227 2.57 12 
150 150 28 253 2.78 12 
165 150 28 279 2.45 12 
180 150 28 296 2.48 12 
195 150 28 326 2.66 12 
210 150 28 355 2.87 12 
225 150 28 382 3.29 12 
240 150 28 409 3.17 12 
255 150 28 436 3.29 12 

0 165 28 0 0.65 12 
15 165 28 24 0.77 12 
30 165 28 43 0.50 12 
45 165 28 71 1.40 12 
60 165 28 99 1.67 12 
75 165 28 125 1.64 12 
90 165 28 150 1.16 12 
105 165 28 175 1.76 12 
120 165 28 201 2.42 12 
135 165 28 227 2.06 12 
150 165 28 246 2.06 12 
165 165 28 275 2.27 12 
180 165 28 305 2.54 12 
195 165 28 331 3.17 12 
210 165 28 357 2.96 12 
225 165 28 383 3.02 12 
240 165 28 410 3.17 12 
255 165 28 437 3.29 12 

0 180 28 118 0.65 12 
15 180 28 21 1.04 12 
30 180 28 49 1.07 12 
45 180 28 75 0.77 12 
60 180 28 100 0.92 12 
75 180 28 126 1.70 12 
90 180 28 151 2.03 12 
105 180 28 176 2.21 12 
120 180 28 195 2.12 12 
135 180 28 224 1.85 12 
150 180 28 253 2.06 12 
165 180 28 279 2.33 12 
180 180 28 305 2.99 12 
195 180 28 331 2.69 12 
210 180 28 358 2.84 12 
225 180 28 384 3.02 12 
240 180 28 404 3.17 12 
255 180 28 434 3.29 12 

0 195 28 3 0.68 12 
15 195 28 25 0.62 12 
30 195 28 50 0.47 12 
45 195 28 75 1.07 12 
60 195 28 100 1.61 12 
75 195 28 126 1.88 12 
90 195 28 144 1.97 12 
105 195 28 173 1.73 12 
120 195 28 202 1.61 12 
135 195 28 227 1.85 12 
150 195 28 253 2.18 12 
165 195 28 279 2.66 12 
180 195 28 306 2.60 12 
195 195 28 332 3.14 12 
210 195 28 352 3.20 12 
225 195 28 381 3.02 12 
240 195 28 410 3.17 12 
255 195 28 437 3.29 12 

0 210 28 0 0.68 12 
15 210 28 25 0.86 12 
30 210 28 50 0.71 12 
45 210 28 75 0.62 12 
60 210 28 94 1.22 12 
75 210 28 122 1.82 12 
90 210 28 151 2.09 12 
105 210 28 176 2.18 12 
120 210 28 202 2.09 12 
135 210 28 228 1.85 12 
150 210 28 254 2.06 12 
165 210 28 280 2.27 12 
180 210 28 300 2.78 12 
195 210 28 330 3.20 12 
210 210 28 358 2.84 12 
225 210 28 385 3.02 12 
240 210 28 411 3.17 12 
255 210 28 438 3.29 12 

0 225 28 0 0.68 12 
15 225 28 25 0.62 12 
30 225 28 44 0.53 12 
45 225 28 72 1.43 12 
60 225 28 100 1.61 12 
75 225 28 126 1.85 12 
90 225 28 151 1.94 12 
105 225 28 177 1.49 12 
120 225 28 203 1.61 12 
135 225 28 228 2.15 12 
150 225 28 249 2.78 12 
165 225 28 278 2.69 12 
180 225 28 306 2.45 12 
195 225 28 333 2.66 12 
210 225 28 359 2.84 12 
225 225 28 385 3.02 12 
240 225 28 412 3.29 12 
255 225 28 439 3.29 12 

0 240 28 99 0.65 12 
15 240 28 22 1.01 12 
30 240 28 50 1.25 12 
45 240 28 75 1.34 12 
60 240 28 100 1.07 12 
75 240 28 126 0.89 12 
90 240 28 151 1.70 12 
105 240 28 176 2.24 12 
120 240 28 198 2.33 12 
135 240 28 227 1.82 12 
150 240 28 254 2.06 12 
165 240 28 280 2.27 12 
180 240 28 306 2.87 12 
195 240 28 332 3.14 12 
210 240 28 359 2.84 12 
225 240 28 386 2.99 12 
240 240 28 407 3.17 12 
255 240 28 438 3.29 12 

0 255 28 0 0.62 12 
15 255 28 25 0.95 12 
30 255 28 50 0.92 12 
45 255 28 75 0.50 12 
60 255 28 101 1.28 12 
75 255 28 127 1.82 12 
90 255 28 146 2.03 12 
105 255 28 175 2.09 12 
120 255 28 204 1.67 12 
135 255 28 229 1.85 12 
150 255 28 255 2.30 12 
165 255 28 281 2.90 12 
180 255 28 307 2.93 12 
195 255 28 333 2.66 12 
210 255 28 355 2.84 12 
225 255 28 385 2.99 12 
240 255 28 413 3.17 12 
255 255 28 440 3.29 12 

