0 0 26 0 0.20 204 2
15 0 26 2 0.59 204 2
30 0 26 5 0.77 204 2
45 0 26 8 0.29 204 2
60 0 26 12 1.22 204 2
75 0 25 14 0.86 204 2
90 0 25 18 1.13 204 2
105 0 25 20 1.61 204 2
120 0 25 24 1.04 204 2
135 0 25 26 1.97 204 2
150 0 25 30 1.46 204 2
165 0 25 33 1.85 204 2
180 0 25 36 1.85 204 2
195 0 25 38 1.94 204 2
210 0 25 42 2.30 204 2
225 0 25 46 2.21 204 2
240 0 25 48 2.39 204 2
255 0 25 52 2.39 204 2

0 15 25 0 0.23 204 2
15 15 25 609 0.68 204 2
30 15 25 1219 0.59 204 2
45 15 25 1830 1.04 204 2
60 15 25 2425 0.41 204 2
75 15 25 3049 1.37 204 2
90 15 25 3659 0.83 204 2
105 15 25 4269 1.73 204 2
120 15 25 4878 1.16 204 2
135 15 25 5476 2.06 204 2
150 15 25 6086 1.58 204 2
165 15 25 6695 2.33 204 2
180 15 25 7318 1.94 204 2
195 15 25 7916 2.42 204 2
210 15 25 8525 2.27 204 2
225 15 25 9135 2.54 204 2
240 15 25 9746 2.51 204 2
255 15 25 10357 2.60 204 2

0 30 25 0 0.23 204 2
15 30 25 1165 0.56 204 2
30 30 25 2331 0.68 204 2
45 30 25 3497 0.92 204 2
60 30 25 4641 0.80 204 2
75 30 25 5828 1.37 204 2
90 30 25 6994 0.95 204 2
105 30 25 8159 1.43 204 2
120 30 25 9302 1.46 204 2
135 30 25 10480 1.79 204 2
150 30 25 11634 1.58 204 2
165 30 25 12799 2.21 204 2
180 30 25 13963 2.00 204 2
195 30 25 15148 2.36 204 2
210 30 25 16291 2.33 204 2
225 30 25 17456 2.45 204 2
240 30 25 18619 2.57 204 2
255 30 25 19785 2.66 204 2

0 45 25 0 0.23 204 2
15 45 25 1697 0.56 204 2
30 45 25 3394 0.74 204 2
45 45 25 5091 0.83 204 2
60 45 25 6789 1.19 204 2
75 45 25 8485 0.89 204 2
90 45 25 10154 1.61 204 2
105 45 25 11850 0.95 204 2
120 45 25 13571 2.03 204 2
135 45 25 15268 1.40 204 2
150 45 25 16946 2.30 204 2
165 45 25 18656 1.82 204 2
180 45 25 20324 2.39 204 2
195 45 25 22020 2.21 204 2
210 45 25 23714 2.36 204 2
225 45 25 25405 2.51 204 2
240 45 25 27097 2.63 204 2
255 45 25 28790 2.72 204 2

0 60 25 0 0.23 204 2
15 60 25 2190 0.71 204 2
30 60 25 4379 0.08 204 2
45 60 25 6569 1.10 204 2
60 60 25 8758 0.59 204 2
75 60 25 10910 0.83 204 2
90 60 25 13096 1.64 204 2
105 60 25 15321 0.92 204 2
120 60 25 17507 2.06 204 2
135 60 25 19689 1.40 204 2
150 60 25 21844 2.36 204 2
165 60 25 24024 1.82 204 2
180 60 25 26209 2.30 204 2
195 60 25 28395 2.21 204 2
210 60 25 30576 2.36 204 2
225 60 25 32758 2.75 204 2
240 60 25 34937 2.63 204 2
255 60 26 37117 2.75 204 2

0 75 25 0 0.23 204 2
15 75 25 2668 0.68 204 2
30 75 25 5338 0.62 204 2
45 75 25 8005 1.01 204 2
60 75 25 10633 1.10 204 2
75 75 25 13310 0.89 204 2
90 75 25 15961 1.70 204 2
105 75 25 18624 0.95 204 2
120 75 25 21321 2.09 204 2
135 75 25 23980 1.49 204 2
150 75 25 26640 1.76 204 2
165 75 25 29263 2.30 204 2
180 75 25 31920 2.06 204 2
195 75 25 34576 2.69 204 2
210 75 26 37233 2.42 204 2
225 75 26 39891 2.57 204 2
240 75 26 42542 2.72 204 2
255 75 26 45190 2.78 204 2

0 90 25 0 0.23 204 2
15 90 25 3125 0.62 204 2
30 90 25 6248 0.59 204 2
45 90 25 9371 1.01 204 2
60 90 25 12492 0.71 204 2
75 90 25 15559 1.52 204 2
90 90 25 18678 0.74 204 2
105 90 25 21799 1.94 204 2
120 90 25 24909 1.19 204 2
135 90 25 28058 2.06 204 2
150 90 25 31164 1.85 204 2
165 90 26 34267 1.88 204 2
180 90 26 37347 2.48 204 2
195 90 26 40450 2.27 204 2
210 90 26 43545 2.84 204 2
225 90 26 46644 2.60 204 2
240 90 26 49735 2.72 204 2
255 90 26 52830 2.84 204 2

0 105 25 0 0.23 204 2
15 105 25 3487 0.62 204 2
30 105 25 6582 0.47 204 2
45 105 25 9772 1.13 204 2
60 105 25 12904 0.32 204 2
75 105 25 16032 1.58 204 2
90 105 25 19163 0.86 204 2
105 105 25 22256 1.70 204 2
120 105 25 25429 1.82 204 2
135 105 26 28528 1.46 204 2
150 105 26 31664 2.09 204 2
165 105 26 34800 2.21 204 2
180 105 26 37937 2.12 204 2
195 105 26 41071 2.72 204 2
210 105 26 44210 2.48 204 2
225 105 26 47342 2.63 204 2
240 105 26 50488 2.75 204 2
255 105 26 53248 2.87 204 2

0 120 25 0 0.23 204 2
15 120 25 3595 0.62 204 2
30 120 25 6739 0.56 204 2
45 120 25 9872 1.13 204 2
60 120 25 13000 0.62 204 2
75 120 25 16084 1.55 204 2
90 120 25 19219 0.92 204 2
105 120 25 22389 1.85 204 2
120 120 26 25521 1.58 204 2
135 120 26 28650 1.49 204 2
150 120 26 31779 2.42 204 2
165 120 26 34913 1.94 204 2
180 120 26 38038 2.42 204 2
195 120 26 41180 2.36 204 2
210 120 26 44308 2.51 204 2
225 120 26 47441 2.93 204 2
240 120 26 50586 2.81 204 2
255 120 26 53248 2.90 204 2

0 135 25 0 0.17 204 2
15 135 25 3680 0.41 204 2
30 135 25 6818 0.86 204 2
45 135 25 9950 0.77 204 2
60 135 25 13077 1.25 204 2
75 135 25 16160 0.92 204 2
90 135 26 19308 1.73 204 2
105 135 26 22465 1.01 204 2
120 135 26 25599 2.18 204 2
135 135 26 28728 1.55 204 2
150 135 26 31853 1.76 204 2
165 135 26 34984 2.63 204 2
180 135 26 38115 2.18 204 2
195 135 26 41246 2.36 204 2
210 135 26 44393 2.90 204 2
225 135 26 47528 2.72 204 2
240 135 27 50664 2.84 204 2
255 135 27 53248 2.96 204 2

0 150 25 0 0.17 204 2
15 150 25 3747 0.74 204 2
30 150 25 6884 0.08 204 2
45 150 25 10012 1.22 204 2
60 150 25 13139 0.68 204 2
75 150 26 16268 1.43 204 2
90 150 26 19394 1.67 204 2
105 150 26 22506 1.04 204 2
120 150 26 25642 2.09 204 2
135 150 26 28779 2.12 204 2
150 150 26 31913 1.73 204 2
165 150 26 35046 2.03 204 2
180 150 26 38183 2.81 204 2
195 150 26 41321 2.78 204 2
210 150 27 44453 2.57 204 2
225 150 27 47597 2.75 204 2
240 150 27 50735 2.87 204 2
255 150 27 53248 2.99 204 2

0 165 26 0 0.17 204 2
15 165 25 3790 0.74 204 2
30 165 25 6919 0.08 204 2
45 165 25 10045 1.22 204 2
60 165 26 13174 0.80 204 2
75 165 26 16302 1.37 204 2
90 165 26 19430 1.73 204 2
105 165 26 22543 1.04 204 2
120 165 26 25680 2.00 204 2
135 165 26 28815 2.30 204 2
150 165 26 31953 1.76 204 2
165 165 26 35090 2.00 204 2
180 165 26 38220 2.66 204 2
195 165 27 41361 2.72 204 2
210 165 27 44460 2.60 204 2
225 165 27 47626 2.75 204 2
240 165 27 50770 2.90 204 2
255 165 27 53248 3.02 204 2

0 180 26 0 0.17 204 2
15 180 26 3807 0.65 204 2
30 180 26 6943 0.71 204 2
45 180 26 10069 0.98 204 2
60 180 26 13190 1.31 204 2
75 180 26 16313 0.80 204 2
90 180 26 19426 1.31 204 2
105 180 26 22570 2.06 204 2
120 180 26 25699 1.58 204 2
135 180 26 28832 1.55 204 2
150 180 26 31973 2.33 204 2
165 180 26 35105 2.66 204 2
180 180 27 38240 2.24 204 2
195 180 27 41340 2.45 204 2
210 180 27 44469 2.63 204 2
225 180 27 47653 2.93 204 2
240 180 27 50788 3.05 204 2
255 180 27 53248 3.05 204 2

0 195 26 0 0.20 204 2
15 195 26 3826 0.05 204 2
30 195 26 6954 1.01 204 2
45 195 26 10071 0.11 204 2
60 195 26 13166 1.43 204 2
75 195 26 16310 1.07 204 2
90 195 26 19445 1.22 204 2
105 195 26 22577 2.09 204 2
120 195 26 25718 1.58 204 2
135 195 26 28851 1.55 204 2
150 195 27 31990 2.09 204 2
165 195 27 35124 2.78 204 2
180 195 27 38228 2.57 204 2
195 195 27 41328 2.45 204 2
210 195 27 44539 2.66 204 2
225 195 27 47664 2.81 204 2
240 195 27 50808 2.96 204 2
255 195 28 53248 3.08 204 2

0 210 26 0 0.17 204 2
15 210 26 3838 0.59 204 2
30 210 26 6954 0.77 204 2
45 210 26 10081 0.89 204 2
60 210 26 13203 1.40 204 2
75 210 26 16327 0.68 204 2
90 210 26 19450 1.46 204 2
105 210 26 22585 2.09 204 2
120 210 26 25721 1.70 204 2
135 210 27 28848 1.55 204 2
150 210 27 31950 1.82 204 2
165 210 27 35139 2.48 204 2
180 210 27 38269 2.87 204 2
195 210 27 41399 3.08 204 2
210 210 27 44543 2.96 204 2
225 210 28 47678 2.93 204 2
240 210 28 50816 2.99 204 2
255 210 28 53248 3.11 204 2

0 225 26 0 0.14 204 2
15 225 26 3838 0.26 204 2
30 225 26 6960 0.95 204 2
45 225 26 10076 0.98 204 2
60 225 26 13209 0.74 204 2
75 225 26 16329 1.70 204 2
90 225 26 19458 1.52 204 2
105 225 26 22598 1.07 204 2
120 225 27 25727 1.28 204 2
135 225 27 28815 1.97 204 2
150 225 27 31940 2.39 204 2
165 225 27 35062 2.81 204 2
180 225 27 38282 2.96 204 2
195 225 27 41413 2.87 204 2
210 225 28 44451 2.93 204 2
225 225 28 47689 2.93 204 2
240 225 28 50832 3.14 204 2
255 225 28 53248 3.14 204 2

0 240 26 0 0.14 204 2
15 240 26 3838 0.77 204 2
30 240 26 6960 0.14 204 2
45 240 26 10078 1.25 204 2
60 240 26 13204 0.80 204 2
75 240 26 16325 1.22 204 2
90 240 26 19448 1.91 204 2
105 240 26 22571 1.76 204 2
120 240 27 25739 1.31 204 2
135 240 27 28873 1.58 204 2
150 240 27 32010 2.24 204 2
165 240 27 35062 2.81 204 2
180 240 27 38210 3.02 204 2
195 240 28 41423 3.11 204 2
210 240 28 44479 3.17 204 2
225 240 28 47685 3.05 204 2
240 240 28 50820 3.05 204 2
255 240 28 53248 3.17 204 2

0 255 26 0 0.17 204 2
15 255 26 3840 0.23 204 2
30 255 26 6965 0.95 204 2
45 255 26 10079 0.47 204 2
60 255 26 13201 1.46 204 2
75 255 26 16326 1.34 204 2
90 255 26 19443 0.80 204 2
105 255 27 22571 2.00 204 2
120 255 27 25740 2.36 204 2
135 255 27 28872 2.33 204 2
150 255 27 32008 2.03 204 2
165 255 27 35050 2.09 204 2
180 255 28 38247 2.33 204 2
195 255 28 41423 2.54 204 2
210 255 28 44560 2.75 204 2
225 255 28 47697 3.02 204 2
240 255 28 50834 3.20 204 2
255 255 29 53248 3.20 204 2

