Key,Term,Definition,Flagged for review
desk_review,Desk Review,"After receiving an initial valuation, some property values go through a second round of review before being mailed to taxpayers. This process is known as desk review. If the initial valuation created by modeling is adjusted during desk review, then the property will be flagged here and the desk review comment will be shown (if available).",1
example,Example Definition,Tooltips help the user understand the page.,0
percent_ownership,Percent Ownership,"This owner's share of the property, sometimes referred to as percentage of interest. The entire property's tax bill is divided according to this value.",0
proration_rate,Proration Rate,"This owner's share of the property, sometimes referred to as percentage of interest. The entire property's tax bill is divided according to this value.",1
multi-code,Multi-Code,Indicates that more than one property/improvement lies on the same parcel.,0
cdu,CDU Code,"Various codes related to property condition, incentives applied, and property type.",0
288,Num. 288,"288s (Home Improvement Exemptions) allow homeowners to improve their property (add bedrooms, refinish, etc.) in a way that changes the characteristics of their home without paying tax on the additional value possibly added by those updated characteristics. They effectively ""freeze"" a property's pre-improvement characteristics until the 288 expires.",1
property_class,Property Class,The Cook County Assessor categorizes all properties into a class according to physical characteristics.,1
board,Board of Review,The valuation after Board of Review appeals are finalized. The Board of Review is responsible for considering assessment appeals after the completion of Cook County Assessor's Office appeals. ,1
certified,Certified,The valuation after Cook County Assessor's Office appeals have been finalized.,1
mailed,Mailed,The initial valuation mailed to the property owner by the Cook County Assessor's Office.,1
appeal_type,Appeal Type,"Appeals are submitted first to the Assessor's Office, and then to the Board of Review.",1
fmv,Fair Market Value,The fair market value is the price that a property would sell for under normal market conditions.,1
comps_uniform,Uniformity Comparables,Uniformity comparables are properties that have very similar characteristics to this property. They must be the same class and neighborhood as the target property and their characteristics must fall within a fixed range.,1
comps_sales,Sales Comparables,Sales comparables are properties within a certain distance that have a similar market value and set of characteristics.,1
adj_sale_price,Adjusted Sale Price,Inflation-adjusted sale price (takes into account the differential value of the US dollar over time).,1
pin,PIN,"The 14-digit Property Index Number uniquely identifies every property in Cook County, including individual units in condiminiums.",1
valuation,CCAO Property Valuation,"The valuation, or assessment, is the Cook County Assessor's Office best estimate of the fair market value of your property (the price that a property would sell for under normal market conditions).",1
appeal,Appeal,"Property owners may appeal to have their assessment lowered if they believe their property assessment is inaccurate. For more information, visit the Cook County Assessor's website.",1
