<svg viewBox="0 0 120 120" fill="none" xmlns="http://www.w3.org/2000/svg">
<path fill-rule="evenodd" clip-rule="evenodd" d="M45.6372 32C46.3949 32 47.0092 32.626 47.0092 33.3983V40.6478L60.2713 48.4303L73.5334 40.6478V33.3983C73.5334 32.626 74.1476 32 74.9054 32C75.6631 32 76.2773 32.626 76.2773 33.3983V40.6478L91.14 49.3695V67.0508L97.2734 70.3848C97.942 70.7483 98.1949 71.5953 97.8383 72.2767C97.4818 72.9581 96.6507 73.2159 95.9822 72.8524L89.7935 69.4884L76.2773 77.42V85.6017C76.2773 86.374 75.6631 87 74.9054 87C74.1476 87 73.5334 86.374 73.5334 85.6017V77.42L60.2713 69.6375L47.0092 77.42V85.6017C47.0092 86.374 46.3949 87 45.6372 87C44.8795 87 44.2653 86.374 44.2653 85.6017V77.42L30.8138 69.5264L25.114 73.261C24.4766 73.6786 23.6278 73.4905 23.2181 72.8409C22.8083 72.1913 22.9929 71.3261 23.6302 70.9085L29.4026 67.1264V49.3695L44.2653 40.6478V33.3983C44.2653 32.626 44.8795 32 45.6372 32ZM45.6372 43.0697L32.1465 50.9864V67.0814L45.6372 74.9981L58.8153 67.2649C58.8273 67.2404 58.8401 67.2161 58.8537 67.1921C58.9287 67.0594 59.0218 66.9439 59.128 66.8471V51.2207C59.0218 51.1239 58.9287 51.0084 58.8537 50.8757C58.8401 50.8516 58.8273 50.8273 58.8153 50.8029L45.6372 43.0697ZM61.8719 50.718V67.3497L74.9054 74.9981L88.3961 67.0814V50.9864L74.9054 43.0697L61.8719 50.718ZM55.4695 51.5763C56.2272 51.5763 56.8414 52.2023 56.8414 52.9746V66.0254C56.8414 66.7977 56.2272 67.4237 55.4695 67.4237C54.7118 67.4237 54.0975 66.7977 54.0975 66.0254V52.9746C54.0975 52.2023 54.7118 51.5763 55.4695 51.5763Z" fill="#29313A"/>
</svg>
