<svg viewBox="0 0 120 120" fill="none" xmlns="http://www.w3.org/2000/svg">
<path d="M79.7252 48.7693C87.6078 48.7693 94 54.084 94 60.6453C93.9989 62.6135 93.1629 64.5008 91.6757 65.8925C90.1886 67.2841 88.1719 68.0662 86.0689 68.0669H83.2625C81.9464 68.0669 80.8829 69.0623 80.8829 70.2941C80.8829 70.8579 81.1213 71.3776 81.4853 71.7637C81.8664 72.1646 82.1048 72.6843 82.1048 73.2628C82.1048 74.4959 81.0099 75.4899 79.7252 75.4899C71.8426 75.4899 65.4504 69.5072 65.4504 62.1296C65.4504 54.752 71.8426 48.7693 79.7252 48.7693ZM73.3015 62.1296C73.8694 62.1296 74.414 61.9185 74.8156 61.5426C75.2172 61.1668 75.4428 60.6571 75.4428 60.1256C75.4428 59.5941 75.2172 59.0843 74.8156 58.7085C74.414 58.3327 73.8694 58.1215 73.3015 58.1215C72.7336 58.1215 72.189 58.3327 71.7875 58.7085C71.3859 59.0843 71.1603 59.5941 71.1603 60.1256C71.1603 60.6571 71.3859 61.1668 71.7875 61.5426C72.189 61.9185 72.7336 62.1296 73.3015 62.1296ZM86.1489 62.1296C86.7168 62.1296 87.2614 61.9185 87.6629 61.5426C88.0645 61.1668 88.2901 60.6571 88.2901 60.1256C88.2901 59.5941 88.0645 59.0843 87.6629 58.7085C87.2614 58.3327 86.7168 58.1215 86.1489 58.1215C85.581 58.1215 85.0364 58.3327 84.6348 58.7085C84.2332 59.0843 84.0076 59.5941 84.0076 60.1256C84.0076 60.6571 84.2332 61.1668 84.6348 61.5426C85.0364 61.9185 85.581 62.1296 86.1489 62.1296ZM79.7252 58.1215C80.2931 58.1215 80.8377 57.9104 81.2393 57.5345C81.6408 57.1587 81.8664 56.649 81.8664 56.1175C81.8664 55.586 81.6408 55.0762 81.2393 54.7004C80.8377 54.3246 80.2931 54.1134 79.7252 54.1134C79.1573 54.1134 78.6127 54.3246 78.2111 54.7004C77.8096 55.0762 77.584 55.586 77.584 56.1175C77.584 56.649 77.8096 57.1587 78.2111 57.5345C78.6127 57.9104 79.1573 58.1215 79.7252 58.1215Z" fill="#29313A"/>
<g clip-path="url(#clip0_1045_312)">
<path d="M41.3418 60.3076V63.8974H37.5064V71.0769C37.5064 75.0435 40.9391 78.2563 45.1773 78.2563C49.4154 78.2563 52.8482 75.0435 52.8482 71.0769V63.8974H49.0127V60.3076H54.7659C55.8245 60.3076 56.6836 61.1117 56.6836 62.1025V71.0769C56.6836 76.413 52.5375 80.841 47.095 81.6971V84.5384C47.095 88.0079 50.1001 90.8205 53.807 90.8205C56.6779 90.8205 59.1287 89.1333 60.0876 86.7587C58.0797 85.9205 56.6836 84.0358 56.6836 81.8461C56.6836 78.872 59.2591 76.4615 62.4368 76.4615C65.6145 76.4615 68.19 78.872 68.19 81.8461C68.19 84.3069 66.4257 86.3817 64.017 87.0243C62.8395 91.2728 58.7145 94.4102 53.807 94.4102C47.981 94.4102 43.2595 89.9912 43.2595 84.5384V81.6971C37.817 80.8428 33.6709 76.413 33.6709 71.0769V62.1025C33.6709 61.1117 34.53 60.3076 35.5886 60.3076H41.3418Z" fill="#29313A"/>
</g>
<path d="M72.1411 39.4867C69.3824 32.0531 62.1589 26.8928 58.2769 24.9088C57.9079 24.7201 57.4467 24.8529 57.2188 25.1981C56.9861 25.5505 57.0804 26.0047 57.4133 26.2587C60.4705 28.5918 61.3956 31.7675 61.5095 33.5409C61.5327 33.9025 61.3678 34.2504 61.0971 34.5139L59.8042 35.7725C59.3471 36.2175 59.2288 36.8806 59.5093 37.4254L62.835 43.8832C63.0131 44.229 63.3331 44.4879 63.7221 44.6011L65.551 45.1327C65.8949 45.2327 66.1864 45.4472 66.3728 45.7374L66.6335 46.1433C66.8406 46.4657 66.9019 46.8566 66.804 47.2298L66.5096 48.3515C66.4214 48.6874 66.462 49.0389 66.624 49.3425L67.0666 50.1718C67.2542 50.5233 67.5966 50.7752 68.0039 50.8615C68.3412 50.9328 68.6977 50.8851 69.0074 50.7272L74.6457 47.8516C75.0006 47.6707 75.2701 47.3666 75.3963 47.005L75.4961 46.7189C75.6237 46.353 75.5944 45.9581 75.4144 45.6209L75.0184 44.8788C74.8203 44.5076 74.4587 44.2416 74.0286 44.1506L72.9868 43.9301C72.596 43.8474 72.2601 43.6198 72.053 43.2973L71.847 42.9765C71.6281 42.6357 71.5726 42.2195 71.694 41.8292L72.1571 40.3397C72.2447 40.0581 72.2422 39.7592 72.1411 39.4867Z" fill="#29313A"/>
<path d="M60.4917 45.0436L57.2919 38.4944L35.3448 49.5906C34.6166 49.9588 34.3092 50.7994 34.6488 51.4944L36.5834 55.4541C36.9422 56.1884 37.8807 56.4756 38.6501 56.0866L60.4917 45.0436Z" fill="#29313A"/>
<defs>
<clipPath id="clip0_1045_312">
<rect width="46.0255" height="43.077" fill="white" transform="translate(26 54.9231)"/>
</clipPath>
</defs>
</svg>
