<svg viewBox="0 0 120 120" fill="none" xmlns="http://www.w3.org/2000/svg">
<path fill-rule="evenodd" clip-rule="evenodd" d="M100.333 22H19.6667V80.7812L16 80.7812V82.5625H104V80.7812L100.333 80.7812V22ZM23.3334 55.8435C24.6766 56.496 26.2251 57.0701 27.9085 57.4826L28.544 58.0059C28.6278 57.9041 28.7139 57.7966 28.8021 57.6835C30.668 58.0652 32.6769 58.2418 34.7403 58.1085L35.6216 59.1551C36.0797 58.7693 36.5756 58.3225 37.0977 57.8191C46.0446 56.1841 55.3758 48.1593 58.1667 25.5623H61.8334C62.2973 35.9298 66.9174 53.039 80.6674 57.2488C81.6452 58.1613 82.7327 58.9207 83.942 59.4548L84.5612 58.0526C88.0784 58.4534 92.0939 58.0917 96.6667 56.7341V59.406C95.3502 59.3113 93.819 59.3102 92.1721 59.445L91.6063 58.8627C91.4066 59.0567 91.212 59.2897 91.0249 59.5592C89.0995 59.7853 87.0539 60.199 85.0336 60.8619L83.8883 60.2726C83.714 60.6114 83.516 61.0227 83.3039 61.4957C77.0295 64.0479 71.4185 69.2429 71 78.9998H49C48.5657 74.3578 45.4149 66.2369 36.7834 61.4153C36.512 60.9134 36.2517 60.4731 36.0154 60.1057L35.2281 60.6122C31.9899 59.0703 28.0642 57.9783 23.3334 57.6248V55.8435ZM35.2281 60.6122L32.6513 62.2698C33.3207 63.3104 34.3458 65.2891 35.1098 67.6757C35.8764 70.0702 36.3323 72.7269 36.0163 75.1825L39.9837 75.6929C40.4011 72.4486 39.7875 69.1678 38.9194 66.4561C38.2884 64.4851 37.4976 62.7366 36.7834 61.4153C36.2835 61.1361 35.7652 60.8679 35.2281 60.6122ZM83.3039 61.4957C81.9423 64.5331 80 70.1182 80 75.4377H84C84 70.1857 86.2945 64.3385 87.445 62.1029L85.0336 60.8619C84.4538 61.0522 83.8761 61.263 83.3039 61.4957ZM91.0249 59.5592C90.4116 60.4429 89.8792 61.7192 89.5155 63.2999C89.0233 65.4394 88.7918 68.3354 89.1772 72.08L93.1562 71.6705C92.8082 68.2901 93.0351 65.8423 93.4137 64.1967C93.6032 63.3729 93.8279 62.7625 94.0289 62.341C94.1293 62.1305 94.2196 61.9759 94.2906 61.8697C94.3515 61.7786 94.3886 61.7375 94.3944 61.7311L94.3937 61.7316L92.1721 59.445C91.7953 59.4758 91.4126 59.5137 91.0249 59.5592ZM84.5612 58.0526L85.558 55.7957C84.0247 55.1186 82.5747 53.7347 81.2445 51.7014C79.9226 49.6809 78.8079 47.154 77.893 44.4121C76.0625 38.926 75.1239 32.8599 74.8275 28.9732L70.8391 29.2773C71.1539 33.4062 72.1403 39.8088 74.0987 45.6782C75.0782 48.614 76.3239 51.4865 77.8972 53.8913C78.7052 55.1263 79.6237 56.2748 80.6674 57.2488C81.8918 57.6236 83.1886 57.8962 84.5612 58.0526ZM37.0977 57.8191C39.3767 55.6218 42.1546 52.3471 44.4721 48.3672C47.32 43.4765 49.5614 37.3661 49.163 30.7856L45.1703 31.0274C45.5053 36.5594 43.6217 41.8787 41.0154 46.3544C38.4096 50.8293 35.17 54.3061 33.0451 56.0954L34.7403 58.1085C35.5199 58.0582 36.3073 57.9636 37.0977 57.8191ZM28.8021 57.6835C28.5003 57.6218 28.2023 57.5547 27.9085 57.4826L25.456 55.4633C27.6446 52.8053 32.3333 44.4568 32.3333 33.5784H36.3333C36.3333 45.13 31.5553 54.1511 28.8021 57.6835ZM85.9748 46.8988C84.7324 42.0397 83.9856 36.4914 83.674 32.8587L87.6593 32.5168C87.9589 36.0091 88.6787 41.3264 89.8502 45.9079C90.4379 48.2067 91.1174 50.2314 91.8704 51.7275C92.6846 53.3455 93.3407 53.8521 93.6162 53.9413L92.3838 57.7467C90.4593 57.1234 89.1751 55.2698 88.2973 53.5257C87.3583 51.6597 86.594 49.3204 85.9748 46.8988ZM26.958 66.4036C26.4973 63.8996 25.7154 61.5397 25.1506 60.1679L28.8494 58.6451C29.5068 60.242 30.3749 62.8696 30.892 65.6797C31.397 68.4244 31.6306 71.6663 30.7251 74.3055L26.9416 73.0075C27.5028 71.3717 27.4308 68.9729 26.958 66.4036Z" fill="#29313A"/>
<path d="M19.2593 96.7407C19.2593 90.4405 24.3665 85.3333 30.6667 85.3333V85.3333C36.9668 85.3333 42.0741 90.4405 42.0741 96.7407V97.9999H19.2593V96.7407Z" fill="#29313A"/>
<path d="M48.5927 96.7407C48.5927 90.4405 53.6999 85.3333 60.0001 85.3333V85.3333C66.3002 85.3333 71.4075 90.4405 71.4075 96.7407V97.9999H48.5927V96.7407Z" fill="#29313A"/>
<path d="M77.9259 96.7407C77.9259 90.4405 83.0332 85.3333 89.3333 85.3333V85.3333C95.6334 85.3333 100.741 90.4405 100.741 96.7407V97.9999H77.9259V96.7407Z" fill="#29313A"/>
</svg>
