<svg viewBox="0 0 120 120" fill="none" xmlns="http://www.w3.org/2000/svg">
<path fill-rule="evenodd" clip-rule="evenodd" d="M23 55.2952V29.3219C23 24.718 26.7353 20.9827 31.3392 21.0001H57.2951C60.2486 21.0001 63.0805 22.1641 65.1653 24.2489L95.7425 54.8261C100.086 59.1694 100.086 66.2057 95.7425 70.549L72.549 93.7425C68.2056 98.0858 61.1694 98.0858 56.826 93.7425L26.2488 63.1653C24.164 61.0805 23 58.2486 23 55.2952ZM46.3894 36.5097C45.3468 35.4671 43.9327 34.8814 42.4582 34.8814C40.9838 34.8814 39.5697 35.4671 38.5271 36.5097C37.4845 37.5524 36.8987 38.9664 36.8987 40.4409C36.8987 41.9154 37.4845 43.3294 38.5271 44.372C39.5697 45.4147 40.9838 46.0004 42.4582 46.0004C43.9327 46.0004 45.3468 45.4147 46.3894 44.372C47.432 43.3294 48.0177 41.9154 48.0177 40.4409C48.0177 38.9664 47.432 37.5524 46.3894 36.5097ZM49.8523 53.4935C47.9205 53.4935 46.3499 54.9569 46.3499 56.7567V69.8094C46.3499 71.6093 47.9205 73.0726 49.8523 73.0726H60.3598H62.9866H63.8623H77.8722C79.804 73.0726 81.3747 71.6093 81.3747 69.8094V56.7567C81.3747 54.9569 79.804 53.4935 77.8722 53.4935H63.8623H62.9866H60.3598H49.8523ZM63.8623 69.8094V56.7567H77.8722V69.8094H63.8623ZM55.1061 58.5922C55.5384 58.5922 55.9324 58.8319 56.1075 59.199L59.61 66.5411C59.8508 67.0561 59.6046 67.6629 59.0518 67.8872C58.4991 68.1115 57.8533 67.8821 57.607 67.3671L57.12 66.3423H53.0921L52.6051 67.3671C52.3588 67.8821 51.713 68.1166 51.1603 67.8872C50.6076 67.6578 50.3558 67.0561 50.6021 66.5411L54.1046 59.199C54.2797 58.8319 54.6737 58.5922 55.1061 58.5922ZM56.1459 64.3028L55.1061 62.1206L54.0663 64.3028H56.1459ZM71.9617 59.612C71.9617 59.0511 71.4692 58.5922 70.8672 58.5922V58.5871C70.2652 58.5871 69.7727 59.046 69.7727 59.6069V59.8108H66.9269C66.3249 59.8108 65.8324 60.2697 65.8324 60.8306C65.8324 61.3914 66.3249 61.8503 66.9269 61.8503H70.8672H72.7936C72.3941 62.7018 71.8413 63.4768 71.1627 64.1447L71.1354 64.1193L70.3364 63.3748C69.9095 62.9771 69.2145 62.9771 68.7876 63.3748C68.3608 63.7725 68.3608 64.4201 68.7876 64.8178L69.4553 65.4398C69.1324 65.6285 68.7931 65.7916 68.4428 65.9395L68.2458 66.0211C67.6931 66.2505 67.4414 66.8522 67.6876 67.3671C67.9339 67.8821 68.5797 68.1166 69.1324 67.8872L69.3294 67.8056C69.9916 67.5303 70.61 67.1989 71.1901 66.8165C71.4254 66.9694 71.6607 67.1122 71.907 67.2499L72.9413 67.826C73.4558 68.1115 74.1344 67.9535 74.4408 67.4742C74.7473 66.9949 74.5831 66.3678 74.0632 66.0772L73.0289 65.501C72.9796 65.4755 72.9304 65.45 72.8811 65.4194C73.8224 64.4609 74.5612 63.329 75.0483 62.0849L75.1359 61.8554H75.2453C75.8473 61.8554 76.3398 61.3965 76.3398 60.8357C76.3398 60.2748 75.8473 59.8159 75.2453 59.8159H74.3697H71.9617V59.612Z" fill="#29313A"/>
</svg>
