<svg viewBox="0 0 120 120" fill="none" xmlns="http://www.w3.org/2000/svg">
<path fill-rule="evenodd" clip-rule="evenodd" d="M20.9071 41.8826L44.396 32L69.0306 41.8826L44.396 51.7653L20.9071 41.8826ZM45 52.7899L70 42.7607V52.0495C69.3607 51.8867 68.6906 51.8 68 51.8C63.5817 51.8 60 55.3459 60 59.72C60 64.0941 63.5817 67.64 68 67.64C68.6906 67.64 69.3607 67.5534 70 67.3905V75.9708L45 86V52.7899ZM43.7805 85.9834V52.7827L20 42.7774V75.978L43.7805 85.9834Z" fill="#29313A"/>
<path fill-rule="evenodd" clip-rule="evenodd" d="M102 59.72L90 67.64V62.0063H71.2664C70.5419 63.019 69.3489 63.68 68 63.68C65.7909 63.68 64 61.9071 64 59.72C64 57.533 65.7909 55.76 68 55.76C69.3489 55.76 70.5418 56.421 71.2664 57.4337H90V51.8L102 59.72Z" fill="#29313A"/>
</svg>
