<svg viewBox="0 0 120 120" fill="none" xmlns="http://www.w3.org/2000/svg">
<path d="M61.1433 40.3408L57.8872 52.3892L61.6206 53.381C58.3746 55.2391 55.302 62.6596 54.1715 66.1377C55.0249 66.3644 57.5995 74.6051 58.7802 78.6971L61.7813 67.5925C57.4099 64.731 61.3628 60.6803 64.1724 60.86C68.6867 63.1927 65.6576 68.0556 62.3146 67.7342C61.4618 71.286 59.6677 78.4795 59.3135 78.8388C61.9488 76.1384 67.8098 70.6676 70.1719 70.3883C72.1992 64.5792 70.6492 58.0465 69.6208 55.5063L73.8876 56.6398L74.9801 52.5974C68.4331 51.3524 63.1366 46.5832 61.1433 40.3408Z" fill="#29313A"/>
<path d="M39.8473 72.7641C40.7233 74.8252 38.8367 78.0979 35.2524 80.4774C31.2829 83.1124 26.734 83.6539 25.0924 81.6868C23.4508 79.7196 25.3381 75.9887 29.3077 73.3535C32.2245 71.4173 35.454 70.6115 37.613 71.1006L33.5665 36.5423L35.5788 36.3107C36.327 42.7 38.5956 44.6573 39.6364 44.8373C54.9938 50.9606 52.174 64.5999 48.8205 70.7102L47.7844 70.8803C54.088 55.0455 43.313 50.11 37.1375 49.6217L39.8473 72.7641Z" fill="#29313A"/>
<path d="M49.9711 88.0833L42.8983 90.7294C38.4469 88.4005 33.2169 89.729 30.7728 93.7331C30.5377 94.1181 30.3849 94.5321 30.2248 94.9657C29.6728 96.4611 29.035 98.189 24.6384 99.7609C27.1953 102.207 32.1537 105.294 36.3597 106.411C37.7257 106.773 39.1503 106.846 40.526 106.625C41.9016 106.404 43.1924 105.894 44.3007 105.134C45.4091 104.374 46.306 103.384 46.9238 102.238C47.5416 101.093 47.8642 99.8221 47.8671 98.5217L53.9459 94.3193C54.1828 94.1556 54.3433 93.915 54.3975 93.6429L82.2719 77.7098L79.1726 72.8473L50.8443 88.0698C50.5569 87.9757 50.2464 87.9805 49.9711 88.0833Z" fill="#29313A"/>
<path fill-rule="evenodd" clip-rule="evenodd" d="M82.9071 48.3982C92.8995 48.3982 101 40.3061 101 30.3241C101 20.3421 92.8995 12.25 82.9071 12.25C72.9147 12.25 64.8142 20.3421 64.8142 30.3241C64.8142 40.3061 72.9147 48.3982 82.9071 48.3982ZM84.7164 23.0945C84.7164 22.0963 83.9064 21.2871 82.9072 21.2871C81.9079 21.2871 81.0979 22.0963 81.0979 23.0945V28.5167H75.67C74.6707 28.5167 73.8607 29.3259 73.8607 30.3241C73.8607 31.3223 74.6707 32.1315 75.67 32.1315H81.0979V37.5537C81.0979 38.5519 81.9079 39.3612 82.9072 39.3612C83.9064 39.3612 84.7164 38.5519 84.7164 37.5537V32.1315H90.1443C91.1435 32.1315 91.9536 31.3223 91.9536 30.3241C91.9536 29.3259 91.1435 28.5167 90.1443 28.5167H84.7164V23.0945Z" fill="#29313A"/>
</svg>
