<svg viewBox="0 0 120 120" fill="none" xmlns="http://www.w3.org/2000/svg">
<path d="M44.4321 45.6769L59.6095 40.2942L75.5273 45.6769L59.6095 51.0596L44.4321 45.6769Z" fill="#29313A"/>
<path d="M59.9998 51.6177L76.1536 46.1552V64.2434L59.9998 69.706V51.6177Z" fill="#29313A"/>
<path d="M59.2118 51.6137V69.6969L43.8459 64.2474V46.1642L59.2118 51.6137Z" fill="#29313A"/>
<path fill-rule="evenodd" clip-rule="evenodd" d="M71.9999 25.2354L59.9999 34.4118L47.9999 25.2354L50.2805 22.135L58.0995 28.1143L58.0995 5L61.9004 5L61.9004 28.1143L69.7194 22.135L71.9999 25.2354Z" fill="#29313A"/>
<path d="M28.5 52.0588C30.9862 52.0588 33 54.1741 33 56.7857V61.5126V70.9664V75.7169C33 77.7259 33.7537 79.6521 35.1037 81.0701L40.8525 87.1087C41.7862 88.0896 43.2487 88.2432 44.34 87.4751C45.7912 86.4588 45.9937 84.2962 44.7562 83.0082L43.0462 81.2119L39.4462 77.4304C38.04 75.9533 38.04 73.5544 39.4462 72.0772C40.8525 70.6001 43.1363 70.6001 44.5425 72.0772L48.1425 75.8587L49.8525 77.655L52.6987 80.6447C55.0612 83.1263 56.3887 86.4942 56.3887 90.004V99.3278C56.3887 102.459 53.97 105 50.9887 105H43.4962C41.5837 105 39.75 104.208 38.4 102.79L27.1612 90.9848C25.1363 88.8577 24 85.9743 24 82.9609V70.9664V63.4034V56.7857C24 54.1741 26.0137 52.0588 28.5 52.0588ZM91.5 52.0588C93.9862 52.0588 96 54.1741 96 56.7857V63.4034V70.9664V82.9609C96 85.9743 94.8638 88.8577 92.8388 90.9848L81.6 102.79C80.25 104.208 78.4162 105 76.5037 105H69C66.0187 105 63.6 102.459 63.6 99.3278V90.004C63.6 86.4942 64.9275 83.1263 67.29 80.6447L70.1362 77.655L71.8462 75.8587L75.4462 72.0772C76.8525 70.6001 79.1362 70.6001 80.5425 72.0772C81.9487 73.5544 81.9487 75.9533 80.5425 77.4304L76.9425 81.2119L75.2325 83.0082C73.995 84.3081 74.1975 86.4588 75.6487 87.4751C76.74 88.2432 78.2025 88.0896 79.1362 87.1087L84.885 81.0701C86.235 79.6521 86.9888 77.7259 86.9888 75.7169V70.9664V61.5126V56.7857C86.9888 54.1741 89.0025 52.0588 91.4888 52.0588H91.5Z" fill="#29313A"/>
</svg>
