<svg viewBox="0 0 120 120" fill="none" xmlns="http://www.w3.org/2000/svg">
<path d="M12 51C12 49.8954 12.8954 49 14 49H26V59H28V49H32V61H34V49H46V59H48V49H52V61H54V49H66V59H68V49H72V61H74V49H86V59H88V49H92V61H94V49H106C107.105 49 108 49.8954 108 51V69H12V51Z" fill="#29313A"/>
</svg>
