<svg viewBox="0 0 120 120" fill="none" xmlns="http://www.w3.org/2000/svg">
<path fill-rule="evenodd" clip-rule="evenodd" d="M100 56.7242C100 70.3789 86.0552 81.4483 68.8534 81.4483C51.6517 81.4483 37.7069 70.3789 37.7069 56.7242C37.7069 43.0694 51.6517 32 68.8534 32C86.0552 32 100 43.0694 100 56.7242ZM40.1028 78.5638C39.998 78.5638 39.8948 78.5569 39.7935 78.5434C39.3822 79.2937 38.6018 79.8 37.7069 79.8C36.3837 79.8 35.311 78.6931 35.311 77.3276C35.311 76.8773 35.4277 76.4551 35.6315 76.0914C35.4277 75.7277 35.311 75.3055 35.311 74.8552C35.311 73.4897 36.3837 72.3828 37.7069 72.3828C38.0508 72.3828 38.3778 72.4576 38.6734 72.5922C38.9218 72.4584 39.2042 72.3828 39.5038 72.3828C40.3968 72.3828 41.1377 73.055 41.2771 73.9359C42.0062 74.3598 42.4987 75.1663 42.4987 76.0914C42.4987 77.4569 41.426 78.5638 40.1028 78.5638ZM33.0153 80.1752C33.2232 80.2426 33.4189 80.3613 33.5836 80.5313C34.0748 81.0382 34.124 81.8284 33.7312 82.392C33.9062 83.0389 33.7472 83.7619 33.2542 84.2707C32.5265 85.0217 31.3466 85.0217 30.6188 84.2707C30.5612 84.2112 30.5081 84.1488 30.4596 84.084C29.8336 84.2631 29.1345 84.0987 28.6424 83.5908C27.9146 82.8398 27.9146 81.6222 28.6424 80.8713C28.8824 80.6236 29.1715 80.4576 29.4775 80.3733C29.5592 80.0576 29.72 79.7592 29.96 79.5115C30.6878 78.7605 31.8676 78.7605 32.5954 79.5115C32.7845 79.7067 32.9245 79.9334 33.0153 80.1752ZM22.0255 87.3572C22.0671 87.4128 22.1126 87.4663 22.162 87.5172C22.7857 88.1609 23.7971 88.1609 24.4208 87.5172C24.8435 87.0811 24.9797 86.4614 24.8297 85.9069C25.1663 85.4238 25.1242 84.7465 24.7032 84.3121C24.562 84.1664 24.3943 84.0646 24.2161 84.0069C24.1382 83.7996 24.0182 83.6053 23.8561 83.438C23.2324 82.7943 22.221 82.7943 21.5973 83.438C21.3915 83.6502 21.2537 83.906 21.1836 84.1766C20.9214 84.2489 20.6735 84.3912 20.4678 84.6035C19.8441 85.2472 19.8441 86.2908 20.4678 86.9345C20.8897 87.3698 21.4889 87.5107 22.0255 87.3572ZM55.6 47.375C53.6144 47.375 52 48.8885 52 50.75V64.25C52 66.1115 53.6144 67.625 55.6 67.625H66.4H69.1H70H84.4C86.3856 67.625 88 66.1115 88 64.25V50.75C88 48.8885 86.3856 47.375 84.4 47.375H70H69.1H66.4H55.6ZM70 64.25V50.75H84.4V64.25H70ZM61 52.6484C61.4444 52.6484 61.8494 52.8963 62.0294 53.276L65.6294 60.8697C65.8769 61.4023 65.6237 62.0299 65.0556 62.2619C64.4875 62.4939 63.8237 62.2566 63.5706 61.724L63.07 60.6641H58.93L58.4294 61.724C58.1763 62.2566 57.5125 62.4992 56.9444 62.2619C56.3763 62.0246 56.1175 61.4023 56.3706 60.8697L59.9706 53.276C60.1506 52.8963 60.5556 52.6484 61 52.6484ZM62.0687 58.5547L61 56.2977L59.9313 58.5547H62.0687ZM78.325 53.7031C78.325 53.123 77.8187 52.6484 77.2 52.6484V52.6432C76.5812 52.6432 76.075 53.1178 76.075 53.6979V53.9088H73.15C72.5312 53.9088 72.025 54.3834 72.025 54.9635C72.025 55.5436 72.5312 56.0182 73.15 56.0182H77.2H79.18C78.7694 56.8988 78.2012 57.7004 77.5037 58.3912L77.4756 58.3648L76.6544 57.5949C76.2156 57.1836 75.5013 57.1836 75.0625 57.5949C74.6237 58.0062 74.6237 58.676 75.0625 59.0873L75.7487 59.7307C75.4169 59.9258 75.0681 60.0945 74.7081 60.2475L74.5056 60.3318C73.9375 60.5691 73.6787 61.1914 73.9319 61.724C74.185 62.2566 74.8487 62.4992 75.4169 62.2619L75.6194 62.1775C76.3 61.8928 76.9356 61.55 77.5319 61.1545C77.7738 61.3127 78.0156 61.4604 78.2687 61.6027L79.3319 62.1986C79.8606 62.4939 80.5581 62.3305 80.8731 61.8348C81.1881 61.3391 81.0194 60.6904 80.485 60.3898L79.4219 59.7939C79.3713 59.7676 79.3206 59.7412 79.27 59.7096C80.2375 58.7182 80.9969 57.5475 81.4975 56.2607L81.5875 56.0234H81.7C82.3187 56.0234 82.825 55.5488 82.825 54.9688C82.825 54.3887 82.3187 53.9141 81.7 53.9141H80.8H78.325V53.7031Z" fill="#29313A"/>
</svg>
