<svg viewBox="0 0 120 120" fill="none" xmlns="http://www.w3.org/2000/svg">
<path d="M48.9211 56.5697C49.6958 58.3943 48.0274 61.2915 44.8577 63.3978C41.3474 65.7305 37.3247 66.2099 35.873 64.4685C34.4213 62.727 36.0903 59.4243 39.6007 57.0915C42.1801 55.3775 45.036 54.6641 46.9453 55.0971L43.3669 24.5045L45.1464 24.2995C45.808 29.9556 47.8142 31.6883 48.7346 31.8476C62.3156 37.2683 59.822 49.3424 56.8563 54.7515L55.9401 54.9021C61.5146 40.8844 51.9859 36.5153 46.5247 36.083L48.9211 56.5697Z" fill="#29313A"/>
<g clip-path="url(#clip0_1045_1550)">
<path d="M57.8739 70.1309L51.6192 72.4733C47.6827 70.4117 43.0577 71.5877 40.8963 75.1324C39.9712 76.6488 40.4867 78.6735 35.4715 80.4685C37.7327 82.6341 42.1175 85.3667 45.837 86.3558C47.0449 86.6761 48.3048 86.7407 49.5213 86.5447C50.7378 86.3488 51.8793 85.8974 52.8594 85.2247C53.8395 84.552 54.6327 83.6756 55.1791 82.6616C55.7254 81.6476 56.0107 80.5226 56.0132 79.3715L61.3888 75.6513C61.5983 75.5064 61.7403 75.2934 61.7882 75.0525L86.4382 60.9479L83.6974 56.6434L58.6461 70.119C58.3919 70.0356 58.1174 70.0399 57.8739 70.1309Z" fill="#29313A"/>
</g>
<path d="M75.7379 54.4666C77.5307 49.3241 76.16 43.5411 75.2506 41.2923L79.0238 42.2958L84.8372 20.7628L70.6876 16.9999L66.7699 31.5113L64.8742 38.5329L68.1758 39.4109C65.3052 41.0558 62.5881 47.6248 61.5884 50.7037C62.343 50.9044 64.6198 58.1994 65.6639 61.8219L68.3179 51.9916C64.4521 49.4584 67.9478 45.8726 70.4325 46.0316C74.4246 48.0967 71.7458 52.4015 68.7895 52.117C68.0354 55.2613 66.4488 61.6293 66.1356 61.9473C68.466 59.5568 73.6491 54.7138 75.7379 54.4666Z" fill="#29313A"/>
<defs>
<clipPath id="clip0_1045_1550">
<rect width="47.9059" height="43.9329" fill="white" transform="matrix(0.966411 0.257003 -0.260646 0.965434 44.7034 46.2734)"/>
</clipPath>
</defs>
</svg>
