<svg viewBox="0 0 120 120" fill="none" xmlns="http://www.w3.org/2000/svg">
<g clip-path="url(#clip0_1047_1667)">
<path d="M91.0156 59.4423C91.0468 76.2554 77.3353 90.0037 60.5221 90.0155C53.2605 90.0207 46.5904 87.4894 41.3487 83.2589C39.9857 82.1588 39.8839 80.1161 41.1225 78.8775L42.5088 77.4912C43.5681 76.4319 45.2593 76.316 46.4329 77.2471C50.2947 80.3115 55.182 82.1406 60.5 82.1406C73.0145 82.1406 83.1406 72.0125 83.1406 59.5C83.1406 46.9855 73.0125 36.8594 60.5 36.8594C54.4936 36.8594 49.0383 39.1935 44.9877 43.0034L51.2328 49.2485C52.4732 50.4888 51.5947 52.6094 49.8408 52.6094H31.9531C30.8658 52.6094 29.9844 51.728 29.9844 50.6406V32.7529C29.9844 30.999 32.105 30.1206 33.3453 31.3608L39.4203 37.4358C44.8988 32.2003 52.3238 28.9844 60.5 28.9844C77.334 28.9844 90.9845 42.6155 91.0156 59.4423ZM68.755 69.1364L69.9637 67.5823C70.965 66.2949 70.7331 64.4395 69.4456 63.4382L64.4375 59.5429V46.7031C64.4375 45.0721 63.1154 43.75 61.4844 43.75H59.5156C57.8846 43.75 56.5625 45.0721 56.5625 46.7031V63.3946L64.6109 69.6544C65.8983 70.6557 67.7536 70.4239 68.755 69.1364Z" fill="#29313A"/>
</g>
<defs>
<clipPath id="clip0_1047_1667">
<rect width="63" height="63" fill="white" transform="translate(29 28)"/>
</clipPath>
</defs>
</svg>
