<svg viewBox="0 0 120 120" fill="none" xmlns="http://www.w3.org/2000/svg">
<path d="M100 56.7242C100 70.3789 86.0552 81.4483 68.8534 81.4483C51.6517 81.4483 37.7069 70.3789 37.7069 56.7242C37.7069 43.0694 51.6517 32 68.8534 32C86.0552 32 100 43.0694 100 56.7242Z" fill="#29313A"/>
<path d="M40.1028 78.5638C39.998 78.5638 39.8948 78.5569 39.7935 78.5434C39.3822 79.2937 38.6018 79.8 37.7069 79.8C36.3837 79.8 35.311 78.6931 35.311 77.3276C35.311 76.8773 35.4277 76.4551 35.6315 76.0914C35.4277 75.7277 35.311 75.3055 35.311 74.8552C35.311 73.4897 36.3837 72.3828 37.7069 72.3828C38.0508 72.3828 38.3778 72.4576 38.6734 72.5922C38.9218 72.4584 39.2042 72.3828 39.5038 72.3828C40.3968 72.3828 41.1377 73.055 41.2771 73.9359C42.0062 74.3598 42.4987 75.1663 42.4987 76.0914C42.4987 77.4569 41.426 78.5638 40.1028 78.5638Z" fill="#29313A"/>
<path d="M33.0153 80.1752C33.2232 80.2426 33.4189 80.3613 33.5836 80.5313C34.0748 81.0382 34.124 81.8284 33.7312 82.392C33.9062 83.0389 33.7472 83.7619 33.2542 84.2707C32.5265 85.0217 31.3466 85.0217 30.6188 84.2707C30.5612 84.2112 30.5081 84.1488 30.4596 84.084C29.8336 84.2631 29.1345 84.0987 28.6423 83.5908C27.9146 82.8398 27.9146 81.6223 28.6423 80.8713C28.8824 80.6236 29.1715 80.4576 29.4775 80.3733C29.5592 80.0576 29.72 79.7592 29.96 79.5115C30.6878 78.7605 31.8676 78.7605 32.5954 79.5115C32.7845 79.7067 32.9245 79.9334 33.0153 80.1752Z" fill="#29313A"/>
<path d="M22.0255 87.3572C22.0671 87.4128 22.1126 87.4663 22.162 87.5172C22.7857 88.1609 23.7971 88.1609 24.4208 87.5172C24.8435 87.0811 24.9797 86.4614 24.8297 85.9069C25.1663 85.4238 25.1242 84.7465 24.7032 84.3121C24.562 84.1664 24.3943 84.0646 24.2161 84.0069C24.1382 83.7996 24.0182 83.6053 23.8561 83.438C23.2324 82.7943 22.221 82.7943 21.5973 83.438C21.3915 83.6502 21.2537 83.906 21.1836 84.1766C20.9214 84.2489 20.6735 84.3912 20.4678 84.6035C19.8441 85.2472 19.8441 86.2908 20.4678 86.9345C20.8897 87.3698 21.4889 87.5107 22.0255 87.3572Z" fill="#29313A"/>
</svg>
