<svg viewBox="0 0 120 120" fill="none" xmlns="http://www.w3.org/2000/svg">
<ellipse cx="60" cy="31.3445" rx="12" ry="11.3445" fill="#29313A"/>
<path fill-rule="evenodd" clip-rule="evenodd" d="M36 65.3781V63.5397C36 63.5108 36.0234 63.4874 36.0523 63.4874V63.4874C36.0791 63.4874 36.1015 63.4672 36.1044 63.4406C36.3275 61.3737 36.9069 59.3436 37.8269 57.4189C39.033 54.8955 40.8008 52.6027 43.0294 50.6714C45.258 48.7401 47.9038 47.2081 50.8156 46.1629C53.7274 45.1177 56.8483 44.5797 60 44.5797C63.1517 44.5797 66.2726 45.1177 69.1844 46.1629C72.0962 47.2081 74.742 48.7401 76.9706 50.6714C79.1992 52.6027 80.967 54.8955 82.1731 57.4189C83.0931 59.3436 83.6725 61.3737 83.8956 63.4406C83.8985 63.4672 83.9209 63.4874 83.9477 63.4874V63.4874C83.9766 63.4874 84 63.5108 84 63.5397V65.3781V65.3781C84 69.5551 80.6139 72.9412 76.4368 72.9412H43.5632C39.3861 72.9412 36 69.5551 36 65.3781V65.3781Z" fill="#29313A"/>
<path fill-rule="evenodd" clip-rule="evenodd" d="M60.9064 79.9358L55.635 98.4935C55.089 100.416 51.7577 100.531 51.0112 98.6532L47.3066 89.3376H37.44C36.6447 89.3376 36 88.8162 36 88.1731C36 87.5299 36.6447 87.0085 37.44 87.0085H47.6564C48.6988 87.0085 49.6221 87.5527 49.9412 88.3552L53.2187 96.5969L58.5077 77.977C59.06 76.0328 62.4444 75.9463 63.1473 77.8585L68.4051 92.1616L70.8368 88.5946C71.259 87.9754 72.0642 87.5908 72.9386 87.5908H82.56C83.3553 87.5908 84 88.1122 84 88.7554C84 89.3985 83.3553 89.9199 82.56 89.9199H73.2221L70.3735 94.0983C69.3454 95.6065 66.5781 95.3651 65.9713 93.7143L60.9064 79.9358Z" fill="#29313A"/>
</svg>
