<svg viewBox="0 0 120 120" fill="none" xmlns="http://www.w3.org/2000/svg">
<path d="M86.997 60.4094C86.999 60.2732 87 60.1367 87 60C87 45.0883 74.9117 33 60 33C45.0883 33 33 45.0883 33 60C33 74.9117 45.0883 87 60 87C70.5889 87 79.7541 80.9045 84.1781 72.0309C80.3731 79.0674 73.1052 83.8235 64.7647 83.8235C52.4845 83.8235 42.5294 73.5129 42.5294 60.7941C42.5294 48.0753 52.4845 37.7647 64.7647 37.7647C76.9209 37.7647 86.7986 47.868 86.997 60.4094Z" fill="#29313A"/>
</svg>
