<svg viewBox="0 0 120 120" fill="none" xmlns="http://www.w3.org/2000/svg">
<path d="M20 44.3333C20 40.2885 23.5875 37 28 37H52H58H60H92C96.4125 37 100 40.2885 100 44.3333V73.6667C100 77.7115 96.4125 81 92 81H60H58H52H28C23.5875 81 20 77.7115 20 73.6667V44.3333ZM60 44.3333V73.6667H92V44.3333H60ZM42.2875 49.8219C41.8875 48.9969 40.9875 48.4583 40 48.4583C39.0125 48.4583 38.1125 48.9969 37.7125 49.8219L29.7125 66.3219C29.15 67.4792 29.725 68.8312 30.9875 69.3469C32.25 69.8625 33.725 69.3354 34.2875 68.1781L35.4 65.875H44.6L45.7125 68.1781C46.275 69.3354 47.75 69.851 49.0125 69.3469C50.275 68.8427 50.8375 67.4792 50.2875 66.3219L42.2875 49.8219ZM40 56.3875L42.375 61.2917H37.625L40 56.3875ZM76 48.4583C77.375 48.4583 78.5 49.4896 78.5 50.75V51.2083H84H86C87.375 51.2083 88.5 52.2396 88.5 53.5C88.5 54.7604 87.375 55.7917 86 55.7917H85.75L85.55 56.3073C84.4375 59.1031 82.75 61.6469 80.6 63.801C80.7125 63.8698 80.825 63.9271 80.9375 63.9844L83.3 65.2792C84.4875 65.9323 84.8625 67.3417 84.1625 68.4188C83.4625 69.4958 81.9125 69.851 80.7375 69.2094L78.375 67.9146C77.8125 67.6052 77.275 67.2844 76.7375 66.9406C75.4125 67.8 74 68.5448 72.4875 69.1635L72.0375 69.3469C70.775 69.8625 69.3 69.3354 68.7375 68.1781C68.175 67.0208 68.75 65.6688 70.0125 65.1531L70.4625 64.9698C71.2625 64.6375 72.0375 64.2708 72.775 63.8469L71.25 62.449C70.275 61.5552 70.275 60.1 71.25 59.2062C72.225 58.3125 73.8125 58.3125 74.7875 59.2062L76.6125 60.8792L76.675 60.9365C78.225 59.4354 79.4875 57.6937 80.4 55.7802H76H67C65.625 55.7802 64.5 54.749 64.5 53.4885C64.5 52.2281 65.625 51.1969 67 51.1969H73.5V50.7385C73.5 49.4781 74.625 48.4469 76 48.4469V48.4583Z" fill="#29313A"/>
</svg>
