<svg viewBox="0 0 120 120" fill="none" xmlns="http://www.w3.org/2000/svg">
<ellipse cx="60" cy="39.5714" rx="14" ry="14.5714" fill="#29313A"/>
<path fill-rule="evenodd" clip-rule="evenodd" d="M32 83.2857V80.9179C32 80.8843 32.0272 80.8571 32.0607 80.8571V80.8571C32.092 80.8571 32.1182 80.8333 32.1213 80.8022C32.3812 78.1455 33.0574 75.5363 34.1314 73.0626C35.5385 69.8215 37.601 66.8765 40.201 64.3958C42.801 61.9152 45.8877 59.9474 49.2849 58.6049C52.682 57.2624 56.323 56.5714 60 56.5714C63.677 56.5714 67.318 57.2624 70.7151 58.6049C74.1123 59.9474 77.1989 61.9152 79.799 64.3958C82.399 66.8765 84.4615 69.8215 85.8686 73.0626C86.9426 75.5363 87.6188 78.1455 87.8787 80.8022C87.8818 80.8333 87.908 80.8571 87.9393 80.8571V80.8571C87.9728 80.8571 88 80.8843 88 80.9179V83.2857V83.2857C88 88.6507 83.6508 93 78.2857 93H41.7143C36.3492 93 32 88.6507 32 83.2857V83.2857Z" fill="#29313A"/>
</svg>
