<svg focusable="false" aria-hidden="true" viewBox="0 0 24 24" fill="black"
  xmlns='http://www.w3.org/2000/svg' width="24px" heigh="24px">
  <path d="M6 17h3l2-4V7H5v6h3zm8 0h3l2-4V7h-6v6h3z" />
</svg>
