<svg focusable="false" aria-hidden="true" viewBox="0 0 24 24" fill="black"
  xmlns='http://www.w3.org/2000/svg' width="24px" heigh="24px">
  <g>
    <path d="M2.24,4.21c.11-.23,.36-.36,.61-.33l9.15,1.14,9.15-1.14c.25-.03,.5,.1,.61,.33l1.56,3.12c.34,.67-.02,1.48-.74,1.69l-6.11,1.75c-.52,.15-1.08-.07-1.35-.53l-3.12-5.19-3.12,5.19c-.28,.46-.83,.68-1.35,.53l-6.1-1.75c-.72-.21-1.08-1.02-.74-1.69l1.55-3.12Z" strokeLinejoin="round" />
    <path d="M20.78,10.76v5.48c0,.77-.51,1.45-1.25,1.64l-7,1.8c-.35,.09-.72,.09-1.06,0l-7-1.8c-.73-.19-1.25-.87-1.25-1.64v-5.48l-.78-.22v6.24c0,.82,.56,1.54,1.36,1.75l7.63,1.91c.38,.1,.78,.1,1.16,0l7.63-1.91c.8-.2,1.36-.92,1.36-1.74v-6.24l-.78,.22Z"/>
    <line x1="12.07" y1="19.6" x2="12.07" y2="9.54" strokeLinecap="round" strokeLinejoin="round"/>
  </g>
</svg>
