<svg focusable="false" aria-hidden="true" viewBox="0 0 24 24" fill="black"
  xmlns='http://www.w3.org/2000/svg' width="24px" heigh="24px">
  <path d="M1.76,3.63c.12-.24,.38-.38,.64-.34l9.59,1.2,9.59-1.2c.26-.03,.52,.11,.64,.34l1.63,3.27c.35,.7-.02,1.55-.78,1.77l-6.4,1.83c-.54,.16-1.13-.07-1.42-.56l-3.27-5.45-3.27,5.45c-.29,.49-.87,.72-1.42,.56L.91,8.66c-.76-.22-1.13-1.07-.78-1.77L1.76,3.63Zm10.28,3.37l2.15,3.58c.58,.97,1.75,1.43,2.84,1.12l5-1.43v6.55c0,.86-.59,1.61-1.43,1.83l-8,2c-.4,.1-.82,.1-1.22,0l-8-2c-.84-.22-1.43-.97-1.43-1.83v-6.55l5,1.43c1.09,.31,2.26-.15,2.84-1.12l2.15-3.58h.09Z" />
</svg>
