{
    "odata.metadata": "http://crm-sod.superoffice.com/Playground/api/v1/Archive/$metadata",
    "odata.nextLink": null,
    "value": [
        {
            "PrimaryKey": "1",
            "EntityName": "document",
            "visibleFor": "All",
            "documentId": 1,
            "type": "Brev",
            "date": "2002-01-01T00:00:00",
            "associateId": "AA",
            "contactId": 4,
            "personId": 22,
            "projectId": 47,
            "saleId": 0,
            "userGroup": "Administrasjon",
            "keywords": "",
            "ourref": "Var raf",
            "yourref": "Daras raf",
            "attention": "Arjan Abelsen",
            "subject": "ABrevAAA",
            "snum": 0,
            "suggestedDocumentId": 0,
            "registeredBy": "AA",
            "registeredDate": "2002-07-30T10:35:23",
            "completed": false,
            "icon": "Document",
            "text": "ABrevAAA",
            "time": "2002-01-01T00:00:00",
            "isReport": false,
            "isMail": false,
            "mailMergeDraft": false,
            "updatedBy": "AA",
            "updatedDate": "2002-07-30T10:35:23",
            "recordType": "Document",
            "who": ""
        },
        {
            "PrimaryKey": "4",
            "EntityName": "document",
            "visibleFor": "All",
            "documentId": 4,
            "type": "Faks",
            "date": "2002-06-30T00:00:00",
            "associateId": "AA",
            "contactId": 4,
            "personId": 0,
            "projectId": 44,
            "saleId": 0,
            "userGroup": "Administrasjon",
            "keywords": "",
            "ourref": "10/10013",
            "yourref": "",
            "attention": "",
            "subject": "PFaksPAA",
            "snum": 0,
            "suggestedDocumentId": 0,
            "registeredBy": "AA",
            "registeredDate": "2002-07-30T10:46:52",
            "completed": true,
            "icon": "Document",
            "text": "PFaksPAA",
            "time": "2002-06-30T00:00:00",
            "isReport": false,
            "isMail": false,
            "mailMergeDraft": true,
            "updatedBy": "AA",
            "updatedDate": "2002-07-30T10:46:52",
            "recordType": "Fax",
            "who": ""
        },
        {
            "PrimaryKey": "5",
            "EntityName": "document",
            "visibleFor": "All",
            "documentId": 5,
            "type": "E-post",
            "date": "2002-01-01T00:00:00",
            "associateId": "AA",
            "contactId": 68,
            "personId": 0,
            "projectId": 0,
            "saleId": 0,
            "userGroup": "Administrasjon",
            "keywords": "",
            "ourref": "10/10014",
            "yourref": "",
            "attention": "",
            "subject": "UE-postUAA",
            "snum": 0,
            "suggestedDocumentId": 0,
            "registeredBy": "AA",
            "registeredDate": "2002-07-30T10:48:58",
            "completed": true,
            "icon": "Email",
            "text": "UE-postUAA",
            "time": "2002-01-01T00:00:00",
            "isReport": false,
            "isMail": true,
            "mailMergeDraft": false,
            "updatedBy": "AA",
            "updatedDate": "2002-07-30T10:48:58",
            "recordType": "Email",
            "who": ""
        },
        {
            "PrimaryKey": "8",
            "EntityName": "document",
            "visibleFor": "All",
            "documentId": 8,
            "type": "Brev",
            "date": "2002-10-09T00:00:00",
            "associateId": "AA",
            "contactId": 2,
            "personId": 0,
            "projectId": 0,
            "saleId": 0,
            "userGroup": "Administrasjon",
            "keywords": "",
            "ourref": "10/10017",
            "yourref": "",
            "attention": "",
            "subject": "=Brev=AA",
            "snum": 0,
            "suggestedDocumentId": 0,
            "registeredBy": "AA",
            "registeredDate": "2002-07-30T10:56:37",
            "completed": true,
            "icon": "Document",
            "text": "=Brev=AA",
            "time": "2002-10-09T00:00:00",
            "isReport": false,
            "isMail": false,
            "mailMergeDraft": true,
            "updatedBy": "AA",
            "updatedDate": "2002-07-30T10:56:37",
            "recordType": "Document",
            "who": ""
        },
        {
            "PrimaryKey": "10",
            "EntityName": "document",
            "visibleFor": "All",
            "documentId": 10,
            "type": "Notat",
            "date": "2002-10-09T00:00:00",
            "associateId": "AA",
            "contactId": 2,
            "personId": 0,
            "projectId": 0,
            "saleId": 0,
            "userGroup": "Administrasjon",
            "keywords": "",
            "ourref": "10/10019",
            "yourref": "",
            "attention": "",
            "subject": "4Notat4AA",
            "snum": 0,
            "suggestedDocumentId": 0,
            "registeredBy": "AA",
            "registeredDate": "2002-07-30T10:59:05",
            "completed": false,
            "icon": "Document",
            "text": "4Notat4AA",
            "time": "2002-10-09T00:00:00",
            "isReport": false,
            "isMail": false,
            "mailMergeDraft": true,
            "updatedBy": "AA",
            "updatedDate": "2002-07-30T10:59:05",
            "recordType": "Document",
            "who": ""
        },
        {
            "PrimaryKey": "11",
            "EntityName": "document",
            "visibleFor": "All",
            "documentId": 11,
            "type": "Notat",
            "date": "2002-10-09T00:00:00",
            "associateId": "AA",
            "contactId": 2,
            "personId": 0,
            "projectId": 0,
            "saleId": 0,
            "userGroup": "Administrasjon",
            "keywords": "",
            "ourref": "10/10020",
            "yourref": "",
            "attention": "",
            "subject": "9Notat9AA",
            "snum": 0,
            "suggestedDocumentId": 0,
            "registeredBy": "AA",
            "registeredDate": "2002-07-30T11:00:12",
            "completed": false,
            "icon": "Document",
            "text": "9Notat9AA",
            "time": "2002-10-09T00:00:00",
            "isReport": false,
            "isMail": false,
            "mailMergeDraft": false,
            "updatedBy": "AA",
            "updatedDate": "2002-07-30T11:00:12",
            "recordType": "Document",
            "who": ""
        },
        {
            "PrimaryKey": "12",
            "EntityName": "document",
            "visibleFor": "All",
            "documentId": 12,
            "type": "Brev",
            "date": "2002-01-01T00:00:00",
            "associateId": "BB",
            "contactId": 51,
            "personId": 0,
            "projectId": 44,
            "saleId": 0,
            "userGroup": "Salg",
            "keywords": "",
            "ourref": "11/10021",
            "yourref": "",
            "attention": "",
            "subject": "BBrevBBB",
            "snum": 0,
            "suggestedDocumentId": 0,
            "registeredBy": "BB",
            "registeredDate": "2002-07-30T11:03:28",
            "completed": true,
            "icon": "Document",
            "text": "BBrevBBB",
            "time": "2002-01-01T00:00:00",
            "isReport": false,
            "isMail": false,
            "mailMergeDraft": false,
            "updatedBy": "BB",
            "updatedDate": "2002-07-30T11:03:28",
            "recordType": "Document",
            "who": ""
        },
        {
            "PrimaryKey": "13",
            "EntityName": "document",
            "visibleFor": "All",
            "documentId": 13,
            "type": "Brev",
            "date": "2002-07-01T00:00:00",
            "associateId": "BB",
            "contactId": 4,
            "personId": 0,
            "projectId": 47,
            "saleId": 0,
            "userGroup": "Salg",
            "keywords": "",
            "ourref": "11/10022",
            "yourref": "",
            "attention": "",
            "subject": "GBrevGBB",
            "snum": 0,
            "suggestedDocumentId": 0,
            "registeredBy": "BB",
            "registeredDate": "2002-07-30T11:06:16",
            "completed": true,
            "icon": "Document",
            "text": "GBrevGBB",
            "time": "2002-07-01T00:00:00",
            "isReport": false,
            "isMail": false,
            "mailMergeDraft": true,
            "updatedBy": "BB",
            "updatedDate": "2002-07-30T11:06:16",
            "recordType": "Document",
            "who": ""
        },
        {
            "PrimaryKey": "16",
            "EntityName": "document",
            "visibleFor": "All",
            "documentId": 16,
            "type": "E-post",
            "date": "2002-01-01T00:00:00",
            "associateId": "BB",
            "contactId": 4,
            "personId": 0,
            "projectId": 0,
            "saleId": 0,
            "userGroup": "Salg",
            "keywords": "",
            "ourref": "11/10025",
            "yourref": "",
            "attention": "",
            "subject": "VE-postVBB",
            "snum": 0,
            "suggestedDocumentId": 0,
            "registeredBy": "BB",
            "registeredDate": "2002-07-30T11:15:16",
            "completed": true,
            "icon": "Email",
            "text": "VE-postVBB",
            "time": "2002-01-01T00:00:00",
            "isReport": false,
            "isMail": true,
            "mailMergeDraft": false,
            "updatedBy": "BB",
            "updatedDate": "2002-07-30T11:15:16",
            "recordType": "Email",
            "who": ""
        },
        {
            "PrimaryKey": "18",
            "EntityName": "document",
            "visibleFor": "All",
            "documentId": 18,
            "type": "Brev",
            "date": "2002-10-09T00:00:00",
            "associateId": "BB",
            "contactId": 2,
            "personId": 0,
            "projectId": 0,
            "saleId": 0,
            "userGroup": "Salg",
            "keywords": "",
            "ourref": "Vür rüf",
            "yourref": "Dürüs rüf",
            "attention": "",
            "subject": "ÜBrevÜBB",
            "snum": 0,
            "suggestedDocumentId": 0,
            "registeredBy": "BB",
            "registeredDate": "2002-07-30T11:19:24",
            "completed": true,
            "icon": "Document",
            "text": "ÜBrevÜBB",
            "time": "2002-10-09T00:00:00",
            "isReport": false,
            "isMail": false,
            "mailMergeDraft": false,
            "updatedBy": "BB",
            "updatedDate": "2002-07-30T11:19:24",
            "recordType": "Document",
            "who": ""
        },
        {
            "PrimaryKey": "19",
            "EntityName": "document",
            "visibleFor": "All",
            "documentId": 19,
            "type": "Brev",
            "date": "2002-10-09T00:00:00",
            "associateId": "BB",
            "contactId": 2,
            "personId": 0,
            "projectId": 0,
            "saleId": 0,
            "userGroup": "Salg",
            "keywords": "",
            "ourref": "11/10028",
            "yourref": "",
            "attention": "",
            "subject": "BrevBB",
            "snum": 0,
            "suggestedDocumentId": 0,
            "registeredBy": "BB",
            "registeredDate": "2002-07-30T11:21:19",
            "completed": true,
            "icon": "Document",
            "text": "BrevBB",
            "time": "2002-10-09T00:00:00",
            "isReport": false,
            "isMail": false,
            "mailMergeDraft": true,
            "updatedBy": "BB",
            "updatedDate": "2002-07-30T11:21:19",
            "recordType": "Document",
            "who": ""
        },
        {
            "PrimaryKey": "20",
            "EntityName": "document",
            "visibleFor": "All",
            "documentId": 20,
            "type": "Brev",
            "date": "2002-10-09T00:00:00",
            "associateId": "BB",
            "contactId": 2,
            "personId": 0,
            "projectId": 0,
            "saleId": 0,
            "userGroup": "Salg",
            "keywords": "",
            "ourref": "11/10029",
            "yourref": "",
            "attention": "",
            "subject": "?Brev?BB",
            "snum": 0,
            "suggestedDocumentId": 0,
            "registeredBy": "BB",
            "registeredDate": "2002-07-30T11:22:51",
            "completed": false,
            "icon": "Document",
            "text": "?Brev?BB",
            "time": "2002-10-09T00:00:00",
            "isReport": false,
            "isMail": false,
            "mailMergeDraft": false,
            "updatedBy": "BB",
            "updatedDate": "2002-07-30T11:22:51",
            "recordType": "Document",
            "who": ""
        },
        {
            "PrimaryKey": "23",
            "EntityName": "document",
            "visibleFor": "All",
            "documentId": 23,
            "type": "Brev",
            "date": "2002-03-31T00:00:00",
            "associateId": "DD",
            "contactId": 68,
            "personId": 0,
            "projectId": 47,
            "saleId": 0,
            "userGroup": "Service",
            "keywords": "",
            "ourref": "13/10032",
            "yourref": "",
            "attention": "",
            "subject": "CBrevCDD",
            "snum": 0,
            "suggestedDocumentId": 0,
            "registeredBy": "DD",
            "registeredDate": "2002-07-30T11:28:56",
            "completed": false,
            "icon": "Document",
            "text": "CBrevCDD",
            "time": "2002-03-31T00:00:00",
            "isReport": false,
            "isMail": false,
            "mailMergeDraft": false,
            "updatedBy": "DD",
            "updatedDate": "2002-07-30T11:28:56",
            "recordType": "Document",
            "who": ""
        },
        {
            "PrimaryKey": "24",
            "EntityName": "document",
            "visibleFor": "All",
            "documentId": 24,
            "type": "Brev",
            "date": "2002-07-01T00:00:00",
            "associateId": "DD",
            "contactId": 51,
            "personId": 0,
            "projectId": 44,
            "saleId": 0,
            "userGroup": "Service",
            "keywords": "",
            "ourref": "13/10033",
            "yourref": "",
            "attention": "",
            "subject": "HBrevHDD",
            "snum": 0,
            "suggestedDocumentId": 0,
            "registeredBy": "DD",
            "registeredDate": "2002-07-30T11:30:08",
            "completed": true,
            "icon": "Document",
            "text": "HBrevHDD",
            "time": "2002-07-01T00:00:00",
            "isReport": false,
            "isMail": false,
            "mailMergeDraft": true,
            "updatedBy": "DD",
            "updatedDate": "2002-07-30T11:30:08",
            "recordType": "Document",
            "who": ""
        },
        {
            "PrimaryKey": "27",
            "EntityName": "document",
            "visibleFor": "All",
            "documentId": 27,
            "type": "E-post",
            "date": "2002-03-31T00:00:00",
            "associateId": "DD",
            "contactId": 51,
            "personId": 0,
            "projectId": 0,
            "saleId": 0,
            "userGroup": "Service",
            "keywords": "",
            "ourref": "13/10036",
            "yourref": "",
            "attention": "",
            "subject": "WE-postWDD",
            "snum": 0,
            "suggestedDocumentId": 0,
            "registeredBy": "DD",
            "registeredDate": "2002-07-30T11:35:07",
            "completed": true,
            "icon": "Email",
            "text": "WE-postWDD",
            "time": "2002-03-31T00:00:00",
            "isReport": false,
            "isMail": true,
            "mailMergeDraft": false,
            "updatedBy": "DD",
            "updatedDate": "2002-07-30T11:35:07",
            "recordType": "Email",
            "who": ""
        },
        {
            "PrimaryKey": "28",
            "EntityName": "document",
            "visibleFor": "All",
            "documentId": 28,
            "type": "Notat",
            "date": "2002-01-01T00:00:00",
            "associateId": "DD",
            "contactId": 4,
            "personId": 0,
            "projectId": 0,
            "saleId": 0,
            "userGroup": "Service",
            "keywords": "",
            "ourref": "13/10037",
            "yourref": "",
            "attention": "",
            "subject": "ØNotatØ",
            "snum": 0,
            "suggestedDocumentId": 0,
            "registeredBy": "DD",
            "registeredDate": "2002-07-30T11:38:34",
            "completed": true,
            "icon": "Document",
            "text": "ØNotatØ",
            "time": "2002-01-01T00:00:00",
            "isReport": false,
            "isMail": false,
            "mailMergeDraft": true,
            "updatedBy": "DD",
            "updatedDate": "2002-07-30T11:38:34",
            "recordType": "Document",
            "who": ""
        },
        {
            "PrimaryKey": "30",
            "EntityName": "document",
            "visibleFor": "All",
            "documentId": 30,
            "type": "Brev",
            "date": "2002-10-09T00:00:00",
            "associateId": "DD",
            "contactId": 2,
            "personId": 0,
            "projectId": 0,
            "saleId": 0,
            "userGroup": "Service",
            "keywords": "",
            "ourref": "V'r r'f",
            "yourref": "D'r's r'f",
            "attention": "",
            "subject": "'Brev'DD",
            "snum": 0,
            "suggestedDocumentId": 0,
            "registeredBy": "DD",
            "registeredDate": "2002-07-30T11:41:24",
            "completed": true,
            "icon": "Document",
            "text": "'Brev'DD",
            "time": "2002-10-09T00:00:00",
            "isReport": false,
            "isMail": false,
            "mailMergeDraft": true,
            "updatedBy": "DD",
            "updatedDate": "2002-07-30T11:41:24",
            "recordType": "Document",
            "who": ""
        },
        {
            "PrimaryKey": "31",
            "EntityName": "document",
            "visibleFor": "All",
            "documentId": 31,
            "type": "Notat",
            "date": "2002-10-09T00:00:00",
            "associateId": "DD",
            "contactId": 2,
            "personId": 0,
            "projectId": 0,
            "saleId": 0,
            "userGroup": "Service",
            "keywords": "",
            "ourref": "13/10040",
            "yourref": "",
            "attention": "",
            "subject": "1Notat1DD",
            "snum": 0,
            "suggestedDocumentId": 0,
            "registeredBy": "DD",
            "registeredDate": "2002-07-30T11:42:15",
            "completed": true,
            "icon": "Document",
            "text": "1Notat1DD",
            "time": "2002-10-09T00:00:00",
            "isReport": false,
            "isMail": false,
            "mailMergeDraft": false,
            "updatedBy": "DD",
            "updatedDate": "2002-07-30T11:42:15",
            "recordType": "Document",
            "who": ""
        },
        {
            "PrimaryKey": "34",
            "EntityName": "document",
            "visibleFor": "All",
            "documentId": 34,
            "type": "Faks",
            "date": "2002-12-31T00:00:00",
            "associateId": "FF",
            "contactId": 68,
            "personId": 0,
            "projectId": 47,
            "saleId": 0,
            "userGroup": "Tjenester",
            "keywords": "",
            "ourref": "15/10043",
            "yourref": "",
            "attention": "",
            "subject": "IFaksIFF",
            "snum": 0,
            "suggestedDocumentId": 0,
            "registeredBy": "FF",
            "registeredDate": "2002-07-30T11:48:40",
            "completed": true,
            "icon": "Document",
            "text": "IFaksIFF",
            "time": "2002-12-31T00:00:00",
            "isReport": false,
            "isMail": false,
            "mailMergeDraft": false,
            "updatedBy": "FF",
            "updatedDate": "2002-07-30T11:48:40",
            "recordType": "Fax",
            "who": ""
        },
        {
            "PrimaryKey": "35",
            "EntityName": "document",
            "visibleFor": "All",
            "documentId": 35,
            "type": "Faks",
            "date": "2002-03-31T00:00:00",
            "associateId": "FF",
            "contactId": 51,
            "personId": 0,
            "projectId": 44,
            "saleId": 0,
            "userGroup": "Tjenester",
            "keywords": "",
            "ourref": "15/10044",
            "yourref": "",
            "attention": "",
            "subject": "NFaksNFF",
            "snum": 0,
            "suggestedDocumentId": 0,
            "registeredBy": "FF",
            "registeredDate": "2002-07-30T11:50:06",
            "completed": true,
            "icon": "Document",
            "text": "NFaksNFF",
            "time": "2002-03-31T00:00:00",
            "isReport": false,
            "isMail": false,
            "mailMergeDraft": true,
            "updatedBy": "FF",
            "updatedDate": "2002-07-30T11:50:06",
            "recordType": "Fax",
            "who": ""
        },
        {
            "PrimaryKey": "36",
            "EntityName": "document",
            "visibleFor": "Tjenester",
            "documentId": 36,
            "type": "E-post",
            "date": "2002-12-31T00:00:00",
            "associateId": "FF",
            "contactId": 4,
            "personId": 0,
            "projectId": 47,
            "saleId": 0,
            "userGroup": "Tjenester",
            "keywords": "",
            "ourref": "15/10045",
            "yourref": "",
            "attention": "",
            "subject": "SE-postSFF",
            "snum": 0,
            "suggestedDocumentId": 0,
            "registeredBy": "FF",
            "registeredDate": "2002-07-30T11:51:21",
            "completed": true,
            "icon": "Email",
            "text": "SE-postSFF",
            "time": "2002-12-31T00:00:00",
            "isReport": false,
            "isMail": true,
            "mailMergeDraft": false,
            "updatedBy": "FF",
            "updatedDate": "2002-07-30T11:51:21",
            "recordType": "Email",
            "who": ""
        },
        {
            "PrimaryKey": "38",
            "EntityName": "document",
            "visibleFor": "All",
            "documentId": 38,
            "type": "Notat",
            "date": "2002-01-01T00:00:00",
            "associateId": "FF",
            "contactId": 4,
            "personId": 0,
            "projectId": 0,
            "saleId": 0,
            "userGroup": "Tjenester",
            "keywords": "",
            "ourref": "15/10047",
            "yourref": "",
            "attention": "",
            "subject": "ÅNotatÅFF",
            "snum": 0,
            "suggestedDocumentId": 0,
            "registeredBy": "FF",
            "registeredDate": "2002-07-30T11:55:42",
            "completed": true,
            "icon": "Document",
            "text": "ÅNotatÅFF",
            "time": "2002-01-01T00:00:00",
            "isReport": false,
            "isMail": false,
            "mailMergeDraft": false,
            "updatedBy": "FF",
            "updatedDate": "2002-07-30T11:55:42",
            "recordType": "Document",
            "who": ""
        },
        {
            "PrimaryKey": "39",
            "EntityName": "document",
            "visibleFor": "Tjenester",
            "documentId": 39,
            "type": "Brev",
            "date": "2002-10-09T00:00:00",
            "associateId": "FF",
            "contactId": 2,
            "personId": 0,
            "projectId": 0,
            "saleId": 0,
            "userGroup": "Tjenester",
            "keywords": "",
            "ourref": "15/10048",
            "yourref": "",
            "attention": "",
            "subject": "%Brev%FF",
            "snum": 0,
            "suggestedDocumentId": 0,
            "registeredBy": "FF",
            "registeredDate": "2002-07-30T11:57:06",
            "completed": true,
            "icon": "Document",
            "text": "%Brev%FF",
            "time": "2002-10-09T00:00:00",
            "isReport": false,
            "isMail": false,
            "mailMergeDraft": false,
            "updatedBy": "FF",
            "updatedDate": "2002-07-30T11:57:06",
            "recordType": "Document",
            "who": ""
        },
        {
            "PrimaryKey": "41",
            "EntityName": "document",
            "visibleFor": "All",
            "documentId": 41,
            "type": "Notat",
            "date": "2002-10-09T00:00:00",
            "associateId": "FF",
            "contactId": 2,
            "personId": 0,
            "projectId": 0,
            "saleId": 0,
            "userGroup": "Tjenester",
            "keywords": "",
            "ourref": "15/10050",
            "yourref": "",
            "attention": "",
            "subject": "2Notat2FF",
            "snum": 0,
            "suggestedDocumentId": 0,
            "registeredBy": "FF",
            "registeredDate": "2002-07-30T11:59:36",
            "completed": true,
            "icon": "Document",
            "text": "2Notat2FF",
            "time": "2002-10-09T00:00:00",
            "isReport": false,
            "isMail": false,
            "mailMergeDraft": false,
            "updatedBy": "FF",
            "updatedDate": "2002-07-30T11:59:36",
            "recordType": "Document",
            "who": ""
        },
        {
            "PrimaryKey": "42",
            "EntityName": "document",
            "visibleFor": "Tjenester",
            "documentId": 42,
            "type": "Notat",
            "date": "2002-10-09T00:00:00",
            "associateId": "FF",
            "contactId": 2,
            "personId": 0,
            "projectId": 0,
            "saleId": 0,
            "userGroup": "Tjenester",
            "keywords": "",
            "ourref": "15/10051",
            "yourref": "",
            "attention": "",
            "subject": "7Notat7FF",
            "snum": 0,
            "suggestedDocumentId": 0,
            "registeredBy": "FF",
            "registeredDate": "2002-07-30T12:00:27",
            "completed": true,
            "icon": "Document",
            "text": "7Notat7FF",
            "time": "2002-10-09T00:00:00",
            "isReport": false,
            "isMail": false,
            "mailMergeDraft": true,
            "updatedBy": "FF",
            "updatedDate": "2002-07-30T12:00:27",
            "recordType": "Document",
            "who": ""
        },
        {
            "PrimaryKey": "44",
            "EntityName": "document",
            "visibleFor": "All",
            "documentId": 44,
            "type": "Faks",
            "date": "2002-12-31T00:00:00",
            "associateId": "HH",
            "contactId": 4,
            "personId": 0,
            "projectId": 44,
            "saleId": 0,
            "userGroup": "Markedsføring",
            "keywords": "",
            "ourref": "17/10053",
            "yourref": "",
            "attention": "",
            "subject": "JFaksJHH",
            "snum": 0,
            "suggestedDocumentId": 0,
            "registeredBy": "HH",
            "registeredDate": "2002-07-30T12:56:19",
            "completed": true,
            "icon": "Document",
            "text": "JFaksJHH",
            "time": "2002-12-31T00:00:00",
            "isReport": false,
            "isMail": false,
            "mailMergeDraft": true,
            "updatedBy": "HH",
            "updatedDate": "2002-07-30T12:56:19",
            "recordType": "Fax",
            "who": ""
        },
        {
            "PrimaryKey": "45",
            "EntityName": "document",
            "visibleFor": "All",
            "documentId": 45,
            "type": "Faks",
            "date": "2002-06-30T00:00:00",
            "associateId": "HH",
            "contactId": 68,
            "personId": 0,
            "projectId": 47,
            "saleId": 0,
            "userGroup": "Markedsføring",
            "keywords": "",
            "ourref": "17/10054",
            "yourref": "",
            "attention": "",
            "subject": "OFaksOHH",
            "snum": 0,
            "suggestedDocumentId": 0,
            "registeredBy": "HH",
            "registeredDate": "2002-07-30T12:58:07",
            "completed": true,
            "icon": "Document",
            "text": "OFaksOHH",
            "time": "2002-06-30T00:00:00",
            "isReport": false,
            "isMail": false,
            "mailMergeDraft": false,
            "updatedBy": "HH",
            "updatedDate": "2002-07-30T12:58:07",
            "recordType": "Fax",
            "who": ""
        },
        {
            "PrimaryKey": "48",
            "EntityName": "document",
            "visibleFor": "All",
            "documentId": 48,
            "type": "Brev",
            "date": "2002-10-09T00:00:00",
            "associateId": "HH",
            "contactId": 2,
            "personId": 0,
            "projectId": 0,
            "saleId": 0,
            "userGroup": "Markedsføring",
            "keywords": "",
            "ourref": "17/10057",
            "yourref": "",
            "attention": "",
            "subject": "ÖBrevÖHH",
            "snum": 0,
            "suggestedDocumentId": 0,
            "registeredBy": "HH",
            "registeredDate": "2002-07-30T13:03:59",
            "completed": true,
            "icon": "Document",
            "text": "ÖBrevÖHH",
            "time": "2002-10-09T00:00:00",
            "isReport": false,
            "isMail": false,
            "mailMergeDraft": false,
            "updatedBy": "HH",
            "updatedDate": "2002-07-30T13:03:59",
            "recordType": "Document",
            "who": ""
        },
        {
            "PrimaryKey": "51",
            "EntityName": "document",
            "visibleFor": "All",
            "documentId": 51,
            "type": "Notat",
            "date": "2002-10-09T00:00:00",
            "associateId": "HH",
            "contactId": 2,
            "personId": 0,
            "projectId": 0,
            "saleId": 0,
            "userGroup": "Markedsføring",
            "keywords": "",
            "ourref": "17/10060",
            "yourref": "",
            "attention": "",
            "subject": "3Notat3HH",
            "snum": 0,
            "suggestedDocumentId": 0,
            "registeredBy": "HH",
            "registeredDate": "2002-07-30T13:07:20",
            "completed": true,
            "icon": "Document",
            "text": "3Notat3HH",
            "time": "2002-10-09T00:00:00",
            "isReport": false,
            "isMail": false,
            "mailMergeDraft": false,
            "updatedBy": "HH",
            "updatedDate": "2002-07-30T13:07:20",
            "recordType": "Document",
            "who": ""
        },
        {
            "PrimaryKey": "52",
            "EntityName": "document",
            "visibleFor": "All",
            "documentId": 52,
            "type": "Notat",
            "date": "2002-10-09T00:00:00",
            "associateId": "HH",
            "contactId": 2,
            "personId": 0,
            "projectId": 0,
            "saleId": 0,
            "userGroup": "Markedsføring",
            "keywords": "",
            "ourref": "17/10061",
            "yourref": "",
            "attention": "",
            "subject": "8Notat8HH",
            "snum": 0,
            "suggestedDocumentId": 0,
            "registeredBy": "HH",
            "registeredDate": "2002-07-30T13:08:01",
            "completed": true,
            "icon": "Document",
            "text": "8Notat8HH",
            "time": "2002-10-09T00:00:00",
            "isReport": false,
            "isMail": false,
            "mailMergeDraft": true,
            "updatedBy": "HH",
            "updatedDate": "2002-07-30T13:08:01",
            "recordType": "Document",
            "who": ""
        },
        {
            "PrimaryKey": "53",
            "EntityName": "document",
            "visibleFor": "All",
            "documentId": 53,
            "type": "Brev",
            "date": "2002-10-09T00:00:00",
            "associateId": "BB",
            "contactId": 2,
            "personId": 16,
            "projectId": 0,
            "saleId": 0,
            "userGroup": "Salg",
            "keywords": "",
            "ourref": "11/10028",
            "yourref": "",
            "attention": "Geir Grønbeck",
            "subject": "BrevBB",
            "snum": 0,
            "suggestedDocumentId": 0,
            "registeredBy": "GG",
            "registeredDate": "2002-08-07T14:29:58",
            "completed": true,
            "icon": "Document",
            "text": "BrevBB",
            "time": "2002-10-09T00:00:00",
            "isReport": false,
            "isMail": false,
            "mailMergeDraft": true,
            "updatedBy": "GG",
            "updatedDate": "2002-08-07T14:29:58",
            "recordType": "Document",
            "who": ""
        },
        {
            "PrimaryKey": "54",
            "EntityName": "document",
            "visibleFor": "All",
            "documentId": 54,
            "type": "StateZero Word Simple",
            "date": "2004-11-25T15:19:01",
            "associateId": "SAL0",
            "contactId": 2,
            "personId": 9,
            "projectId": 66,
            "saleId": 0,
            "userGroup": "Salg",
            "keywords": "",
            "ourref": "",
            "yourref": "",
            "attention": "Admin Adminson",
            "subject": "Testing 123",
            "snum": 0,
            "suggestedDocumentId": 0,
            "registeredBy": "SAL0",
            "registeredDate": "2004-11-25T15:19:24",
            "completed": true,
            "icon": "Document",
            "text": "Testing 123",
            "time": "2004-11-25T15:19:01",
            "isReport": false,
            "isMail": false,
            "mailMergeDraft": false,
            "updatedBy": "SAL0",
            "updatedDate": "2004-11-25T15:19:24",
            "recordType": "Document",
            "who": ""
        },
        {
            "PrimaryKey": "55",
            "EntityName": "document",
            "visibleFor": "All",
            "documentId": 55,
            "type": "StateZero Word Simple Czech",
            "date": "2004-11-25T15:50:20",
            "associateId": "SAL0",
            "contactId": 2,
            "personId": 9,
            "projectId": 66,
            "saleId": 0,
            "userGroup": "Salg",
            "keywords": "",
            "ourref": "",
            "yourref": "",
            "attention": "Admin Adminson",
            "subject": "Testing Czech 123",
            "snum": 0,
            "suggestedDocumentId": 0,
            "registeredBy": "SAL0",
            "registeredDate": "2004-11-25T15:50:54",
            "completed": true,
            "icon": "Document",
            "text": "Testing Czech 123",
            "time": "2004-11-25T15:50:20",
            "isReport": false,
            "isMail": false,
            "mailMergeDraft": false,
            "updatedBy": "SAL0",
            "updatedDate": "2004-11-25T15:50:54",
            "recordType": "Document",
            "who": ""
        },
        {
            "PrimaryKey": "61",
            "EntityName": "document",
            "visibleFor": "All",
            "documentId": 61,
            "type": "Brev",
            "date": "2005-11-07T08:11:41",
            "associateId": "SER0",
            "contactId": 2,
            "personId": 18,
            "projectId": 68,
            "saleId": 0,
            "userGroup": "Service",
            "keywords": "",
            "ourref": "165/10065",
            "yourref": "",
            "attention": "Ingrid Istad",
            "subject": "Test document 2",
            "snum": 0,
            "suggestedDocumentId": 0,
            "registeredBy": "SER0",
            "registeredDate": "2005-11-07T08:13:31",
            "completed": true,
            "icon": "Document",
            "text": "Test document 2",
            "time": "2005-11-07T08:11:41",
            "isReport": false,
            "isMail": false,
            "mailMergeDraft": false,
            "updatedBy": "SER0",
            "updatedDate": "2005-11-07T08:13:31",
            "recordType": "Document",
            "who": ""
        },
        {
            "PrimaryKey": "63",
            "EntityName": "document",
            "visibleFor": "All",
            "documentId": 63,
            "type": "Faks",
            "date": "2005-11-07T08:51:17",
            "associateId": "SER0",
            "contactId": 37,
            "personId": 88,
            "projectId": 68,
            "saleId": 0,
            "userGroup": "Service",
            "keywords": "",
            "ourref": "165/10066",
            "yourref": "",
            "attention": "Rene Rolla",
            "subject": "Test document 4",
            "snum": 0,
            "suggestedDocumentId": 0,
            "registeredBy": "SER0",
            "registeredDate": "2005-11-07T08:51:50",
            "completed": true,
            "icon": "Document",
            "text": "Test document 4",
            "time": "2005-11-07T08:51:17",
            "isReport": false,
            "isMail": false,
            "mailMergeDraft": false,
            "updatedBy": "SER0",
            "updatedDate": "2005-11-07T08:51:50",
            "recordType": "Fax",
            "who": ""
        },
        {
            "PrimaryKey": "64",
            "EntityName": "document",
            "visibleFor": "All",
            "documentId": 64,
            "type": "Brev - Internasjonal",
            "date": "2005-11-07T09:20:12",
            "associateId": "SER0",
            "contactId": 5,
            "personId": 26,
            "projectId": 0,
            "saleId": 0,
            "userGroup": "Service",
            "keywords": "",
            "ourref": "165/10067",
            "yourref": "",
            "attention": "Bjørge Bastesen",
            "subject": "Test doc link error",
            "snum": 0,
            "suggestedDocumentId": 0,
            "registeredBy": "SER0",
            "registeredDate": "2005-11-07T09:21:16",
            "completed": true,
            "icon": "Document",
            "text": "Test doc link error",
            "time": "2005-11-07T09:20:12",
            "isReport": false,
            "isMail": false,
            "mailMergeDraft": false,
            "updatedBy": "SER0",
            "updatedDate": "2005-11-07T09:21:16",
            "recordType": "Document",
            "who": ""
        },
        {
            "PrimaryKey": "65",
            "EntityName": "document",
            "visibleFor": "All",
            "documentId": 65,
            "type": "Report",
            "date": "2007-10-11T09:40:28",
            "associateId": "SAL1",
            "contactId": 0,
            "personId": 0,
            "projectId": 0,
            "saleId": 0,
            "userGroup": "Salg",
            "keywords": "",
            "ourref": "",
            "yourref": "",
            "attention": "",
            "subject": "Kontakt rapport 1",
            "snum": 0,
            "suggestedDocumentId": 0,
            "registeredBy": "SAL1",
            "registeredDate": "2007-10-11T09:40:28",
            "completed": true,
            "icon": "Document",
            "text": "Kontakt rapport 1",
            "time": "2007-10-11T09:40:28",
            "isReport": true,
            "isMail": false,
            "mailMergeDraft": false,
            "updatedBy": "SAL1",
            "updatedDate": "2007-10-11T09:40:28",
            "recordType": "Document",
            "who": ""
        },
        {
            "PrimaryKey": "69",
            "EntityName": "document",
            "visibleFor": "All",
            "documentId": 69,
            "type": "Brev",
            "date": "2019-12-20T06:50:01",
            "associateId": "SAL2",
            "contactId": 125,
            "personId": 219,
            "projectId": 77,
            "saleId": 67,
            "userGroup": "Salg",
            "keywords": "",
            "ourref": "155/10071",
            "yourref": "",
            "attention": "Second Ca",
            "subject": "Document for Fish company",
            "snum": 10071,
            "suggestedDocumentId": 0,
            "registeredBy": "SAL2",
            "registeredDate": "2019-12-20T07:50:01",
            "completed": false,
            "icon": "Document",
            "text": "Document for Fish company",
            "time": "2019-12-20T06:50:01",
            "isReport": false,
            "isMail": false,
            "mailMergeDraft": false,
            "updatedBy": "SAL2",
            "updatedDate": "2019-12-20T07:50:01",
            "recordType": "Document",
            "who": ""
        },
        {
            "PrimaryKey": "70",
            "EntityName": "document",
            "visibleFor": "All",
            "documentId": 70,
            "type": "Brev",
            "date": "2019-12-20T06:50:13",
            "associateId": "SAL2",
            "contactId": 125,
            "personId": 219,
            "projectId": 77,
            "saleId": 67,
            "userGroup": "Salg",
            "keywords": "",
            "ourref": "155/10071",
            "yourref": "",
            "attention": "Second Ca",
            "subject": "Document for Fish company",
            "snum": 10072,
            "suggestedDocumentId": 0,
            "registeredBy": "SAL2",
            "registeredDate": "2019-12-20T07:50:13",
            "completed": false,
            "icon": "Document",
            "text": "Document for Fish company",
            "time": "2019-12-20T06:50:13",
            "isReport": false,
            "isMail": false,
            "mailMergeDraft": false,
            "updatedBy": "SAL2",
            "updatedDate": "2019-12-20T07:50:13",
            "recordType": "Document",
            "who": ""
        }
    ]
}