{
    "ContactId": 3,
    "Name": "Amadeus AS",
    "Department": "AAvdeling",
    "OrgNr": "",
    "Number1": "AmadeusA",
    "Number2": "AA10011",
    "UpdatedDate": "2006-02-22T09:35:41",
    "CreatedDate": "2002-07-23T16:01:34",
    "Emails": [
        {
            "Value": "qa0@superoffice.com",
            "StrippedValue": "qa0@superoffice.com",
            "Description": "",
            "TableRight": null,
            "FieldProperties": {
            }
        }
    ],
    "Interests": [
        {
            "Id": 2,
            "Name": "Prestisjekunde",
            "ToolTip": "Prestisjekunde",
            "Deleted": false,
            "Rank": 2,
            "Type": "contint",
            "ColorBlock": 0,
            "IconHint": "contint",
            "Selected": false,
            "LastChanged": "0001-01-01T00:00:00",
            "ChildItems": [
            ],
            "ExtraInfo": "",
            "StyleHint": "",
            "Hidden": false,
            "FullName": null,
            "TableRight": null,
            "FieldProperties": {
            }
        },
        {
            "Id": 1,
            "Name": "Referansekunde",
            "ToolTip": "Referansekunde",
            "Deleted": false,
            "Rank": 1,
            "Type": "contint",
            "ColorBlock": 0,
            "IconHint": "contint",
            "Selected": false,
            "LastChanged": "0001-01-01T00:00:00",
            "ChildItems": [
            ],
            "ExtraInfo": "",
            "StyleHint": "",
            "Hidden": false,
            "FullName": null,
            "TableRight": null,
            "FieldProperties": {
            }
        },
        {
            "Id": 3,
            "Name": "Storkunde",
            "ToolTip": "Storkunde",
            "Deleted": false,
            "Rank": 3,
            "Type": "contint",
            "ColorBlock": 0,
            "IconHint": "contint",
            "Selected": false,
            "LastChanged": "0001-01-01T00:00:00",
            "ChildItems": [
            ],
            "ExtraInfo": "",
            "StyleHint": "",
            "Hidden": false,
            "FullName": null,
            "TableRight": null,
            "FieldProperties": {
            }
        }
    ],
    "Urls": [
    ],
    "Phones": [
        {
            "Value": "+47 01",
            "StrippedValue": "+4701",
            "Description": "",
            "TableRight": null,
            "FieldProperties": {
            }
        }
    ],
    "Faxes": [
    ],
    "Description": "",
    "UpdatedBy": {
        "AssociateId": 36,
        "Name": "MAR1",
        "PersonId": 172,
        "Rank": 0,
        "Tooltip": "",
        "Type": "InternalAssociate",
        "GroupIdx": 5,
        "FullName": "Mar1",
        "FormalName": "Mar1",
        "Deleted": false,
        "EjUserId": 36,
        "UserName": null,
        "TableRight": {
            "Mask": "Select, Update, Insert, Delete",
            "Reason": ""
        },
        "FieldProperties": {
        }
    },
    "CreatedBy": {
        "AssociateId": 2,
        "Name": "AA",
        "PersonId": 10,
        "Rank": 0,
        "Tooltip": "",
        "Type": "InternalAssociate",
        "GroupIdx": 1,
        "FullName": "Arne Arnesen",
        "FormalName": "Arne Arnesen",
        "Deleted": false,
        "EjUserId": 14,
        "UserName": null,
        "TableRight": {
            "Mask": "Select, Update, Insert, Delete",
            "Reason": ""
        },
        "FieldProperties": {
        }
    },
    "Associate": {
        "AssociateId": 1,
        "Name": "ADMIN",
        "PersonId": 9,
        "Rank": 0,
        "Tooltip": "",
        "Type": "InternalAssociate",
        "GroupIdx": 1,
        "FullName": "Admin Adminson",
        "FormalName": "Admin Adminson",
        "Deleted": false,
        "EjUserId": 13,
        "UserName": null,
        "TableRight": {
            "Mask": "Select, Update, Insert, Delete",
            "Reason": ""
        },
        "FieldProperties": {
        }
    },
    "Business": {
        "Id": 1,
        "Value": "Advokater",
        "Tooltip": "",
        "TableRight": null,
        "FieldProperties": {
        }
    },
    "Category": {
        "Id": 1,
        "Value": "Customer",
        "Tooltip": "",
        "TableRight": null,
        "FieldProperties": {
        }
    },
    "Country": {
        "CountryId": 578,
        "Name": "Norway",
        "CurrencyId": 76,
        "EnglishName": "Norway",
        "TwoLetterISOCountry": "NO",
        "ThreeLetterISOCountry": "NOR",
        "ImageDescription": null,
        "OrgNrText": "VAT No.:",
        "InterAreaPrefix": "",
        "DialInPrefix": "47",
        "ZipPrefix": "N",
        "DomainName": "NO",
        "AddressLayoutId": 4,
        "DomesticAddressLayoutId": 4,
        "ForeignAddressLayoutId": 4,
        "Rank": 158,
        "Tooltip": "Norway",
        "Deleted": false,
        "TableRight": null,
        "FieldProperties": {
        }
    },
    "Persons": [
    ],
    "NoMailing": false,
    "Kananame": "",
    "Xstop": false,
    "ActiveInterests": 0,
    "GroupId": 1,
    "ActiveStatusMonitorId": 0,
    "SupportAssociate": null,
    "TicketPriority": {
        "Id": 0,
        "Value": "",
        "Tooltip": "Unknown",
        "TableRight": null,
        "FieldProperties": {
        }
    },
    "CustomerLanguage": {
        "Id": 0,
        "Value": "",
        "Tooltip": "Tooltip needs implementation...",
        "TableRight": null,
        "FieldProperties": {
        }
    },
    "Deleted": 0,
    "DbiAgentId": 0,
    "DbiLastSyncronized": "0001-01-01T00:00:00",
    "DbiKey": "",
    "DbiLastModified": "0001-01-01T00:00:00",
    "SupportPerson": {
        "Position": "Toppledelse",
        "PersonId": 19,
        "Mrmrs": "Herr",
        "Firstname": "Arne",
        "Lastname": "Arnesen",
        "MiddleName": "",
        "Title": "",
        "Description": "",
        "Email": "qa0@superoffice.com",
        "FullName": "Arne Arnesen",
        "DirectPhone": "",
        "FormalName": "Herr Arne Arnesen",
        "CountryId": 578,
        "ContactId": 3,
        "ContactName": "Amadeus AS",
        "Retired": 0,
        "Rank": 1,
        "ActiveInterests": 0,
        "ContactDepartment": "AAvdeling",
        "ContactCountryId": 578,
        "ContactOrgNr": "",
        "FaxPhone": "",
        "MobilePhone": "",
        "ContactPhone": "+4701",
        "AssociateName": "",
        "AssociateId": 0,
        "UsePersonAddress": false,
        "ContactFax": "",
        "Kanafname": "",
        "Kanalname": "",
        "Post1": "",
        "Post2": "",
        "Post3": "",
        "EmailName": "",
        "ContactFullName": "Amadeus AS, AAvdeling",
        "ActiveErpLinks": 0,
        "TicketPriorityId": 0,
        "SupportLanguageId": 0,
        "SupportAssociateId": 0,
        "CategoryName": "Customer",
        "TableRight": {
            "Mask": "Select, Update, Insert, Delete",
            "Reason": ""
        },
        "FieldProperties": {
            "PersonId": {
                "FieldRight": {
                    "Mask": "Update",
                    "Reason": ""
                },
                "FieldType": "System.Int32",
                "FieldLength": 4
            },
            "Retired": {
                "FieldRight": {
                    "Mask": "Update",
                    "Reason": ""
                },
                "FieldType": "System.Int16",
                "FieldLength": 2
            },
            "Rank": {
                "FieldRight": {
                    "Mask": "Update",
                    "Reason": ""
                },
                "FieldType": "System.Int16",
                "FieldLength": 2
            },
            "Mrmrs": {
                "FieldRight": {
                    "Mask": "Update",
                    "Reason": ""
                },
                "FieldType": "System.String",
                "FieldLength": 239
            },
            "Title": {
                "FieldRight": {
                    "Mask": "Update",
                    "Reason": ""
                },
                "FieldType": "System.String",
                "FieldLength": 239
            },
            "Firstname": {
                "FieldRight": {
                    "Mask": "Update, UIHintMandatory",
                    "Reason": "[SR_MANDATORY_FIELD_1539]"
                },
                "FieldType": "System.String",
                "FieldLength": 99
            },
            "MiddleName": {
                "FieldRight": {
                    "Mask": "Update",
                    "Reason": ""
                },
                "FieldType": "System.String",
                "FieldLength": 99
            },
            "Lastname": {
                "FieldRight": {
                    "Mask": "Update",
                    "Reason": ""
                },
                "FieldType": "System.String",
                "FieldLength": 99
            },
            "Usepersonaddress": {
                "FieldRight": {
                    "Mask": "Update",
                    "Reason": ""
                },
                "FieldType": "System.Int16",
                "FieldLength": 2
            },
            "CountryId": {
                "FieldRight": {
                    "Mask": "Update",
                    "Reason": ""
                },
                "FieldType": "System.Int32",
                "FieldLength": 4
            },
            "ActiveInterests": {
                "FieldRight": {
                    "Mask": "Update",
                    "Reason": ""
                },
                "FieldType": "System.Int16",
                "FieldLength": 2
            },
            "Position": {
                "FieldRight": {
                    "Mask": "Update",
                    "Reason": ""
                },
                "FieldType": "System.String",
                "FieldLength": 239
            },
            "CategoryName": {
                "FieldRight": {
                    "Mask": "Update",
                    "Reason": ""
                },
                "FieldType": "System.String",
                "FieldLength": 239
            },
            "ContactCategoryName": {
                "FieldRight": {
                    "Mask": "Update",
                    "Reason": ""
                },
                "FieldType": "System.String",
                "FieldLength": 239
            },
            "Text": {
                "FieldRight": {
                    "Mask": "Update",
                    "Reason": ""
                },
                "FieldType": "System.String",
                "FieldLength": 2047
            },
            "EmailAddress": {
                "FieldRight": {
                    "Mask": "Update",
                    "Reason": ""
                },
                "FieldType": "System.String",
                "FieldLength": 239
            },
            "DirectPhone": {
                "FieldRight": {
                    "Mask": "Update",
                    "Reason": ""
                },
                "FieldType": "System.String",
                "FieldLength": 239
            },
            "MobilePhone": {
                "FieldRight": {
                    "Mask": "Update",
                    "Reason": ""
                },
                "FieldType": "System.String",
                "FieldLength": 239
            },
            "Fax": {
                "FieldRight": {
                    "Mask": "Update",
                    "Reason": ""
                },
                "FieldType": "System.String",
                "FieldLength": 239
            },
            "ContactId": {
                "FieldRight": {
                    "Mask": "Update, UIHintMandatory",
                    "Reason": "[SR_MANDATORY_FIELD_1281]"
                },
                "FieldType": "System.Int32",
                "FieldLength": 4
            },
            "ContactName": {
                "FieldRight": {
                    "Mask": "Update, UIHintMandatory",
                    "Reason": "[SR_MANDATORY_FIELD_1281]"
                },
                "FieldType": "System.String",
                "FieldLength": 219
            },
            "ContactDepartment": {
                "FieldRight": {
                    "Mask": "Update",
                    "Reason": ""
                },
                "FieldType": "System.String",
                "FieldLength": 219
            },
            "ContactPhone": {
                "FieldRight": {
                    "Mask": "Update",
                    "Reason": ""
                },
                "FieldType": "System.String",
                "FieldLength": 239
            },
            "ContactCountryId": {
                "FieldRight": {
                    "Mask": "Update",
                    "Reason": ""
                },
                "FieldType": "System.Int32",
                "FieldLength": 4
            },
            "ContactOrgNr": {
                "FieldRight": {
                    "Mask": "Update",
                    "Reason": ""
                },
                "FieldType": "System.String",
                "FieldLength": 49
            },
            "AssociateId": {
                "FieldRight": {
                    "Mask": "Update",
                    "Reason": ""
                },
                "FieldType": "System.Int32",
                "FieldLength": 4
            },
            "AssociateName": {
                "FieldRight": {
                    "Mask": "Update, UIHintMandatory",
                    "Reason": "[SR_USERS_MUST_HAVE_UNIQUE_NAME]"
                },
                "FieldType": "System.String",
                "FieldLength": 239
            },
            "ContactFax": {
                "FieldRight": {
                    "Mask": "Update",
                    "Reason": ""
                },
                "FieldType": "System.String",
                "FieldLength": 239
            },
            "Kanafname": {
                "FieldRight": {
                    "Mask": "Update",
                    "Reason": ""
                },
                "FieldType": "System.String",
                "FieldLength": 99
            },
            "Kanalname": {
                "FieldRight": {
                    "Mask": "Update",
                    "Reason": ""
                },
                "FieldType": "System.String",
                "FieldLength": 99
            },
            "Post1": {
                "FieldRight": {
                    "Mask": "Update",
                    "Reason": ""
                },
                "FieldType": "System.String",
                "FieldLength": 99
            },
            "Post2": {
                "FieldRight": {
                    "Mask": "Update",
                    "Reason": ""
                },
                "FieldType": "System.String",
                "FieldLength": 99
            },
            "Post3": {
                "FieldRight": {
                    "Mask": "Update",
                    "Reason": ""
                },
                "FieldType": "System.String",
                "FieldLength": 99
            },
            "EmailName": {
                "FieldRight": {
                    "Mask": "Update",
                    "Reason": ""
                },
                "FieldType": "System.String",
                "FieldLength": 254
            },
            "ActiveErpLinks": {
                "FieldRight": {
                    "Mask": "Update",
                    "Reason": ""
                },
                "FieldType": "System.Int32",
                "FieldLength": 4
            },
            "TicketPriorityId": {
                "FieldRight": {
                    "Mask": "Update",
                    "Reason": ""
                },
                "FieldType": "System.Int32",
                "FieldLength": 4
            },
            "CustomerLanguageId": {
                "FieldRight": {
                    "Mask": "Update",
                    "Reason": ""
                },
                "FieldType": "System.Int32",
                "FieldLength": 4
            },
            "SupportAssociateId": {
                "FieldRight": {
                    "Mask": "Update",
                    "Reason": ""
                },
                "FieldType": "System.Int32",
                "FieldLength": 4
            }
        }
    },
    "Address": {
        "Wgs84Latitude": 0,
        "Wgs84Longitude": 0,
        "LocalizedAddress": [
            [
                {
                    "Name": "StreetAddress1",
                    "Value": "A-gaten 45",
                    "Tooltip": "",
                    "Label": "SR_AL_STREET",
                    "ValueLength": 80,
                    "AddressType": "ContactStreetAddress",
                    "TableRight": null,
                    "FieldProperties": {
                    }
                }
            ],
            [
                {
                    "Name": "StreetZipcode",
                    "Value": "",
                    "Tooltip": "",
                    "Label": "SR_AL_POSTCODECITY",
                    "ValueLength": 9,
                    "AddressType": "ContactStreetAddress",
                    "TableRight": null,
                    "FieldProperties": {
                    }
                },
                {
                    "Name": "StreetCity",
                    "Value": "",
                    "Tooltip": "",
                    "Label": "",
                    "ValueLength": 30,
                    "AddressType": "ContactStreetAddress",
                    "TableRight": null,
                    "FieldProperties": {
                    }
                }
            ],
            [
                {
                    "Name": "PostalAddress1",
                    "Value": "A-gaten 45",
                    "Tooltip": "",
                    "Label": "SR_AL_POBOX",
                    "ValueLength": 80,
                    "AddressType": "ContactPostalAddress",
                    "TableRight": null,
                    "FieldProperties": {
                    }
                }
            ],
            [
                {
                    "Name": "PostalZipcode",
                    "Value": "0123",
                    "Tooltip": "",
                    "Label": "SR_AL_POSTCODECITY",
                    "ValueLength": 9,
                    "AddressType": "ContactPostalAddress",
                    "TableRight": null,
                    "FieldProperties": {
                    }
                },
                {
                    "Name": "PostalCity",
                    "Value": "OSLO",
                    "Tooltip": "",
                    "Label": "",
                    "ValueLength": 30,
                    "AddressType": "ContactPostalAddress",
                    "TableRight": null,
                    "FieldProperties": {
                    }
                }
            ]
        ],
        "Street": {
            "AtypeIdx": "ContactStreetAddress",
            "Address1": "A-gaten 45",
            "Address2": "",
            "Address3": "",
            "City": "",
            "County": "",
            "State": "",
            "Zipcode": "",
            "Formatted": "A-gaten 45 "
        },
        "Postal": {
            "AtypeIdx": "ContactPostalAddress",
            "Address1": "A-gaten 45",
            "Address2": "",
            "Address3": "",
            "City": "OSLO",
            "County": "",
            "State": "",
            "Zipcode": "0123",
            "Formatted": "A-gaten 45 0123 OSLO "
        },
        "Formatted": "A-gaten 45 A-gaten 45 0123 OSLO ",
        "TableRight": {
            "Mask": "Select, Update, Insert, Delete",
            "Reason": ""
        },
        "FieldProperties": {
            "zipcode": {
                "FieldRight": {
                    "Mask": "Update",
                    "Reason": ""
                },
                "FieldType": "System.String",
                "FieldLength": 11
            },
            "city": {
                "FieldRight": {
                    "Mask": "Update",
                    "Reason": ""
                },
                "FieldType": "System.String",
                "FieldLength": 79
            },
            "state": {
                "FieldRight": {
                    "Mask": "Update",
                    "Reason": ""
                },
                "FieldType": "System.String",
                "FieldLength": 5
            },
            "county": {
                "FieldRight": {
                    "Mask": "Update",
                    "Reason": ""
                },
                "FieldType": "System.String",
                "FieldLength": 29
            },
            "address1": {
                "FieldRight": {
                    "Mask": "Update",
                    "Reason": ""
                },
                "FieldType": "System.String",
                "FieldLength": 79
            },
            "address2": {
                "FieldRight": {
                    "Mask": "Update",
                    "Reason": ""
                },
                "FieldType": "System.String",
                "FieldLength": 79
            },
            "address3": {
                "FieldRight": {
                    "Mask": "Update",
                    "Reason": ""
                },
                "FieldType": "System.String",
                "FieldLength": 79
            }
        }
    },
    "Source": 0,
    "ActiveErpLinks": 0,
    "BounceEmails": [
    ],
    "UserDefinedFields": {
        "SuperOffice:1": "short text in comp",
        "SuperOffice:2": "long text in company",
        "SuperOffice:3": "[I:1234]",
        "SuperOffice:4": "[D:11/01/2005 00:00:00.0000000]",
        "SuperOffice:5": "[D:10/30/1964 00:00:00.0000000]",
        "SuperOffice:6": "False",
        "SuperOffice:7": "[I:4]",
        "SuperOffice:7:DisplayText": "Telefon inn",
        "SuperOffice:7:DisplayTooltip": "Telefon inn",
        "SuperOffice:8": "[F:345.789]",
        "SuperOffice:9": "p1 sale",
        "SuperOffice:10": "p1 marketing",
        "SuperOffice:11": "p1 admin",
        "SuperOffice:12": "[I:1]",
        "SuperOffice:12:DisplayText": "UdList one flat item one",
        "SuperOffice:12:DisplayTooltip": "This is the first item of the first user-defined list.",
        "SuperOffice:13": "[I:10]",
        "SuperOffice:13:DisplayText": "UdList two Heading one item one",
        "SuperOffice:13:DisplayTooltip": "UdList two Heading one"
    },
    "ExtraFields": {
        "x_contact_integer": "[I:0]",
        "x_contact_hidden_integer": "[I:0]",
        "x_contact_default_integer": "[I:123]",
        "x_contact_float": "[F:0]",
        "x_contact_longtext": "",
        "x_contact_dropdown": "",
        "x_contact_date": "[DT:01/01/0001 00:00:00.0000000]",
        "x_contact_datetime": "[DT:01/01/0001 00:00:00.0000000]",
        "x_contact_time": "[DT:03/28/2019 00:00:00.0000000]",
        "x_contact_boolean": "[I:0]",
        "x_contact_timespan": "[I:0]",
        "x_contact_shorttext": "",
        "x_contact_short_dropdown": "",
        "x_contact_contact_relation": "[I:0]",
        "x_contact_contact_relation:DisplayText": "",
        "x_contact_request_relation": "[I:0]",
        "x_contact_request_relation:DisplayText": "",
        "x_contact_contact": "[I:0]",
        "x_contact_contact:DisplayText": "",
        "x_contact_link": "http://crm-sod.superoffice.com/Playground/CS/scripts/ticket.fcgi&action=redirectLink&extraFieldId=94&table=contact&id=3"
    },
    "CustomFields": {
        "x_contact_integer": "[I:0]",
        "x_contact_integer:org": "[I:0]",
        "x_contact_hidden_integer": "[I:0]",
        "x_contact_hidden_integer:org": "[I:0]",
        "x_contact_default_integer": "[I:123]",
        "x_contact_default_integer:org": "[I:123]",
        "x_contact_float": "[F:0]",
        "x_contact_float:org": "[F:0]",
        "x_contact_longtext": "",
        "x_contact_longtext:org": "",
        "x_contact_dropdown": "",
        "x_contact_dropdown:org": "",
        "x_contact_date": "[DT:01/01/0001 00:00:00.0000000]",
        "x_contact_date:org": "[DT:01/01/0001 00:00:00.0000000]",
        "x_contact_datetime": "[DT:01/01/0001 00:00:00.0000000]",
        "x_contact_datetime:org": "[DT:01/01/0001 00:00:00.0000000]",
        "x_contact_time": "[DT:03/28/2019 00:00:00.0000000]",
        "x_contact_time:org": "[DT:03/28/2019 00:00:00.0000000]",
        "x_contact_boolean": "[I:0]",
        "x_contact_boolean:org": "[I:0]",
        "x_contact_timespan": "[I:0]",
        "x_contact_timespan:org": "[I:0]",
        "x_contact_shorttext": "",
        "x_contact_shorttext:org": "",
        "x_contact_short_dropdown": "",
        "x_contact_short_dropdown:org": "",
        "x_contact_contact_relation": "[I:0]",
        "x_contact_contact_relation:org": "[I:0]",
        "x_contact_contact_relation:DisplayText": "",
        "x_contact_request_relation": "[I:0]",
        "x_contact_request_relation:org": "[I:0]",
        "x_contact_request_relation:DisplayText": "",
        "x_contact_contact": "[I:0]",
        "x_contact_contact:org": "[I:0]",
        "x_contact_contact:DisplayText": "",
        "x_contact_link": "http://crm-sod.superoffice.com/Playground/CS/scripts/ticket.fcgi&action=redirectLink&extraFieldId=94&table=contact&id=3",
        "x_contact_link:org": "http://crm-sod.superoffice.com/Playground/CS/scripts/ticket.fcgi&action=redirectLink&extraFieldId=94&table=contact&id=3",
        "SuperOffice:1": "short text in comp",
        "SuperOffice:1:org": "short text in comp",
        "SuperOffice:2": "long text in company",
        "SuperOffice:2:org": "long text in company",
        "SuperOffice:3": "[I:1234]",
        "SuperOffice:3:org": "[I:1234]",
        "SuperOffice:4": "[DT:11/01/2005 00:00:00.0000000]",
        "SuperOffice:4:org": "[DT:11/01/2005 00:00:00.0000000]",
        "SuperOffice:5": "[DT:10/30/1964 00:00:00.0000000]",
        "SuperOffice:5:org": "[DT:10/30/1964 00:00:00.0000000]",
        "SuperOffice:6": "[I:0]",
        "SuperOffice:6:org": "[I:0]",
        "SuperOffice:7": "[I:4]",
        "SuperOffice:7:org": "[I:4]",
        "SuperOffice:7:DisplayText": "Telefon inn",
        "SuperOffice:7:DisplayTooltip": "Telefon inn",
        "SuperOffice:8": "[F:345.789]",
        "SuperOffice:8:org": "[F:345.789]",
        "SuperOffice:9": "p1 sale",
        "SuperOffice:9:org": "p1 sale",
        "SuperOffice:10": "p1 marketing",
        "SuperOffice:10:org": "p1 marketing",
        "SuperOffice:11": "p1 admin",
        "SuperOffice:11:org": "p1 admin",
        "SuperOffice:12": "[I:1]",
        "SuperOffice:12:org": "[I:1]",
        "SuperOffice:12:DisplayText": "UdList one flat item one",
        "SuperOffice:12:DisplayTooltip": "This is the first item of the first user-defined list.",
        "SuperOffice:13": "[I:10]",
        "SuperOffice:13:org": "[I:10]",
        "SuperOffice:13:DisplayText": "UdList two Heading one item one",
        "SuperOffice:13:DisplayTooltip": "UdList two Heading one"
    },
    "TableRight": {
        "Mask": "Select, Update, Insert, Delete",
        "Reason": ""
    },
    "FieldProperties": {
        "ContactId": {
            "FieldRight": {
                "Mask": "Update",
                "Reason": ""
            },
            "FieldType": "System.Int32",
            "FieldLength": 4
        },
        "Name": {
            "FieldRight": {
                "Mask": "Update, UIHintMandatory",
                "Reason": "[SR_MANDATORY_FIELD_1281]"
            },
            "FieldType": "System.String",
            "FieldLength": 219
        },
        "Department": {
            "FieldRight": {
                "Mask": "Update",
                "Reason": ""
            },
            "FieldType": "System.String",
            "FieldLength": 219
        },
        "OrgNr": {
            "FieldRight": {
                "Mask": "Update",
                "Reason": ""
            },
            "FieldType": "System.String",
            "FieldLength": 49
        },
        "Number1": {
            "FieldRight": {
                "Mask": "Update",
                "Reason": ""
            },
            "FieldType": "System.String",
            "FieldLength": 49
        },
        "Number2": {
            "FieldRight": {
                "Mask": "Update, UIHintMandatory",
                "Reason": "[SR_MANDATORY_FIELD_1285]"
            },
            "FieldType": "System.String",
            "FieldLength": 49
        },
        "UpdatedDate": {
            "FieldRight": {
                "Mask": "Update",
                "Reason": ""
            },
            "FieldType": "System.DateTime",
            "FieldLength": 16
        },
        "CreatedDate": {
            "FieldRight": {
                "Mask": "Update",
                "Reason": ""
            },
            "FieldType": "System.DateTime",
            "FieldLength": 16
        },
        "Kananame": {
            "FieldRight": {
                "Mask": "Update",
                "Reason": ""
            },
            "FieldType": "System.String",
            "FieldLength": 219
        },
        "GroupId": {
            "FieldRight": {
                "Mask": "Update",
                "Reason": ""
            },
            "FieldType": "System.Int32",
            "FieldLength": 4
        },
        "Deleted": {
            "FieldRight": {
                "Mask": "Update",
                "Reason": ""
            },
            "FieldType": "System.Int16",
            "FieldLength": 2
        },
        "DbiAgentId": {
            "FieldRight": {
                "Mask": "Update",
                "Reason": ""
            },
            "FieldType": "System.Int32",
            "FieldLength": 4
        },
        "DbiLastSyncronized": {
            "FieldRight": {
                "Mask": "Update",
                "Reason": ""
            },
            "FieldType": "System.DateTime",
            "FieldLength": 16
        },
        "DbiKey": {
            "FieldRight": {
                "Mask": "Update",
                "Reason": ""
            },
            "FieldType": "System.String",
            "FieldLength": 255
        },
        "DbiLastModified": {
            "FieldRight": {
                "Mask": "Update",
                "Reason": ""
            },
            "FieldType": "System.DateTime",
            "FieldLength": 16
        },
        "Source": {
            "FieldRight": {
                "Mask": "Update",
                "Reason": ""
            },
            "FieldType": "System.Int16",
            "FieldLength": 2
        },
        "ActiveErpLinks": {
            "FieldRight": {
                "Mask": "Update",
                "Reason": ""
            },
            "FieldType": "System.Int32",
            "FieldLength": 4
        },
        "Interests": {
            "FieldRight": {
                "Mask": "Update",
                "Reason": ""
            },
            "FieldType": "",
            "FieldLength": 0
        },
        "Description": {
            "FieldRight": {
                "Mask": "Update",
                "Reason": ""
            },
            "FieldType": "System.String",
            "FieldLength": 2047
        },
        "UpdatedBy": {
            "FieldRight": {
                "Mask": "Update",
                "Reason": ""
            },
            "FieldType": "SuperOffice.CRM.Services.Associate",
            "FieldLength": 4
        },
        "CreatedBy": {
            "FieldRight": {
                "Mask": "Update",
                "Reason": ""
            },
            "FieldType": "SuperOffice.CRM.Services.Associate",
            "FieldLength": 4
        },
        "Associate": {
            "FieldRight": {
                "Mask": "Update",
                "Reason": ""
            },
            "FieldType": "SuperOffice.CRM.Services.Associate",
            "FieldLength": 4
        },
        "Business": {
            "FieldRight": {
                "Mask": "Update, UIHintMandatory",
                "Reason": "[SR_MANDATORY_FIELD_1288]"
            },
            "FieldType": "SuperOffice.CRM.Services.Business",
            "FieldLength": 4
        },
        "Category": {
            "FieldRight": {
                "Mask": "Update, UIHintMandatory",
                "Reason": "[SR_MANDATORY_FIELD_1289]"
            },
            "FieldType": "SuperOffice.CRM.Services.Category",
            "FieldLength": 4
        },
        "Country": {
            "FieldRight": {
                "Mask": "Update",
                "Reason": ""
            },
            "FieldType": "SuperOffice.CRM.Services.Country",
            "FieldLength": 4
        },
        "Persons": {
            "FieldRight": {
                "Mask": "Update",
                "Reason": ""
            },
            "FieldType": "",
            "FieldLength": 0
        },
        "NoMailing": {
            "FieldRight": {
                "Mask": "Update",
                "Reason": ""
            },
            "FieldType": "System.Boolean",
            "FieldLength": 2
        },
        "Xstop": {
            "FieldRight": {
                "Mask": "Update",
                "Reason": ""
            },
            "FieldType": "System.Boolean",
            "FieldLength": 2
        },
        "ActiveInterests": {
            "FieldRight": {
                "Mask": "Update",
                "Reason": ""
            },
            "FieldType": "System.Int32",
            "FieldLength": 0
        },
        "ActiveStatusMonitorId": {
            "FieldRight": {
                "Mask": "Read",
                "Reason": ""
            },
            "FieldType": "System.Int32",
            "FieldLength": 0
        },
        "SupportAssociate": {
            "FieldRight": {
                "Mask": "Update",
                "Reason": ""
            },
            "FieldType": "SuperOffice.CRM.Services.Associate",
            "FieldLength": 4
        },
        "TicketPriority": {
            "FieldRight": {
                "Mask": "Update",
                "Reason": ""
            },
            "FieldType": "SuperOffice.CRM.Services.TicketPriority",
            "FieldLength": 4
        },
        "CustomerLanguage": {
            "FieldRight": {
                "Mask": "Update",
                "Reason": ""
            },
            "FieldType": "SuperOffice.CRM.Services.CustomerLanguage",
            "FieldLength": 4
        },
        "SupportPerson": {
            "FieldRight": {
                "Mask": "Update",
                "Reason": ""
            },
            "FieldType": "SuperOffice.CRM.Services.Person",
            "FieldLength": 4
        },
        "Address.Zipcode": {
            "FieldRight": {
                "Mask": "Update",
                "Reason": ""
            },
            "FieldType": "System.String",
            "FieldLength": 11
        },
        "Address.City": {
            "FieldRight": {
                "Mask": "Update",
                "Reason": ""
            },
            "FieldType": "System.String",
            "FieldLength": 79
        },
        "Address.State": {
            "FieldRight": {
                "Mask": "Update",
                "Reason": ""
            },
            "FieldType": "System.String",
            "FieldLength": 5
        },
        "Address.County": {
            "FieldRight": {
                "Mask": "Update",
                "Reason": ""
            },
            "FieldType": "System.String",
            "FieldLength": 29
        },
        "Address.Address1": {
            "FieldRight": {
                "Mask": "Update",
                "Reason": ""
            },
            "FieldType": "System.String",
            "FieldLength": 79
        },
        "Address.Address2": {
            "FieldRight": {
                "Mask": "Update",
                "Reason": ""
            },
            "FieldType": "System.String",
            "FieldLength": 79
        },
        "Address.Address3": {
            "FieldRight": {
                "Mask": "Update",
                "Reason": ""
            },
            "FieldType": "System.String",
            "FieldLength": 79
        },
        "Address": {
            "FieldRight": {
                "Mask": "Update",
                "Reason": ""
            },
            "FieldType": "",
            "FieldLength": 0
        },
        "BounceEmails": {
            "FieldRight": {
                "Mask": "Update",
                "Reason": ""
            },
            "FieldType": "",
            "FieldLength": 0
        },
        "UserDefinedFields.SuperOffice:1": {
            "FieldRight": {
                "Mask": "Update",
                "Reason": ""
            },
            "FieldType": "System.String",
            "FieldLength": -1
        },
        "UserDefinedFields.SuperOffice:2": {
            "FieldRight": {
                "Mask": "Update",
                "Reason": ""
            },
            "FieldType": "System.String",
            "FieldLength": -1
        },
        "UserDefinedFields.SuperOffice:3": {
            "FieldRight": {
                "Mask": "Update",
                "Reason": ""
            },
            "FieldType": "System.String",
            "FieldLength": -1
        },
        "UserDefinedFields.SuperOffice:4": {
            "FieldRight": {
                "Mask": "Update",
                "Reason": ""
            },
            "FieldType": "System.String",
            "FieldLength": -1
        },
        "UserDefinedFields.SuperOffice:5": {
            "FieldRight": {
                "Mask": "Update",
                "Reason": ""
            },
            "FieldType": "System.String",
            "FieldLength": -1
        },
        "UserDefinedFields.SuperOffice:6": {
            "FieldRight": {
                "Mask": "Update",
                "Reason": ""
            },
            "FieldType": "System.String",
            "FieldLength": -1
        },
        "UserDefinedFields.SuperOffice:7": {
            "FieldRight": {
                "Mask": "Update",
                "Reason": ""
            },
            "FieldType": "System.String",
            "FieldLength": -1
        },
        "UserDefinedFields.SuperOffice:8": {
            "FieldRight": {
                "Mask": "Update",
                "Reason": ""
            },
            "FieldType": "System.String",
            "FieldLength": -1
        },
        "UserDefinedFields.SuperOffice:9": {
            "FieldRight": {
                "Mask": "Update",
                "Reason": ""
            },
            "FieldType": "System.String",
            "FieldLength": -1
        },
        "UserDefinedFields.SuperOffice:10": {
            "FieldRight": {
                "Mask": "Update",
                "Reason": ""
            },
            "FieldType": "System.String",
            "FieldLength": -1
        },
        "UserDefinedFields.SuperOffice:11": {
            "FieldRight": {
                "Mask": "Update",
                "Reason": ""
            },
            "FieldType": "System.String",
            "FieldLength": -1
        },
        "UserDefinedFields.SuperOffice:12": {
            "FieldRight": {
                "Mask": "Update",
                "Reason": ""
            },
            "FieldType": "System.String",
            "FieldLength": -1
        },
        "UserDefinedFields.SuperOffice:13": {
            "FieldRight": {
                "Mask": "Update",
                "Reason": ""
            },
            "FieldType": "System.String",
            "FieldLength": -1
        },
        "Emails": {
            "FieldRight": {
                "Mask": "Update",
                "Reason": ""
            },
            "FieldType": "SuperOffice.CRM.Services.EntityElement[]",
            "FieldLength": 0
        },
        "Urls": {
            "FieldRight": {
                "Mask": "Update",
                "Reason": ""
            },
            "FieldType": "SuperOffice.CRM.Services.EntityElement[]",
            "FieldLength": 0
        },
        "Phones": {
            "FieldRight": {
                "Mask": "Update",
                "Reason": ""
            },
            "FieldType": "SuperOffice.CRM.Services.EntityElement[]",
            "FieldLength": 0
        },
        "Faxes": {
            "FieldRight": {
                "Mask": "Update",
                "Reason": ""
            },
            "FieldType": "SuperOffice.CRM.Services.EntityElement[]",
            "FieldLength": 0
        }
    },
    "_Links": {
        "Self": "http://crm-sod.superoffice.com/Playground/api/v1/Contact/3",
        "Self.Simple": "http://crm-sod.superoffice.com/Playground/api/v1/Contact/3/Simple",
        "UdefLayout": "http://crm-sod.superoffice.com/Playground/api/v1/Contact/UdefLayout/Published",
        "Interests.List": "http://crm-sod.superoffice.com/Playground/api/v1/MDOList/contint",
        "Associate.List": "http://crm-sod.superoffice.com/Playground/api/v1/MDOList/associate",
        "Business.List": "http://crm-sod.superoffice.com/Playground/api/v1/MDOList/business",
        "Category.List": "http://crm-sod.superoffice.com/Playground/api/v1/MDOList/category",
        "Country.List": "http://crm-sod.superoffice.com/Playground/api/v1/MDOList/country",
        "SupportAssociate.List": "http://crm-sod.superoffice.com/Playground/api/v1/MDOList/associate",
        "TicketPriority.List": "http://crm-sod.superoffice.com/Playground/api/v1/MDOList/ticketpriority",
        "Archive": "http://crm-sod.superoffice.com/Playground/api/v1/Contact",
        "Archive.Activities": "http://crm-sod.superoffice.com/Playground/api/v1/Contact/3/Activities",
        "Archive.Appointments": "http://crm-sod.superoffice.com/Playground/api/v1/Contact/3/Appointments",
        "Archive.Documents": "http://crm-sod.superoffice.com/Playground/api/v1/Contact/3/Documents",
        "Archive.Projects": "http://crm-sod.superoffice.com/Playground/api/v1/Contact/3/Projects",
        "Archive.Sales": "http://crm-sod.superoffice.com/Playground/api/v1/Contact/3/Sales",
        "Archive.Persons": "http://crm-sod.superoffice.com/Playground/api/v1/Contact/3/Persons",
        "Archive.Relations": "http://crm-sod.superoffice.com/Playground/api/v1/Contact/3/Relations",
        "Archive.Tickets": "http://crm-sod.superoffice.com/Playground/api/v1/Contact/3/Tickets"
    }
}