{
    "token_type": "Bearer",
    "access_token": "8A:Cust12345.AZuHwfgrRZPHqdjhQyay34ggAgAA8z5BnSYUSk4U4sdfr1Bjzycu0S1NC+xvghQ4VoUz9r6xpF2YAOCj0rb3LWnjLqllp3fYk8h2sxwc8d+5nb5bzGvHLHJ1UIRk38Ye4dPpmLSr4B8UaYNc9gs4Wgfgxqtii+o5fcB7lbVaVLFGmjUj1jgtIzVKiAR9eyMiWXL3dWMg+WM2Y0MOTsUrSb10kXkJ4g3M4TvH3rV4HTK3ohToxUleYvFbarx/8jeO7oLJfn3nth8NGtd1lJ",
    "expires_in": 3600,
    "id_token": "eyJ0eFor_Demonstration_PurposeszI1NiIsIng1dCI6IkZyZjdqRC1hc0dpRnFBREdUbVRKZkVxMTZZdyJ9.For_Demonstration_PurposesbSIsImh0dHA6Ly9zY2hlbWVzLnN1cGVyb2ZmaWNlLm5ldC9pZGVudGl0eS9hGl0eS9uZXRzZXJ2ZXJfdXJsIjoiaHR0cHM6Ly9zb2Quc3VwZXJvZmZpY2UuY29tL0N1c3QyNjc1OS9SZW1vdGUvThrOFE3RG1CZ28iLCJpYXQiOiIxNTQ2NjEzMTk4IiwiaXNzIjoiaHR0cHM6Ly9zb2Quc3VwZXJvZmZpY2UuY29tqStzCXqhSjd1u7FjsJhqr1xGLDqLzkOm9_0v0nWFHESjBuPhFPIdt6lmcCuy48HGg5G0eM1_3h6SESsukXe0hNMqp3ZHjm5dCEoxE4HziLWSdRZIUa6tkP6wfHDHU_XUJu7PHo8Wx5aG9IBPZ_r1Xd8mgmt6g"
}