{
    "ContactId": 0,
    "Name": "",
    "Department": "",
    "OrgNr": "",
    "Number1": "",
    "Number2": "10150",
    "UpdatedDate": "0001-01-01T00:00:00",
    "CreatedDate": "0001-01-01T00:00:00",
    "Emails": [
    ],
    "Interests": [
        {
            "Id": 2,
            "Name": "Prestisjekunde",
            "ToolTip": "Prestisjekunde",
            "Deleted": false,
            "Rank": 2,
            "Type": "contint",
            "ColorBlock": 0,
            "IconHint": "contint",
            "Selected": false,
            "LastChanged": "0001-01-01T00:00:00",
            "ChildItems": [
            ],
            "ExtraInfo": "",
            "StyleHint": "",
            "Hidden": false,
            "FullName": null,
            "TableRight": null,
            "FieldProperties": {
            }
        },
        {
            "Id": 1,
            "Name": "Referansekunde",
            "ToolTip": "Referansekunde",
            "Deleted": false,
            "Rank": 1,
            "Type": "contint",
            "ColorBlock": 0,
            "IconHint": "contint",
            "Selected": false,
            "LastChanged": "0001-01-01T00:00:00",
            "ChildItems": [
            ],
            "ExtraInfo": "",
            "StyleHint": "",
            "Hidden": false,
            "FullName": null,
            "TableRight": null,
            "FieldProperties": {
            }
        },
        {
            "Id": 3,
            "Name": "Storkunde",
            "ToolTip": "Storkunde",
            "Deleted": false,
            "Rank": 3,
            "Type": "contint",
            "ColorBlock": 0,
            "IconHint": "contint",
            "Selected": false,
            "LastChanged": "0001-01-01T00:00:00",
            "ChildItems": [
            ],
            "ExtraInfo": "",
            "StyleHint": "",
            "Hidden": false,
            "FullName": null,
            "TableRight": null,
            "FieldProperties": {
            }
        }
    ],
    "Urls": [
    ],
    "Phones": [
    ],
    "Faxes": [
    ],
    "Description": "",
    "UpdatedBy": null,
    "CreatedBy": {
        "AssociateId": 23,
        "Name": "TJE0",
        "PersonId": 159,
        "Rank": 0,
        "Tooltip": "",
        "Type": "InternalAssociate",
        "GroupIdx": 4,
        "FullName": "Tje0",
        "FormalName": "Tje0",
        "Deleted": false,
        "EjUserId": 2,
        "UserName": null,
        "TableRight": {
            "Mask": "Select, Update, Insert, Delete",
            "Reason": ""
        },
        "FieldProperties": {
        }
    },
    "Associate": {
        "AssociateId": 23,
        "Name": "TJE0",
        "PersonId": 159,
        "Rank": 0,
        "Tooltip": "",
        "Type": "InternalAssociate",
        "GroupIdx": 4,
        "FullName": "Tje0",
        "FormalName": "Tje0",
        "Deleted": false,
        "EjUserId": 2,
        "UserName": null,
        "TableRight": {
            "Mask": "Select, Update, Insert, Delete",
            "Reason": ""
        },
        "FieldProperties": {
        }
    },
    "Business": {
        "Id": 7,
        "Value": "Hotell/Restaurant",
        "Tooltip": "",
        "TableRight": null,
        "FieldProperties": {
        }
    },
    "Category": {
        "Id": 9,
        "Value": "MarketingItem 1",
        "Tooltip": "",
        "TableRight": null,
        "FieldProperties": {
        }
    },
    "Country": {
        "CountryId": 578,
        "Name": "Norway",
        "CurrencyId": 76,
        "EnglishName": "Norway",
        "TwoLetterISOCountry": "NO",
        "ThreeLetterISOCountry": "NOR",
        "ImageDescription": null,
        "OrgNrText": "VAT No.:",
        "InterAreaPrefix": "",
        "DialInPrefix": "47",
        "ZipPrefix": "N",
        "DomainName": "NO",
        "AddressLayoutId": 4,
        "DomesticAddressLayoutId": 4,
        "ForeignAddressLayoutId": 4,
        "Rank": 158,
        "Tooltip": "Norway",
        "Deleted": false,
        "TableRight": null,
        "FieldProperties": {
        }
    },
    "Persons": [
    ],
    "NoMailing": false,
    "Kananame": "",
    "Xstop": false,
    "ActiveInterests": 0,
    "GroupId": 4,
    "ActiveStatusMonitorId": 0,
    "SupportAssociate": null,
    "TicketPriority": {
        "Id": 0,
        "Value": "",
        "Tooltip": "Unknown",
        "TableRight": null,
        "FieldProperties": {
        }
    },
    "CustomerLanguage": {
        "Id": 0,
        "Value": "",
        "Tooltip": "Tooltip needs implementation...",
        "TableRight": null,
        "FieldProperties": {
        }
    },
    "Deleted": 0,
    "DbiAgentId": 0,
    "DbiLastSyncronized": "0001-01-01T00:00:00",
    "DbiKey": "",
    "DbiLastModified": "0001-01-01T00:00:00",
    "SupportPerson": null,
    "Address": {
        "Wgs84Latitude": 0,
        "Wgs84Longitude": 0,
        "LocalizedAddress": [
            [
                {
                    "Name": "StreetAddress1",
                    "Value": "",
                    "Tooltip": "",
                    "Label": "SR_AL_STREET",
                    "ValueLength": 80,
                    "AddressType": "ContactStreetAddress",
                    "TableRight": null,
                    "FieldProperties": {
                    }
                }
            ],
            [
                {
                    "Name": "StreetZipcode",
                    "Value": "",
                    "Tooltip": "",
                    "Label": "SR_AL_POSTCODECITY",
                    "ValueLength": 9,
                    "AddressType": "ContactStreetAddress",
                    "TableRight": null,
                    "FieldProperties": {
                    }
                },
                {
                    "Name": "StreetCity",
                    "Value": "",
                    "Tooltip": "",
                    "Label": "",
                    "ValueLength": 30,
                    "AddressType": "ContactStreetAddress",
                    "TableRight": null,
                    "FieldProperties": {
                    }
                }
            ],
            [
                {
                    "Name": "PostalAddress1",
                    "Value": "",
                    "Tooltip": "",
                    "Label": "SR_AL_POBOX",
                    "ValueLength": 80,
                    "AddressType": "ContactPostalAddress",
                    "TableRight": null,
                    "FieldProperties": {
                    }
                }
            ],
            [
                {
                    "Name": "PostalZipcode",
                    "Value": "",
                    "Tooltip": "",
                    "Label": "SR_AL_POSTCODECITY",
                    "ValueLength": 9,
                    "AddressType": "ContactPostalAddress",
                    "TableRight": null,
                    "FieldProperties": {
                    }
                },
                {
                    "Name": "PostalCity",
                    "Value": "",
                    "Tooltip": "",
                    "Label": "",
                    "ValueLength": 30,
                    "AddressType": "ContactPostalAddress",
                    "TableRight": null,
                    "FieldProperties": {
                    }
                }
            ]
        ],
        "Street": {
            "AtypeIdx": "Unknown",
            "Address1": "",
            "Address2": "",
            "Address3": "",
            "City": "",
            "County": "",
            "State": "",
            "Zipcode": "",
            "Formatted": ""
        },
        "Postal": {
            "AtypeIdx": "Unknown",
            "Address1": "",
            "Address2": "",
            "Address3": "",
            "City": "",
            "County": "",
            "State": "",
            "Zipcode": "",
            "Formatted": ""
        },
        "Formatted": "",
        "TableRight": {
            "Mask": "Select, Update, Insert, Delete",
            "Reason": ""
        },
        "FieldProperties": {
            "zipcode": {
                "FieldRight": {
                    "Mask": "Update",
                    "Reason": ""
                },
                "FieldType": "System.String",
                "FieldLength": 11
            },
            "city": {
                "FieldRight": {
                    "Mask": "Update",
                    "Reason": ""
                },
                "FieldType": "System.String",
                "FieldLength": 79
            },
            "state": {
                "FieldRight": {
                    "Mask": "Update",
                    "Reason": ""
                },
                "FieldType": "System.String",
                "FieldLength": 5
            },
            "county": {
                "FieldRight": {
                    "Mask": "Update",
                    "Reason": ""
                },
                "FieldType": "System.String",
                "FieldLength": 29
            },
            "address1": {
                "FieldRight": {
                    "Mask": "Update",
                    "Reason": ""
                },
                "FieldType": "System.String",
                "FieldLength": 79
            },
            "address2": {
                "FieldRight": {
                    "Mask": "Update",
                    "Reason": ""
                },
                "FieldType": "System.String",
                "FieldLength": 79
            },
            "address3": {
                "FieldRight": {
                    "Mask": "Update",
                    "Reason": ""
                },
                "FieldType": "System.String",
                "FieldLength": 79
            }
        }
    },
    "Source": 0,
    "ActiveErpLinks": 0,
    "BounceEmails": [
    ],
    "UserDefinedFields": {
        "SuperOffice:1": "defaultshorttext",
        "SuperOffice:2": "defaultlongtext",
        "SuperOffice:3": "[I:0]",
        "SuperOffice:4": "[D:01/01/0001 00:00:00.0000000]",
        "SuperOffice:5": "[D:01/01/0001 00:00:00.0000000]",
        "SuperOffice:6": "False",
        "SuperOffice:7": "[I:0]",
        "SuperOffice:7:DisplayText": "",
        "SuperOffice:7:DisplayTooltip": "",
        "SuperOffice:8": "[F:0]",
        "SuperOffice:9": "",
        "SuperOffice:10": "",
        "SuperOffice:11": "",
        "SuperOffice:12": "[I:0]",
        "SuperOffice:12:DisplayText": "",
        "SuperOffice:12:DisplayTooltip": "",
        "SuperOffice:13": "[I:0]",
        "SuperOffice:13:DisplayText": "",
        "SuperOffice:13:DisplayTooltip": ""
    },
    "ExtraFields": {
        "x_contact_integer": "[I:0]",
        "x_contact_hidden_integer": "[I:0]",
        "x_contact_default_integer": "[I:123]",
        "x_contact_float": "[F:0]",
        "x_contact_longtext": "",
        "x_contact_dropdown": "",
        "x_contact_date": "[DT:06/28/2021 15:06:56.1369599]",
        "x_contact_datetime": "[DT:01/01/0001 00:00:00.0000000]",
        "x_contact_time": "[DT:06/28/2021 00:00:00.0000000]",
        "x_contact_boolean": "[I:0]",
        "x_contact_timespan": "[I:0]",
        "x_contact_shorttext": "",
        "x_contact_short_dropdown": "",
        "x_contact_contact_relation": "[I:0]",
        "x_contact_contact_relation:DisplayText": "",
        "x_contact_request_relation": "[I:0]",
        "x_contact_request_relation:DisplayText": "",
        "x_contact_contact": "[I:0]",
        "x_contact_contact:DisplayText": "",
        "x_contact_link": ""
    },
    "CustomFields": {
        "x_contact_integer": "[I:0]",
        "x_contact_integer:org": "[I:0]",
        "x_contact_hidden_integer": "[I:0]",
        "x_contact_hidden_integer:org": "[I:0]",
        "x_contact_default_integer": "[I:123]",
        "x_contact_default_integer:org": "[I:123]",
        "x_contact_float": "[F:0]",
        "x_contact_float:org": "[F:0]",
        "x_contact_longtext": "",
        "x_contact_longtext:org": "",
        "x_contact_dropdown": "",
        "x_contact_dropdown:org": "",
        "x_contact_date": "[DT:06/28/2021 15:06:56.1369599]",
        "x_contact_date:org": "[DT:06/28/2021 15:06:56.1369599]",
        "x_contact_datetime": "[DT:01/01/0001 00:00:00.0000000]",
        "x_contact_datetime:org": "[DT:01/01/0001 00:00:00.0000000]",
        "x_contact_time": "[DT:06/28/2021 00:00:00.0000000]",
        "x_contact_time:org": "[DT:06/28/2021 00:00:00.0000000]",
        "x_contact_boolean": "[I:0]",
        "x_contact_boolean:org": "[I:0]",
        "x_contact_timespan": "[I:0]",
        "x_contact_timespan:org": "[I:0]",
        "x_contact_shorttext": "",
        "x_contact_shorttext:org": "",
        "x_contact_short_dropdown": "",
        "x_contact_short_dropdown:org": "",
        "x_contact_contact_relation": "[I:0]",
        "x_contact_contact_relation:org": "[I:0]",
        "x_contact_contact_relation:DisplayText": "",
        "x_contact_request_relation": "[I:0]",
        "x_contact_request_relation:org": "[I:0]",
        "x_contact_request_relation:DisplayText": "",
        "x_contact_contact": "[I:0]",
        "x_contact_contact:org": "[I:0]",
        "x_contact_contact:DisplayText": "",
        "x_contact_link": "",
        "x_contact_link:org": "",
        "SuperOffice:1": "defaultshorttext",
        "SuperOffice:1:org": "defaultshorttext",
        "SuperOffice:2": "defaultlongtext",
        "SuperOffice:2:org": "defaultlongtext",
        "SuperOffice:3": "[I:0]",
        "SuperOffice:3:org": "[I:0]",
        "SuperOffice:4": "[DT:01/01/0001 00:00:00.0000000]",
        "SuperOffice:4:org": "[DT:01/01/0001 00:00:00.0000000]",
        "SuperOffice:5": "[DT:01/01/0001 00:00:00.0000000]",
        "SuperOffice:5:org": "[DT:01/01/0001 00:00:00.0000000]",
        "SuperOffice:6": "[I:0]",
        "SuperOffice:6:org": "[I:0]",
        "SuperOffice:7": "[I:0]",
        "SuperOffice:7:org": "[I:0]",
        "SuperOffice:7:DisplayText": "",
        "SuperOffice:7:DisplayTooltip": "",
        "SuperOffice:8": "[F:0]",
        "SuperOffice:8:org": "[F:0]",
        "SuperOffice:9": "",
        "SuperOffice:9:org": "",
        "SuperOffice:10": "",
        "SuperOffice:10:org": "",
        "SuperOffice:11": "",
        "SuperOffice:11:org": "",
        "SuperOffice:12": "[I:0]",
        "SuperOffice:12:org": "[I:0]",
        "SuperOffice:12:DisplayText": "",
        "SuperOffice:12:DisplayTooltip": "",
        "SuperOffice:13": "[I:0]",
        "SuperOffice:13:org": "[I:0]",
        "SuperOffice:13:DisplayText": "",
        "SuperOffice:13:DisplayTooltip": ""
    },
    "TableRight": {
        "Mask": "Select, Update, Insert, Delete",
        "Reason": ""
    },
    "FieldProperties": {
        "ContactId": {
            "FieldRight": {
                "Mask": "Update",
                "Reason": ""
            },
            "FieldType": "System.Int32",
            "FieldLength": 4
        },
        "Name": {
            "FieldRight": {
                "Mask": "Update, UIHintMandatory",
                "Reason": "[SR_MANDATORY_FIELD_1281]"
            },
            "FieldType": "System.String",
            "FieldLength": 219
        },
        "Department": {
            "FieldRight": {
                "Mask": "Update",
                "Reason": ""
            },
            "FieldType": "System.String",
            "FieldLength": 219
        },
        "OrgNr": {
            "FieldRight": {
                "Mask": "Update",
                "Reason": ""
            },
            "FieldType": "System.String",
            "FieldLength": 49
        },
        "Number1": {
            "FieldRight": {
                "Mask": "Update",
                "Reason": ""
            },
            "FieldType": "System.String",
            "FieldLength": 49
        },
        "Number2": {
            "FieldRight": {
                "Mask": "Update, UIHintMandatory",
                "Reason": "[SR_MANDATORY_FIELD_1285]"
            },
            "FieldType": "System.String",
            "FieldLength": 49
        },
        "UpdatedDate": {
            "FieldRight": {
                "Mask": "Update",
                "Reason": ""
            },
            "FieldType": "System.DateTime",
            "FieldLength": 16
        },
        "CreatedDate": {
            "FieldRight": {
                "Mask": "Update",
                "Reason": ""
            },
            "FieldType": "System.DateTime",
            "FieldLength": 16
        },
        "Kananame": {
            "FieldRight": {
                "Mask": "Update",
                "Reason": ""
            },
            "FieldType": "System.String",
            "FieldLength": 219
        },
        "GroupId": {
            "FieldRight": {
                "Mask": "Update",
                "Reason": ""
            },
            "FieldType": "System.Int32",
            "FieldLength": 4
        },
        "Deleted": {
            "FieldRight": {
                "Mask": "Update",
                "Reason": ""
            },
            "FieldType": "System.Int16",
            "FieldLength": 2
        },
        "DbiAgentId": {
            "FieldRight": {
                "Mask": "Update",
                "Reason": ""
            },
            "FieldType": "System.Int32",
            "FieldLength": 4
        },
        "DbiLastSyncronized": {
            "FieldRight": {
                "Mask": "Update",
                "Reason": ""
            },
            "FieldType": "System.DateTime",
            "FieldLength": 16
        },
        "DbiKey": {
            "FieldRight": {
                "Mask": "Update",
                "Reason": ""
            },
            "FieldType": "System.String",
            "FieldLength": 255
        },
        "DbiLastModified": {
            "FieldRight": {
                "Mask": "Update",
                "Reason": ""
            },
            "FieldType": "System.DateTime",
            "FieldLength": 16
        },
        "Source": {
            "FieldRight": {
                "Mask": "Update",
                "Reason": ""
            },
            "FieldType": "System.Int16",
            "FieldLength": 2
        },
        "ActiveErpLinks": {
            "FieldRight": {
                "Mask": "Update",
                "Reason": ""
            },
            "FieldType": "System.Int32",
            "FieldLength": 4
        },
        "Interests": {
            "FieldRight": {
                "Mask": "Update",
                "Reason": ""
            },
            "FieldType": "",
            "FieldLength": 0
        },
        "Description": {
            "FieldRight": {
                "Mask": "Update",
                "Reason": ""
            },
            "FieldType": "System.String",
            "FieldLength": 2047
        },
        "UpdatedBy": {
            "FieldRight": {
                "Mask": "Update",
                "Reason": ""
            },
            "FieldType": "SuperOffice.CRM.Services.Associate",
            "FieldLength": 4
        },
        "CreatedBy": {
            "FieldRight": {
                "Mask": "Update",
                "Reason": ""
            },
            "FieldType": "SuperOffice.CRM.Services.Associate",
            "FieldLength": 4
        },
        "Associate": {
            "FieldRight": {
                "Mask": "Update",
                "Reason": ""
            },
            "FieldType": "SuperOffice.CRM.Services.Associate",
            "FieldLength": 4
        },
        "Business": {
            "FieldRight": {
                "Mask": "Update, UIHintMandatory",
                "Reason": "[SR_MANDATORY_FIELD_1288]"
            },
            "FieldType": "SuperOffice.CRM.Services.Business",
            "FieldLength": 4
        },
        "Category": {
            "FieldRight": {
                "Mask": "Update, UIHintMandatory",
                "Reason": "[SR_MANDATORY_FIELD_1289]"
            },
            "FieldType": "SuperOffice.CRM.Services.Category",
            "FieldLength": 4
        },
        "Country": {
            "FieldRight": {
                "Mask": "Update",
                "Reason": ""
            },
            "FieldType": "SuperOffice.CRM.Services.Country",
            "FieldLength": 4
        },
        "Persons": {
            "FieldRight": {
                "Mask": "Update",
                "Reason": ""
            },
            "FieldType": "",
            "FieldLength": 0
        },
        "NoMailing": {
            "FieldRight": {
                "Mask": "Update",
                "Reason": ""
            },
            "FieldType": "System.Boolean",
            "FieldLength": 2
        },
        "Xstop": {
            "FieldRight": {
                "Mask": "Update",
                "Reason": ""
            },
            "FieldType": "System.Boolean",
            "FieldLength": 2
        },
        "ActiveInterests": {
            "FieldRight": {
                "Mask": "Update",
                "Reason": ""
            },
            "FieldType": "System.Int32",
            "FieldLength": 0
        },
        "ActiveStatusMonitorId": {
            "FieldRight": {
                "Mask": "Read",
                "Reason": ""
            },
            "FieldType": "System.Int32",
            "FieldLength": 0
        },
        "SupportAssociate": {
            "FieldRight": {
                "Mask": "Update",
                "Reason": ""
            },
            "FieldType": "SuperOffice.CRM.Services.Associate",
            "FieldLength": 4
        },
        "TicketPriority": {
            "FieldRight": {
                "Mask": "Update",
                "Reason": ""
            },
            "FieldType": "SuperOffice.CRM.Services.TicketPriority",
            "FieldLength": 4
        },
        "CustomerLanguage": {
            "FieldRight": {
                "Mask": "Update",
                "Reason": ""
            },
            "FieldType": "SuperOffice.CRM.Services.CustomerLanguage",
            "FieldLength": 4
        },
        "SupportPerson": {
            "FieldRight": {
                "Mask": "Update",
                "Reason": ""
            },
            "FieldType": "SuperOffice.CRM.Services.Person",
            "FieldLength": 4
        },
        "Address.Zipcode": {
            "FieldRight": {
                "Mask": "Update",
                "Reason": ""
            },
            "FieldType": "System.String",
            "FieldLength": 11
        },
        "Address.City": {
            "FieldRight": {
                "Mask": "Update",
                "Reason": ""
            },
            "FieldType": "System.String",
            "FieldLength": 79
        },
        "Address.State": {
            "FieldRight": {
                "Mask": "Update",
                "Reason": ""
            },
            "FieldType": "System.String",
            "FieldLength": 5
        },
        "Address.County": {
            "FieldRight": {
                "Mask": "Update",
                "Reason": ""
            },
            "FieldType": "System.String",
            "FieldLength": 29
        },
        "Address.Address1": {
            "FieldRight": {
                "Mask": "Update",
                "Reason": ""
            },
            "FieldType": "System.String",
            "FieldLength": 79
        },
        "Address.Address2": {
            "FieldRight": {
                "Mask": "Update",
                "Reason": ""
            },
            "FieldType": "System.String",
            "FieldLength": 79
        },
        "Address.Address3": {
            "FieldRight": {
                "Mask": "Update",
                "Reason": ""
            },
            "FieldType": "System.String",
            "FieldLength": 79
        },
        "Address": {
            "FieldRight": {
                "Mask": "Update",
                "Reason": ""
            },
            "FieldType": "",
            "FieldLength": 0
        },
        "BounceEmails": {
            "FieldRight": {
                "Mask": "Update",
                "Reason": ""
            },
            "FieldType": "",
            "FieldLength": 0
        },
        "UserDefinedFields.SuperOffice:1": {
            "FieldRight": {
                "Mask": "Update",
                "Reason": ""
            },
            "FieldType": "System.String",
            "FieldLength": -1
        },
        "UserDefinedFields.SuperOffice:2": {
            "FieldRight": {
                "Mask": "Update",
                "Reason": ""
            },
            "FieldType": "System.String",
            "FieldLength": -1
        },
        "UserDefinedFields.SuperOffice:3": {
            "FieldRight": {
                "Mask": "Update",
                "Reason": ""
            },
            "FieldType": "System.String",
            "FieldLength": -1
        },
        "UserDefinedFields.SuperOffice:4": {
            "FieldRight": {
                "Mask": "Update",
                "Reason": ""
            },
            "FieldType": "System.String",
            "FieldLength": -1
        },
        "UserDefinedFields.SuperOffice:5": {
            "FieldRight": {
                "Mask": "Update",
                "Reason": ""
            },
            "FieldType": "System.String",
            "FieldLength": -1
        },
        "UserDefinedFields.SuperOffice:6": {
            "FieldRight": {
                "Mask": "Update",
                "Reason": ""
            },
            "FieldType": "System.String",
            "FieldLength": -1
        },
        "UserDefinedFields.SuperOffice:7": {
            "FieldRight": {
                "Mask": "Update",
                "Reason": ""
            },
            "FieldType": "System.String",
            "FieldLength": -1
        },
        "UserDefinedFields.SuperOffice:8": {
            "FieldRight": {
                "Mask": "Update",
                "Reason": ""
            },
            "FieldType": "System.String",
            "FieldLength": -1
        },
        "UserDefinedFields.SuperOffice:9": {
            "FieldRight": {
                "Mask": "Update",
                "Reason": ""
            },
            "FieldType": "System.String",
            "FieldLength": -1
        },
        "UserDefinedFields.SuperOffice:10": {
            "FieldRight": {
                "Mask": "Update",
                "Reason": ""
            },
            "FieldType": "System.String",
            "FieldLength": -1
        },
        "UserDefinedFields.SuperOffice:11": {
            "FieldRight": {
                "Mask": "Update",
                "Reason": ""
            },
            "FieldType": "System.String",
            "FieldLength": -1
        },
        "UserDefinedFields.SuperOffice:12": {
            "FieldRight": {
                "Mask": "Update",
                "Reason": ""
            },
            "FieldType": "System.String",
            "FieldLength": -1
        },
        "UserDefinedFields.SuperOffice:13": {
            "FieldRight": {
                "Mask": "Update",
                "Reason": ""
            },
            "FieldType": "System.String",
            "FieldLength": -1
        },
        "Emails": {
            "FieldRight": {
                "Mask": "Update",
                "Reason": ""
            },
            "FieldType": "SuperOffice.CRM.Services.EntityElement[]",
            "FieldLength": 0
        },
        "Urls": {
            "FieldRight": {
                "Mask": "Update",
                "Reason": ""
            },
            "FieldType": "SuperOffice.CRM.Services.EntityElement[]",
            "FieldLength": 0
        },
        "Phones": {
            "FieldRight": {
                "Mask": "Update",
                "Reason": ""
            },
            "FieldType": "SuperOffice.CRM.Services.EntityElement[]",
            "FieldLength": 0
        },
        "Faxes": {
            "FieldRight": {
                "Mask": "Update",
                "Reason": ""
            },
            "FieldType": "SuperOffice.CRM.Services.EntityElement[]",
            "FieldLength": 0
        }
    }
}