<svg
   xmlns:dc="http://purl.org/dc/elements/1.1/"
   xmlns:cc="http://creativecommons.org/ns#"
   xmlns:rdf="http://www.w3.org/1999/02/22-rdf-syntax-ns#"
   xmlns:svg="http://www.w3.org/2000/svg"
   xmlns="http://www.w3.org/2000/svg"
   xmlns:sodipodi="http://sodipodi.sourceforge.net/DTD/sodipodi-0.dtd"
   xmlns:inkscape="http://www.inkscape.org/namespaces/inkscape"
   viewBox="0 0 700.00001 700">
  <g
     inkscape:label="Layer 1"
     inkscape:groupmode="layer"
     id="layer1"
     transform="translate(1252.3164,-304.67969)">
    <path
       style="opacity:1;fill:white;fill-opacity:1;stroke:none;stroke-width:1;stroke-miterlimit:4;stroke-dasharray:none;stroke-opacity:1"
       d="m -902.3164,304.67969 -28.04007,302.41272 -115.18233,-95.63509 95.63512,115.1823 -302.41272,28.04007 302.41348,28.03931 -95.63588,115.1823 115.18233,-95.63433 28.04007,302.41273 28.03931,-302.41349 115.1823,95.63509 -95.63509,-115.1823 302.41348,-28.03931 -302.41272,-28.04007 95.63433,-115.1823 -115.1823,95.63586 -28.03931,-302.41349 z"
       id="path4140"
       inkscape:connector-curvature="0" />
  </g>
</svg>
