<?xml version="1.0" encoding="UTF-8" standalone="no"?>
<svg
   xmlns:dc="http://purl.org/dc/elements/1.1/"
   xmlns:cc="http://creativecommons.org/ns#"
   xmlns:rdf="http://www.w3.org/1999/02/22-rdf-syntax-ns#"
   xmlns:svg="http://www.w3.org/2000/svg"
   xmlns="http://www.w3.org/2000/svg"
   xmlns:sodipodi="http://sodipodi.sourceforge.net/DTD/sodipodi-0.dtd"
   xmlns:inkscape="http://www.inkscape.org/namespaces/inkscape"
   id="svg1"
   width="16"
   height="16"
   version="1.1"
   sodipodi:docname="align-sel-as-group-symbolic.svg"
   inkscape:version="1.0alpha2 (e9298ea62f, 2019-07-05, custom)">
<style id="style0001">
.success{fill:#33d17a}
.warning{fill:#f57900}
.danger{fill:#cc0000}
</style>

  
<metadata
     id="metadata41">
    <rdf:RDF>
      <cc:Work
         rdf:about="">
        <dc:format>image/svg+xml</dc:format>
        <dc:type
           rdf:resource="http://purl.org/dc/dcmitype/StillImage" />
        <dc:title></dc:title>
      </cc:Work>
    </rdf:RDF>
  </metadata>
  <sodipodi:namedview
     inkscape:snap-global="false"
     id="base"
     showgrid="true"
     inkscape:zoom="19.003262"
     inkscape:cx="11.963599"
     inkscape:cy="10.928958"
     inkscape:current-layer="svg1"
     inkscape:document-rotation="0"
     inkscape:window-width="1360"
     inkscape:window-height="704"
     inkscape:window-x="0"
     inkscape:window-y="27"
     inkscape:window-maximized="1">
    <inkscape:grid
       id="GridFromPre046Settings"
       type="xygrid"
       originx="0pt"
       originy="0pt"
       spacingx="1pt"
       spacingy="1pt"
       color="#3f3fff"
       empcolor="#3f3fff"
       opacity="0.15"
       empopacity="0.38"
       empspacing="5" />
  </sodipodi:namedview>
  <defs
     id="defs3">
    <linearGradient
       id="linearGradient5704">
      <stop
         id="stop5706"
         offset="0"
         style="stop-color:#5a5a5a;stop-opacity:1" />
      <stop
         id="stop5708"
         offset="1"
         style="stop-color:#000000;stop-opacity:1" />
    </linearGradient>
    <linearGradient
       id="linearGradient5740">
      <stop
         id="stop5742"
         offset="0"
         style="stop-color:#ffffff;stop-opacity:1" />
      <stop
         id="stop5744"
         offset="1"
         style="stop-color:#98b6d3;stop-opacity:1" />
    </linearGradient>
    <linearGradient
       id="linearGradient6684">
      <stop
         id="stop6686"
         offset="0"
         style="stop-color:#ffbf00;stop-opacity:1" />
      <stop
         id="stop6688"
         offset="1"
         style="stop-color:#ffffff;stop-opacity:1" />
    </linearGradient>
  </defs>
  <rect
     style="opacity:0"
     y="0"
     x="0"
     width="16"
     id="rect5073"
     height="16" />
  <path
     inkscape:connector-curvature="0"
     id="rect22040"
     d="m 14.2985,0.60807436 h 1 V 15.274447 h -1 z"
     style="opacity:1;stroke-width:0.898975"
     class="success" />
  <path
     inkscape:connector-curvature="0"
     id="rect22042"
     d="m 5.9142579,0.6812329 h 7.3331861 v 3.819367 H 5.9142579 Z"
     style="opacity:1;stroke-width:0.785699" />
  <path
     inkscape:connector-curvature="0"
     id="rect22044"
     d="M 4.6770941,7.5966962 H 12.374849 V 9.8883261 H 4.6770941 Z"
     style="opacity:1;stroke-width:0.842155" />
  <path
     inkscape:connector-curvature="0"
     id="rect22046"
     d="m 2.780854,11.559104 h 7.660579 v 3.670992 H 2.780854 Z"
     style="opacity:1;stroke-width:0.861206" />
  <path
     style="opacity:1;stroke-width:0.898975"
     d="M 0.68758012,0.61656136 H 1.6875801 V 15.282934 H 0.68758012 Z"
     id="path64"
     inkscape:connector-curvature="0"
     class="success" />
</svg>
