{
  "nodes" : [
    "https://blurtd.privex.io",
    "https://rpc.blurt.world",
    "https://api.blurt.blog",
    "https://rpc.blurt.buzz",
    "https://api.blurtworld.com"
  ],
  "blurt": {
    "nodes" : [
      "https://blurtd.privex.io",
      "https://rpc.blurt.world",
      "https://api.blurt.blog",
      "https://rpc.blurt.buzz",
      "https://api.blurtworld.com"
    ]
  },
  "steem": {
    "nodes" : [
      "https://api.steemit.com",
      "https://node.steem.ws",
      "https://this.piston.rocks"
    ]
  },
  "hive": {
    "nodes" : [
      "https://api.hive.blog",
      "https://rpc.ecency.com",
      "https://hived.privex.io"
    ]
  },
  "nodeErrorSwitch" : 3
}