// +heroku goVersion go1.17
module gitlab.com/bf86/lib/go/distributedlocker

go 1.17

require (
	github.com/bradfitz/gomemcache v0.0.0-20190913173617-a41fca850d0b
	github.com/go-redis/redis/v8 v8.11.4
)

require (
	github.com/cespare/xxhash/v2 v2.1.2 // indirect
	github.com/dgryski/go-rendezvous v0.0.0-20200823014737-9f7001d12a5f // indirect
	github.com/google/uuid v1.3.0
	golang.org/x/text v0.3.7 // indirect
)
