{
  "db_name": "SQLite",
  "query": "SELECT token, user_id,user_agent,\n             last_accessed as 'last_accessed:_' FROM session WHERE token = ?",
  "describe": {
    "columns": [
      {
        "name": "token",
        "ordinal": 0,
        "type_info": "Text"
      },
      {
        "name": "user_id",
        "ordinal": 1,
        "type_info": "Int64"
      },
      {
        "name": "user_agent",
        "ordinal": 2,
        "type_info": "Text"
      },
      {
        "name": "last_accessed:_",
        "ordinal": 3,
        "type_info": "Datetime"
      }
    ],
    "parameters": {
      "Right": 1
    },
    "nullable": [
      false,
      false,
      false,
      false
    ]
  },
  "hash": "6226e1dbabffdee0e7732f8922fb4a7980ab1cdea104d14f8303ecc3a883aec6"
}
