{
  "db_name": "SQLite",
  "query": "UPDATE user SET role = ? WHERE username = ?",
  "describe": {
    "columns": [],
    "parameters": {
      "Right": 2
    },
    "nullable": []
  },
  "hash": "2eb1067c90ad6dc7e4b673c291348ffb28a75c5a7756b52eb714a2565aeedf89"
}
