{
  "db_name": "SQLite",
  "query": "INSERT INTO session (token, user_id,user_agent,last_accessed ) VALUES (?,?,?,?)",
  "describe": {
    "columns": [],
    "parameters": {
      "Right": 4
    },
    "nullable": []
  },
  "hash": "cb7f746347f8db4f388c179456618ffef12a55725101c8f47bbf09849fcb6c96"
}
