{
  "db_name": "SQLite",
  "query": "SELECT category_name FROM recipe_category_mapping WHERE recipe_id = ? ORDER BY category_name",
  "describe": {
    "columns": [
      {
        "name": "category_name",
        "ordinal": 0,
        "type_info": "Text"
      }
    ],
    "parameters": {
      "Right": 1
    },
    "nullable": [
      false
    ]
  },
  "hash": "2c52b63675912a6338e6ba8c94f95e86a0689a3799a9ecbe568c542dfdcff7a6"
}
