<?xml version="1.0" standalone="no"?>
<!DOCTYPE svg PUBLIC "-//W3C//DTD SVG 20010904//EN"
 "http://www.w3.org/TR/2001/REC-SVG-20010904/DTD/svg10.dtd">
<svg version="1.0" xmlns="http://www.w3.org/2000/svg"
 width="383.000000pt" height="383.000000pt" viewBox="0 0 383.000000 383.000000"
 preserveAspectRatio="xMidYMid meet">
<metadata>
Created by potrace 1.11, written by Peter Selinger 2001-2013
</metadata>
<g transform="translate(0.000000,383.000000) scale(0.100000,-0.100000)"
fill="#000000" stroke="none">
<path d="M0 1915 l0 -1915 120 0 120 0 0 1915 0 1915 -120 0 -120 0 0 -1915z"/>
<path d="M3700 1915 l0 -1915 65 0 65 0 0 1915 0 1915 -65 0 -65 0 0 -1915z"/>
<path d="M1515 3799 c-132 -11 -289 -49 -392 -95 -17 -8 -38 -14 -46 -14 -9 0
-18 -4 -21 -9 -3 -5 -31 -21 -63 -37 -135 -65 -308 -214 -414 -354 -18 -25
-36 -47 -39 -50 -11 -9 -99 -170 -106 -193 -3 -12 -12 -29 -19 -37 -27 -33
-80 -225 -95 -343 -18 -149 -9 -390 19 -481 6 -17 22 -69 36 -116 43 -140 132
-309 214 -409 75 -92 177 -193 209 -208 19 -9 39 -28 44 -42 6 -14 24 -53 40
-87 16 -33 33 -89 39 -124 5 -36 14 -69 18 -75 4 -5 14 -32 21 -60 8 -27 20
-61 27 -75 7 -14 13 -31 13 -38 0 -8 6 -28 14 -45 8 -18 26 -61 41 -97 14 -36
30 -74 34 -85 5 -11 21 -51 36 -90 50 -127 68 -159 119 -212 28 -29 55 -53 60
-53 5 0 24 -11 42 -25 18 -14 38 -25 43 -25 12 0 149 -109 172 -136 26 -32
161 -135 210 -159 36 -19 63 -25 106 -24 57 1 58 1 19 10 -71 17 -174 80 -258
158 -103 96 -182 156 -264 201 -121 66 -137 86 -209 260 -14 36 -30 74 -35 85
-62 139 -170 455 -170 497 0 26 -16 68 -56 152 -17 34 -17 36 -5 36 5 0 26
-27 46 -60 20 -33 42 -60 50 -60 19 0 39 54 27 77 -11 20 -33 171 -31 212 1
23 2 22 11 -9 6 -19 13 -42 16 -50 3 -8 12 -42 21 -75 13 -50 20 -61 40 -63
13 -2 27 0 32 5 11 11 -8 174 -22 187 -12 13 -12 86 0 86 13 0 19 -21 27 -92
4 -35 9 -67 13 -73 3 -5 11 -32 16 -60 7 -33 16 -51 26 -53 27 -5 39 51 39
174 0 64 4 115 10 119 5 3 10 0 11 -7 17 -251 33 -375 50 -392 5 -6 9 -20 9
-32 0 -33 52 -72 108 -79 64 -9 74 -13 70 -28 -3 -8 -30 -13 -79 -15 -78 -3
-123 -18 -153 -51 -15 -16 -17 -29 -12 -62 6 -39 37 -96 61 -111 5 -3 30 -20
55 -38 49 -34 132 -88 163 -106 27 -16 97 -86 97 -97 0 -5 9 -22 21 -38 11
-16 25 -45 30 -64 5 -19 17 -41 25 -50 14 -13 21 -11 72 23 86 58 116 67 217
67 108 0 161 -23 188 -80 20 -42 41 -45 61 -7 17 33 68 80 116 107 30 17 54
20 161 20 123 0 126 -1 163 -29 45 -34 76 -82 76 -117 0 -15 8 -37 19 -50 17
-21 21 -22 49 -10 29 12 36 11 76 -13 55 -32 56 -32 56 -1 0 34 -51 65 -107
65 -40 0 -41 1 -48 38 -15 93 -118 162 -242 162 -75 0 -89 8 -71 43 15 30 -34
127 -64 127 -14 0 -9 -47 9 -77 14 -25 14 -32 2 -58 -9 -18 -26 -33 -44 -38
-54 -16 -99 -42 -141 -79 l-40 -37 -38 31 c-20 16 -54 34 -74 39 -52 12 -151
11 -233 -3 -67 -11 -70 -10 -94 12 -14 13 -29 39 -35 59 -9 32 -7 38 18 58 15
12 39 25 53 28 15 3 36 17 49 30 12 13 35 29 52 36 27 11 31 10 63 -21 19 -18
37 -46 40 -61 11 -48 28 -54 75 -24 23 15 45 35 47 46 6 23 21 25 29 4 4 -8
10 -15 15 -15 6 0 23 -10 39 -22 25 -18 33 -20 55 -10 14 6 34 26 45 44 20 32
20 45 5 96 -6 18 -4 22 15 22 12 0 34 8 48 18 15 10 32 22 39 25 6 4 33 -10
60 -31 64 -51 79 -58 138 -67 45 -6 128 -31 225 -67 184 -68 414 -245 486
-373 18 -33 38 -85 44 -115 6 -30 15 -64 20 -75 5 -11 11 -47 15 -80 12 -128
14 -135 42 -135 19 0 23 3 15 13 -6 7 -15 41 -21 77 -48 311 -55 327 -197 468
-57 56 -108 102 -114 102 -5 0 -32 16 -59 35 -26 19 -52 35 -56 35 -4 0 -19 9
-34 19 -33 24 -212 96 -261 105 -19 4 -46 11 -60 16 -14 5 -42 11 -62 15 -21
3 -43 11 -50 18 -7 7 -32 25 -56 41 -24 16 -45 33 -48 37 -2 4 10 28 26 53 24
35 30 55 28 83 -3 34 -6 38 -33 41 -16 1 -39 7 -50 12 -11 4 -33 11 -48 15
-37 8 -147 58 -147 66 0 4 36 26 80 49 44 22 109 60 143 82 79 53 292 265 343
343 67 101 156 297 169 370 4 22 11 45 15 50 26 36 44 313 29 459 -14 148 -34
221 -105 396 -54 131 -206 357 -287 426 -142 121 -222 178 -306 219 -42 21
-92 46 -112 56 -42 22 -103 39 -269 78 -93 22 -256 30 -385 20z m488 -81 c44
-12 75 -24 69 -26 -7 -2 -12 -10 -12 -18 0 -18 -2 -18 -85 11 -41 14 -71 30
-73 39 -4 21 5 20 101 -6z m-693 2 c0 -5 -7 -7 -15 -4 -8 4 -15 8 -15 10 0 2
7 4 15 4 8 0 15 -4 15 -10z m-55 -30 c-26 -29 -100 -70 -126 -70 -12 0 -30 -6
-38 -13 -20 -17 -96 -47 -119 -47 -10 0 -33 -11 -52 -25 -35 -25 -50 -31 -50
-17 0 7 82 61 155 103 51 29 204 88 229 89 18 0 18 -1 1 -20z m165 -10 c0 -12
10 -24 24 -29 13 -5 26 -18 30 -27 4 -10 4 -15 0 -12 -3 4 -13 1 -20 -7 -8 -8
-21 -12 -29 -8 -9 3 -22 0 -30 -7 -13 -11 -101 -39 -138 -44 -29 -4 -40 -21
-29 -43 11 -20 7 -25 -38 -53 -13 -8 -12 -11 5 -24 26 -20 43 -20 61 -1 21 21
38 19 64 -8 26 -27 36 -87 14 -87 -9 0 -14 11 -14 30 0 19 -7 33 -19 40 -25
13 -51 3 -49 -18 2 -32 -2 -52 -11 -52 -6 0 -9 12 -8 27 2 22 -3 29 -21 31
-13 2 -25 -3 -28 -13 -9 -22 -24 0 -24 33 0 20 -4 22 -22 16 -30 -9 -27 -5
-34 -52 -4 -32 -2 -44 15 -61 25 -25 27 -44 6 -61 -8 -7 -15 -21 -15 -31 0
-25 -12 -24 -28 1 -13 22 -44 17 -40 -8 2 -8 -3 -17 -10 -20 -9 -3 -13 3 -10
19 3 22 -1 24 -39 27 -35 3 -48 -2 -68 -22 -14 -14 -25 -34 -25 -44 0 -11 -7
-25 -15 -32 -8 -7 -15 -19 -15 -27 0 -8 -9 -28 -21 -44 -19 -27 -18 -34 5 -30
5 1 6 -5 3 -14 -4 -10 0 -15 12 -15 11 0 21 3 23 8 4 11 103 72 115 72 15 0
23 -51 12 -72 -5 -10 -9 -33 -7 -51 1 -22 -6 -45 -21 -66 -17 -24 -21 -35 -12
-44 16 -16 14 -44 -5 -51 -27 -10 -54 -7 -60 8 -6 17 -56 15 -62 -3 -2 -6 -10
-11 -18 -11 -8 0 -11 -7 -8 -17 4 -13 3 -15 -4 -5 -5 7 -20 15 -33 18 -13 2
-52 9 -87 16 -56 11 -67 10 -97 -6 -32 -17 -72 -16 -61 2 3 5 -1 26 -9 48 -8
21 -14 58 -15 80 0 42 -11 59 -42 65 -15 4 -14 9 8 54 55 108 152 242 213 296
35 30 67 64 72 77 5 13 13 21 18 17 5 -3 12 -1 15 4 3 5 15 7 26 4 11 -3 20 0
20 6 0 6 6 11 13 11 7 0 30 10 52 22 22 12 52 21 68 20 15 -1 27 2 27 8 0 5 7
10 15 10 8 0 34 11 59 25 25 14 50 25 56 25 18 0 96 40 119 61 14 13 28 18 42
14 13 -4 27 -1 39 10 10 9 23 14 28 11 5 -3 18 1 28 9 26 20 34 18 34 -5z
m375 3 c17 -3 48 -7 70 -9 59 -7 67 -9 98 -22 16 -7 32 -12 37 -12 5 0 10 -4
12 -10 2 -5 21 -12 44 -16 36 -5 42 -4 47 15 6 26 32 27 49 2 12 -17 120 -62
197 -81 18 -5 50 -24 70 -42 20 -19 56 -47 80 -63 114 -76 289 -321 356 -498
30 -81 31 -87 5 -87 -18 0 -19 -6 -16 -119 3 -112 4 -121 29 -151 31 -36 32
-43 12 -60 -9 -8 -28 -10 -54 -5 -37 6 -43 3 -87 -37 -85 -78 -114 -109 -114
-124 0 -11 -4 -12 -19 -4 -12 6 -29 7 -43 1 -13 -5 -36 -7 -51 -4 -27 5 -77
-19 -77 -37 0 -15 41 -38 81 -45 31 -6 40 -2 70 26 50 48 69 48 69 1 0 -28
-17 -66 -75 -161 -42 -69 -77 -127 -80 -129 -2 -2 -16 8 -32 22 -15 14 -33 26
-40 26 -7 0 -17 9 -23 20 -6 11 -17 20 -25 20 -8 0 -18 6 -22 13 -10 16 -64
51 -83 54 -29 4 -45 9 -57 16 -19 12 -16 -19 4 -38 9 -9 40 -34 69 -56 29 -22
58 -48 64 -58 15 -30 98 -71 140 -71 52 0 68 8 86 41 8 16 21 29 28 29 10 0 7
-16 -11 -67 -13 -38 -28 -81 -33 -96 -15 -47 -51 -117 -61 -117 -5 0 -9 -5 -9
-10 0 -12 -41 -73 -52 -78 -5 -2 -8 -34 -8 -72 l0 -68 -47 -41 c-26 -24 -54
-48 -62 -54 -9 -7 -27 -29 -41 -49 -14 -21 -30 -38 -36 -38 -6 0 -22 -10 -36
-23 -24 -22 -93 -46 -189 -65 -41 -8 -49 -6 -73 15 -23 20 -27 29 -20 51 10
38 7 51 -32 105 -29 40 -33 51 -24 68 6 11 9 33 5 49 -6 28 -27 40 -83 46 -13
2 -35 10 -48 19 -19 12 -29 13 -46 4 -12 -6 -46 -13 -77 -14 -31 -2 -76 -10
-99 -18 -41 -14 -46 -14 -80 6 -21 12 -39 24 -42 27 -3 3 -14 10 -24 16 -11 6
-24 19 -30 29 -6 11 -17 24 -24 30 -18 14 -23 91 -9 133 9 25 8 38 -1 52 -10
16 -7 24 15 50 14 18 37 36 50 41 13 5 33 25 44 44 12 19 24 35 28 35 4 0 24
23 44 50 30 40 43 50 65 50 26 -1 153 22 199 35 16 5 25 1 37 -18 14 -20 30
-26 94 -36 42 -7 84 -16 94 -21 12 -7 20 -3 31 13 8 13 35 28 63 36 27 8 56
18 64 22 35 16 86 38 103 43 13 4 17 16 17 48 0 48 -12 74 -29 64 -6 -4 -35
-8 -65 -10 -49 -2 -55 0 -65 21 -15 32 -14 33 9 33 22 0 63 23 92 53 10 9 25
17 33 17 28 0 15 38 -22 70 -44 36 -89 39 -86 5 1 -11 0 -14 -3 -7 -4 9 -14 6
-36 -9 -28 -21 -30 -25 -26 -74 4 -44 1 -54 -15 -64 -10 -7 -21 -10 -24 -7 -9
9 -43 -14 -43 -29 0 -22 -21 -18 -63 11 -60 40 -92 16 -41 -31 42 -39 13 -29
-34 11 -30 25 -46 33 -55 26 -6 -5 -33 -13 -59 -16 -34 -5 -49 -12 -53 -26 -3
-10 -15 -22 -26 -25 -10 -4 -17 -10 -15 -13 9 -14 -33 -56 -56 -57 -16 0 -23
-6 -22 -17 2 -22 -10 -23 -29 -4 -17 17 -30 117 -17 130 5 5 35 11 65 14 62 5
75 19 56 56 -7 12 -14 38 -16 58 -3 33 -1 36 15 26 20 -13 55 -3 45 12 -3 5 1
10 10 10 8 0 20 11 25 25 5 14 14 25 20 25 5 0 10 15 10 33 0 19 3 27 8 19 7
-9 19 -8 58 5 72 24 105 65 97 119 -2 16 -4 37 -4 47 0 9 -7 17 -15 17 -8 0
-14 -4 -14 -10 0 -5 -7 -7 -15 -4 -8 4 -15 15 -15 25 0 10 -4 19 -9 19 -5 0
-5 15 -1 36 6 27 5 37 -6 41 -25 9 -46 -5 -39 -27 4 -12 1 -28 -5 -36 -10 -11
-10 -27 -1 -74 7 -33 9 -65 6 -70 -9 -15 -42 -12 -49 5 -3 8 -15 15 -26 15
-18 0 -20 4 -14 23 4 12 11 25 16 28 5 3 9 8 8 10 -1 2 4 18 10 34 7 17 14 52
16 80 5 77 41 96 139 75 35 -7 37 -9 18 -15 -27 -9 -30 -25 -5 -32 10 -2 22
-14 27 -26 18 -39 42 -33 50 14 4 22 16 50 27 61 11 11 22 30 24 41 2 12 6 35
10 50 5 20 1 33 -11 47 -11 12 -13 20 -7 20 7 0 12 7 12 15 0 8 -4 15 -9 15
-5 0 -11 7 -15 15 -9 24 22 18 51 -11 14 -14 32 -23 40 -20 17 7 12 42 -5 39
-7 -2 -11 6 -9 19 1 16 -5 23 -30 30 -24 6 -33 14 -34 31 0 12 -3 16 -6 10 -7
-19 -20 -16 -26 7 -3 10 0 21 7 24 6 2 3 5 -7 5 -9 1 -23 13 -29 29 -7 15 -20
36 -30 48 -16 18 -18 29 -10 78 5 31 5 56 1 56 -4 0 -21 14 -37 30 -17 17 -37
30 -46 30 -8 0 -19 6 -23 13 -4 7 -54 28 -110 46 -127 42 -131 44 -113 66 12
15 25 16 90 10 41 -4 89 -10 105 -12z m-386 -377 c7 -8 11 -20 10 -28 -3 -27
1 -38 16 -38 18 0 20 -17 3 -23 -7 -2 -10 -7 -7 -11 4 -4 14 0 22 9 10 10 18
11 22 5 4 -6 15 -8 26 -5 14 5 19 2 19 -14 0 -11 5 -23 11 -27 7 -4 8 -20 4
-43 -10 -58 -16 -71 -30 -71 -17 0 -35 -31 -35 -59 0 -28 -47 -61 -86 -61 -21
0 -41 -8 -54 -22 -15 -17 -30 -22 -58 -20 -32 3 -41 -1 -60 -27 -32 -44 -43
-39 -35 17 6 51 44 112 70 112 23 0 53 29 46 46 -3 8 0 14 6 14 6 0 11 9 11
19 0 10 7 22 16 25 13 5 15 16 12 51 -5 39 -3 45 16 52 11 4 32 6 46 5 14 -1
19 1 13 4 -7 3 -13 14 -13 25 0 10 -6 19 -13 19 -7 0 -23 7 -35 16 -18 13 -21
19 -11 30 15 18 53 18 68 0z m-99 -22 c0 -9 -5 -14 -12 -12 -18 6 -21 28 -4
28 9 0 16 -7 16 -16z m-79 -16 c19 -29 -15 -148 -42 -148 -10 0 -21 -12 -27
-28 -13 -39 -39 -62 -68 -62 -19 0 -24 5 -24 24 0 14 5 28 10 31 8 5 8 11 0
20 -8 9 -8 15 0 20 5 3 10 -1 10 -9 0 -27 30 -18 71 21 38 36 53 83 27 83 -8
0 -13 14 -14 35 0 32 1 34 25 28 14 -3 29 -10 32 -15z m229 -8 c0 -5 -4 -10
-10 -10 -5 0 -10 5 -10 10 0 6 5 10 10 10 6 0 10 -4 10 -10z m-467 -110 c4
-16 -1 -24 -21 -33 -15 -6 -39 -19 -54 -30 -35 -23 -35 -14 -3 27 57 73 67 78
78 36z m697 -42 c0 -19 -2 -20 -10 -8 -13 19 -13 30 0 30 6 0 10 -10 10 -22z
m-1220 -212 c0 -14 -10 -30 -25 -40 -29 -19 -30 -17 -11 29 17 40 36 46 36 11z
m9 -100 c-13 -27 -29 -35 -29 -14 0 13 31 50 37 44 2 -2 -2 -15 -8 -30z m991
30 c0 -3 -4 -8 -10 -11 -5 -3 -10 -1 -10 4 0 6 5 11 10 11 6 0 10 -2 10 -4z
m-965 -76 c-9 -18 -19 -30 -21 -27 -3 3 2 19 11 37 9 18 19 30 21 27 3 -3 -2
-19 -11 -37z m-97 18 c7 -10 4 -20 -13 -40 -22 -26 -23 -26 -28 -6 -6 22 8 58
22 58 5 0 13 -6 19 -12z m528 -35 c-6 -13 -9 -14 -19 -3 -9 10 -9 13 1 17 6 3
13 12 13 21 1 14 2 14 6 -1 3 -10 2 -25 -1 -34z m-564 -78 c-12 -22 -27 -2
-18 22 5 12 10 13 17 6 7 -7 8 -17 1 -28z m1493 15 c0 -7 -6 -15 -12 -17 -8
-3 -13 4 -13 17 0 13 5 20 13 18 6 -3 12 -11 12 -18z m-253 -80 c13 -27 27
-50 32 -50 5 0 -1 -9 -14 -20 -13 -11 -32 -20 -43 -20 -18 0 -19 1 -4 18 12
13 14 26 7 62 -16 79 -11 81 22 10z m-72 -35 c0 -8 -4 -15 -10 -15 -5 0 -10 7
-10 15 0 8 5 15 10 15 6 0 10 -7 10 -15z m-1120 -212 c1 -10 9 -36 20 -58 11
-22 19 -45 20 -51 0 -6 21 -29 46 -52 37 -33 44 -44 36 -58 -6 -11 -6 -26 -1
-38 4 -12 13 -40 19 -64 6 -24 18 -46 26 -49 7 -3 14 -12 14 -19 0 -8 7 -17
15 -20 8 -4 15 -12 15 -19 0 -7 7 -18 15 -25 8 -6 14 -15 13 -18 0 -4 0 -27 1
-50 1 -35 5 -45 21 -49 11 -3 20 -9 20 -13 0 -4 11 -12 25 -18 13 -6 27 -23
31 -37 4 -18 13 -25 30 -25 14 0 28 -9 35 -22 7 -13 27 -38 45 -56 19 -18 34
-42 34 -53 0 -19 -1 -19 -22 -5 -30 21 -47 20 -74 -5 l-22 -21 -48 44 c-124
114 -263 335 -323 513 -30 91 -61 223 -56 240 3 8 7 22 10 30 6 22 55 20 55
-2z m2087 -19 c-3 -3 -12 -4 -19 -1 -8 3 -5 6 6 6 11 1 17 -2 13 -5z m-287
-65 c0 -11 -4 -17 -10 -14 -5 3 -10 13 -10 21 0 8 5 14 10 14 6 0 10 -9 10
-21z m387 -621 c-31 -44 -44 -58 -56 -58 -19 0 -12 14 25 53 39 40 57 43 31 5z
m-1340 -115 c-3 -10 -5 -2 -5 17 0 19 2 27 5 18 2 -10 2 -26 0 -35z m-315 -52
c3 -32 1 -38 -10 -29 -25 21 -34 48 -22 64 18 20 27 9 32 -35z m238 12 c0 -24
-17 -49 -26 -40 -4 4 -1 18 6 32 16 30 20 31 20 8z m77 -30 c-3 -10 -5 -2 -5
17 0 19 2 27 5 18 2 -10 2 -26 0 -35z m-177 -18 c0 -8 -4 -15 -10 -15 -5 0
-10 7 -10 15 0 8 5 15 10 15 6 0 10 -7 10 -15z m319 -375 c27 -14 39 -54 45
-153 5 -70 4 -87 -6 -81 -124 73 -174 120 -192 181 -6 18 -1 26 26 43 35 21
97 26 127 10z m802 -137 c12 -15 12 -16 -4 -10 -10 4 -25 7 -33 7 -9 0 -12 5
-9 10 9 15 31 12 46 -7z m-89 -18 c0 -5 -5 -11 -11 -13 -6 -2 -11 4 -11 13 0
9 5 15 11 13 6 -2 11 -8 11 -13z m83 -95 c3 -5 -1 -10 -9 -10 -9 0 -16 5 -16
10 0 6 4 10 9 10 6 0 13 -4 16 -10z m-544 -112 c7 -24 28 -62 46 -85 18 -24
33 -45 33 -48 0 -2 -9 -9 -19 -15 -18 -9 -23 -4 -46 42 -14 29 -40 70 -56 91
-32 40 -31 57 5 57 18 0 26 -9 37 -42z m852 -45 c-7 -2 -19 -2 -25 0 -7 3 -2
5 12 5 14 0 19 -2 13 -5z m50 0 c-7 -2 -19 -2 -25 0 -7 3 -2 5 12 5 14 0 19
-2 13 -5z"/>
<path d="M2113 3 c15 -2 39 -2 55 0 15 2 2 4 -28 4 -30 0 -43 -2 -27 -4z"/>
</g>
</svg>
