{
 "cards": [
  {
   "hidden": 0,
   "label": "Stock",
   "links": "[\n    {\n        \"label\": \"Warehouse\",\n        \"name\": \"Warehouse\",\n        \"onboard\": 1,\n        \"type\": \"doctype\"\n    },\n    {\n        \"label\": \"Brand\",\n        \"name\": \"Brand\",\n        \"onboard\": 1,\n        \"type\": \"doctype\"\n    },\n    {\n        \"label\": \"Unit of Measure (UOM)\",\n        \"name\": \"UOM\",\n        \"onboard\": 1,\n        \"type\": \"doctype\"\n    },\n    {\n        \"label\": \"Stock Reconciliation\",\n        \"name\": \"Stock Reconciliation\",\n        \"onboard\": 1,\n        \"type\": \"doctype\"\n    }\n]"
  },
  {
   "hidden": 0,
   "label": "Human Resources",
   "links": "[\n    {\n        \"label\": \"Employee\",\n        \"name\": \"Employee\",\n        \"onboard\": 1,\n        \"type\": \"doctype\"\n    },\n    {\n        \"dependencies\": [\n            \"Employee\"\n        ],\n        \"hide_count\": true,\n        \"label\": \"Employee Attendance Tool\",\n        \"name\": \"Employee Attendance Tool\",\n        \"onboard\": 1,\n        \"type\": \"doctype\"\n    },\n    {\n        \"label\": \"Salary Structure\",\n        \"name\": \"Salary Structure\",\n        \"onboard\": 1,\n        \"type\": \"doctype\"\n    }\n]"
  },
  {
   "hidden": 0,
   "label": "CRM",
   "links": "[\n    {\n        \"description\": \"Database of potential customers.\",\n        \"label\": \"Lead\",\n        \"name\": \"Lead\",\n        \"onboard\": 1,\n        \"type\": \"doctype\"\n    },\n    {\n        \"description\": \"Manage Customer Group Tree.\",\n        \"icon\": \"fa fa-sitemap\",\n        \"label\": \"Customer Group\",\n        \"link\": \"Tree/Customer Group\",\n        \"name\": \"Customer Group\",\n        \"onboard\": 1,\n        \"type\": \"doctype\"\n    },\n    {\n        \"description\": \"Manage Territory Tree.\",\n        \"icon\": \"fa fa-sitemap\",\n        \"label\": \"Territory\",\n        \"link\": \"Tree/Territory\",\n        \"name\": \"Territory\",\n        \"onboard\": 1,\n        \"type\": \"doctype\"\n    }\n]"
  },
  {
   "hidden": 0,
   "label": "Accounting",
   "links": "[\n    {\n        \"label\": \"Item\",\n        \"name\": \"Item\",\n        \"onboard\": 1,\n        \"type\": \"doctype\"\n    },\n    {\n        \"description\": \"Customer database.\",\n        \"label\": \"Customer\",\n        \"name\": \"Customer\",\n        \"onboard\": 1,\n        \"type\": \"doctype\"\n    },\n    {\n        \"description\": \"Supplier database.\",\n        \"label\": \"Supplier\",\n        \"name\": \"Supplier\",\n        \"onboard\": 1,\n        \"type\": \"doctype\"\n    },\n    {\n        \"description\": \"Company (not Customer or Supplier) master.\",\n        \"label\": \"Company\",\n        \"name\": \"Company\",\n        \"onboard\": 1,\n        \"type\": \"doctype\"\n    },\n    {\n        \"description\": \"Tree of financial accounts.\",\n        \"icon\": \"fa fa-sitemap\",\n        \"label\": \"Chart of Accounts\",\n        \"name\": \"Account\",\n        \"onboard\": 1,\n        \"route\": \"#Tree/Account\",\n        \"type\": \"doctype\"\n    },\n    {\n        \"description\": \"Create Opening Sales and Purchase Invoices\",\n        \"label\": \"Opening Invoice Creation Tool\",\n        \"name\": \"Opening Invoice Creation Tool\",\n        \"onboard\": 1,\n        \"type\": \"doctype\"\n    }\n]"
  },
  {
   "hidden": 0,
   "label": "Data Import and Settings",
   "links": "[\n    {\n        \"description\": \"Import Data from CSV / Excel files.\",\n        \"icon\": \"octicon octicon-cloud-upload\",\n        \"label\": \"Import Data\",\n        \"name\": \"Data Import\",\n        \"onboard\": 1,\n        \"type\": \"doctype\"\n    },\n    {\n        \"description\": \"Import Chart Of Accounts from CSV / Excel files\",\n        \"labe\": \"Chart Of Accounts Importer\",\n        \"label\": \"Chart of Accounts Importer\",\n        \"name\": \"Chart of Accounts Importer\",\n        \"onboard\": 1,\n        \"type\": \"doctype\"\n    },\n    {\n        \"description\": \"Letter Heads for print templates.\",\n        \"label\": \"Letter Head\",\n        \"name\": \"Letter Head\",\n        \"onboard\": 1,\n        \"type\": \"doctype\"\n    },\n    {\n        \"description\": \"Add / Manage Email Accounts.\",\n        \"label\": \"Email Account\",\n        \"name\": \"Email Account\",\n        \"onboard\": 1,\n        \"type\": \"doctype\"\n    }\n]"
  }
 ],
 "category": "Modules",
 "charts": [],
 "color": "#1abc9c",
 "creation": "2020-01-23 13:46:38.833076",
 "developer_mode_only": 0,
 "disable_user_customization": 0,
 "docstatus": 0,
 "doctype": "Desk Page",
 "extends_another_page": 0,
 "hide_custom": 0,
 "icon": "fas fa-door-open",
 "idx": 0,
 "is_standard": 1,
 "label": "Home",
 "modified": "2020-08-03 14:22:12.446720",
 "modified_by": "Administrator",
 "module": "Setup",
 "name": "Home",
 "owner": "Administrator",
 "pin_to_bottom": 0,
 "pin_to_top": 1,
 "shortcuts": [
  {
   "label": "Item",
   "link_to": "Item",
   "type": "DocType"
  },
  {
   "label": "Customer",
   "link_to": "Customer",
   "type": "DocType"
  },
  {
   "label": "Supplier",
   "link_to": "Supplier",
   "type": "DocType"
  },
  {
   "label": "Sales Invoice",
   "link_to": "Sales Invoice",
   "type": "DocType"
  },
  {
   "label": "Dashboard",
   "link_to": "dashboard",
   "type": "Page"
  },
  {
   "label": "Leaderboard",
   "link_to": "leaderboard",
   "type": "Page"
  },
  {
   "color": "",
   "format": "",
   "icon": "",
   "label": "Inbox",
   "link_to": "Communication",
   "stats_filter": "",
   "type": "DocType"
  }
 ]
}