{
  "$schema": "https://docs.renovatebot.com/renovate-schema.json",
  "extends": [
    "config:base"
  ],
  "automerge": false,
  "autoApprove": true,
  "automergeType": "pr",

  // Grouping all dependencies together
  "packageRules": [
    {
      "groupName": "all dependencies",   // Group all dependency updates
      "groupSlug": "all",
      "matchPackageNames": ["*"]         // Match all packages
    }
  ],

  // Lock file maintenance
  "lockFileMaintenance": {
    "enabled": false
  },

  // Separating major and minor updates
  "separateMajorMinor": true


}
