{
 "creation": "2021-07-28 11:51:42.319984",
 "docstatus": 0,
 "doctype": "Form Tour",
 "first_document": 0,
 "idx": 0,
 "include_name_field": 0,
 "is_standard": 1,
 "language": "en",
 "list_name": "List",
 "modified": "2023-08-10 16:11:32.888763",
 "modified_by": "Administrator",
 "module": "Buying",
 "name": "Buying Settings",
 "new_document_form": 0,
 "owner": "Administrator",
 "reference_doctype": "Buying Settings",
 "save_on_complete": 0,
 "steps": [
  {
   "description": "When a Supplier is saved, system generates a unique identity or name for that Supplier which can be used to refer the Supplier in various Buying transactions.",
   "fieldname": "supp_master_name",
   "fieldtype": "Select",
   "has_next_condition": 0,
   "hide_buttons": 0,
   "is_table_field": 0,
   "label": "Supplier Naming By",
   "modal_trigger": 0,
   "next_on_click": 0,
   "offset_x": 0,
   "offset_y": 0,
   "popover_element": 0,
   "position": "Bottom",
   "title": "Supplier Naming By",
   "ui_tour": 0
  },
  {
   "description": "Configure what should be the default value of Supplier Group when creating a new Supplier.",
   "fieldname": "supplier_group",
   "fieldtype": "Link",
   "has_next_condition": 0,
   "hide_buttons": 0,
   "is_table_field": 0,
   "label": "Default Supplier Group",
   "modal_trigger": 0,
   "next_on_click": 0,
   "offset_x": 0,
   "offset_y": 0,
   "popover_element": 0,
   "position": "Right",
   "title": "Default Supplier Group",
   "ui_tour": 0
  },
  {
   "description": "Item prices will be fetched from this Price List.",
   "fieldname": "buying_price_list",
   "fieldtype": "Link",
   "has_next_condition": 0,
   "hide_buttons": 0,
   "is_table_field": 0,
   "label": "Default Buying Price List",
   "modal_trigger": 0,
   "next_on_click": 0,
   "offset_x": 0,
   "offset_y": 0,
   "popover_element": 0,
   "position": "Bottom",
   "title": "Default Buying Price List",
   "ui_tour": 0
  },
  {
   "description": "If this option is configured \"Yes\", ERPNext will prevent you from creating a Purchase Invoice or a Purchase Receipt directly without creating a Purchase Order first.",
   "fieldname": "po_required",
   "fieldtype": "Select",
   "has_next_condition": 0,
   "hide_buttons": 0,
   "is_table_field": 0,
   "label": "Is Purchase Order Required for Purchase Invoice & Receipt Creation?",
   "modal_trigger": 0,
   "next_on_click": 0,
   "offset_x": 0,
   "offset_y": 0,
   "popover_element": 0,
   "position": "Bottom",
   "title": "Purchase Order Required",
   "ui_tour": 0
  },
  {
   "description": "If this option is configured \"Yes\", ERPNext will prevent you from creating a Purchase Invoice without creating a Purchase Receipt first.",
   "fieldname": "pr_required",
   "fieldtype": "Select",
   "has_next_condition": 0,
   "hide_buttons": 0,
   "is_table_field": 0,
   "label": "Is Purchase Receipt Required for Purchase Invoice Creation?",
   "modal_trigger": 0,
   "next_on_click": 0,
   "offset_x": 0,
   "offset_y": 0,
   "popover_element": 0,
   "position": "Bottom",
   "title": "Purchase Receipt Required",
   "ui_tour": 0
  }
 ],
 "title": "Buying Settings",
 "track_steps": 0,
 "ui_tour": 0
}
