{
 "action": "Create Entry",
 "action_label": "Check help to setup Routing",
 "creation": "2021-08-04 11:56:42.455758",
 "description": "# Setup Routing\n\nA Routing stores all Operations along with the description, hourly rate, operation time, batch size, etc. Click below to learn how the Routing template can be created, for quick selection in the BOM.",
 "docstatus": 0,
 "doctype": "Onboarding Step",
 "idx": 0,
 "is_complete": 0,
 "is_single": 0,
 "is_skipped": 0,
 "language": "en",
 "modified": "2023-08-10 16:03:55.692733",
 "modified_by": "Administrator",
 "name": "Routing",
 "owner": "Administrator",
 "reference_document": "Routing",
 "show_form_tour": 1,
 "show_full_form": 1,
 "title": "Routing",
 "validate_action": 1
}
