{
 "action": "Watch Video",
 "creation": "2020-05-09 23:37:08.926812",
 "docstatus": 0,
 "doctype": "Onboarding Step",
 "idx": 0,
 "is_complete": 0,
 "is_single": 0,
 "is_skipped": 0,
 "language": "en",
 "modified": "2023-08-10 16:03:56.580822",
 "modified_by": "Administrator",
 "name": "Introduction to CRM",
 "owner": "Administrator",
 "show_form_tour": 0,
 "show_full_form": 0,
 "title": "Introduction to CRM",
 "validate_action": 1,
 "video_url": "https://www.youtube.com/watch?v=o9XCSZHJfpA"
}
