{
 "actions": [],
 "allow_rename": 1,
 "creation": "2021-11-30 13:38:30.926047",
 "doctype": "DocType",
 "editable_grid": 1,
 "engine": "InnoDB",
 "field_order": [
  "from_doctype",
  "transaction_name",
  "date",
  "time",
  "transaction_status",
  "error_description",
  "to_doctype",
  "retried"
 ],
 "fields": [
  {
   "fieldname": "transaction_name",
   "fieldtype": "Dynamic Link",
   "in_list_view": 1,
   "in_standard_filter": 1,
   "label": "Name",
   "options": "from_doctype",
   "read_only": 1,
   "search_index": 1
  },
  {
   "fieldname": "transaction_status",
   "fieldtype": "Data",
   "in_list_view": 1,
   "label": "Status",
   "read_only": 1
  },
  {
   "fieldname": "error_description",
   "fieldtype": "Long Text",
   "label": "Error Description",
   "read_only": 1
  },
  {
   "fieldname": "from_doctype",
   "fieldtype": "Link",
   "in_standard_filter": 1,
   "label": "From Doctype",
   "options": "DocType",
   "read_only": 1,
   "search_index": 1
  },
  {
   "fieldname": "to_doctype",
   "fieldtype": "Link",
   "label": "To Doctype",
   "options": "DocType",
   "read_only": 1
  },
  {
   "fieldname": "date",
   "fieldtype": "Date",
   "in_list_view": 1,
   "in_standard_filter": 1,
   "label": "Date ",
   "read_only": 1,
   "search_index": 1
  },
  {
   "fieldname": "time",
   "fieldtype": "Time",
   "label": "Time",
   "read_only": 1
  },
  {
   "fieldname": "retried",
   "fieldtype": "Int",
   "in_list_view": 1,
   "label": "Retried",
   "read_only": 1
  }
 ],
 "in_create": 1,
 "index_web_pages_for_search": 1,
 "links": [],
 "modified": "2023-11-10 11:44:10.758342",
 "modified_by": "Administrator",
 "module": "Bulk Transaction",
 "name": "Bulk Transaction Log Detail",
 "owner": "Administrator",
 "permissions": [
  {
   "create": 1,
   "delete": 1,
   "email": 1,
   "export": 1,
   "print": 1,
   "read": 1,
   "report": 1,
   "role": "System Manager",
   "share": 1,
   "write": 1
  }
 ],
 "sort_field": "modified",
 "sort_order": "DESC",
 "states": [],
 "track_changes": 1
}
