{
 "action": "Create Entry",
 "action_label": "Let's create a new Asset item",
 "creation": "2021-08-13 14:27:07.277167",
 "description": "# Asset Item\n\nAsset items are created based on Asset Category. You can create one or multiple items against once Asset Category. The sales and purchase transaction for Asset is done via Asset Item. ",
 "docstatus": 0,
 "doctype": "Onboarding Step",
 "form_tour": "Item",
 "idx": 0,
 "is_complete": 0,
 "is_single": 0,
 "is_skipped": 0,
 "language": "en",
 "modified": "2023-08-10 16:03:56.018217",
 "modified_by": "Administrator",
 "name": "Asset Item",
 "owner": "Administrator",
 "reference_document": "Item",
 "show_form_tour": 1,
 "show_full_form": 1,
 "title": "Create an Asset Item",
 "validate_action": 1
}
