{
 "allow_roles": [
  {
   "role": "Accounts Manager"
  },
  {
   "role": "Accounts User"
  }
 ],
 "creation": "2020-05-13 19:03:32.564049",
 "docstatus": 0,
 "doctype": "Module Onboarding",
 "documentation_url": "https://doc.dokos.io/dokos/accounting/",
 "idx": 0,
 "is_complete": 0,
 "language": "en",
 "modified": "2023-08-10 16:05:00.701087",
 "modified_by": "Administrator",
 "module": "Accounts",
 "name": "Accounts",
 "owner": "Administrator",
 "steps": [
  {
   "step": "Chart of Accounts"
  },
  {
   "step": "Setup Taxes"
  },
  {
   "step": "Accounts Settings"
  },
  {
   "step": "Cost Centers for Report and Budgeting"
  },
  {
   "step": "Create Your First Purchase Invoice"
  },
  {
   "step": "Updating Opening Balances"
  },
  {
   "step": "Financial Statements"
  }
 ],
 "subtitle": "Accounts, invoices and taxes.",
 "success_message": "The accounting module is set up !",
 "title": "Let's set up your accounts and taxes."
}
