{
 "creation": "2023-08-30 14:36:50.232696",
 "dashboard_name": "",
 "docstatus": 0,
 "doctype": "Form Tour",
 "first_document": 0,
 "idx": 0,
 "include_name_field": 0,
 "is_standard": 1,
 "language": "fr",
 "list_name": "List",
 "modified": "2023-08-30 14:40:56.368683",
 "modified_by": "Administrator",
 "module": "Projects",
 "name": "Vues de t\u00e2ches",
 "new_document_form": 0,
 "owner": "Administrator",
 "page_name": "",
 "page_route": "[\"List\",\"Task\",\"List\"]",
 "reference_doctype": "Task",
 "report_name": "",
 "save_on_complete": 0,
 "steps": [
  {
   "description": "Vous pouvez visualiser vos t\u00e2ches sous forme de diagramme de Gantt en changeant de vue.\n<br>\nVous retrouverez \u00e9galement une vue en kanban, planification (une forme de Gantt simplifi\u00e9), arbre (pour voir les d\u00e9pendances entres vos t\u00e2ches).",
   "element_selector": "#page-List\\/Task\\/List > div.page-head.flex > div > div > div.flex.col.page-actions.justify-content-end > div.view-actions > div > button",
   "fieldtype": "0",
   "has_next_condition": 0,
   "hide_buttons": 0,
   "is_table_field": 0,
   "modal_trigger": 0,
   "next_on_click": 0,
   "offset_x": 0,
   "offset_y": 0,
   "popover_element": 0,
   "position": "Left",
   "title": "Choix des vues",
   "ui_tour": 1
  },
  {
   "description": "Une fois que vous avez s\u00e9lectionn\u00e9 la vue ad\u00e9quate, vous pouvez choisir ici le projet que vous souhaitez visualiser. <br>",
   "element_selector": "div.layout-main-section.frappe-card > div.page-form.flex > div.standard-filter-section.flex > div:nth-child(3)",
   "fieldtype": "0",
   "has_next_condition": 0,
   "hide_buttons": 0,
   "is_table_field": 0,
   "modal_trigger": 0,
   "next_on_click": 0,
   "offset_x": 0,
   "offset_y": 0,
   "popover_element": 0,
   "position": "Left",
   "title": "Filtrez par projet",
   "ui_tour": 1
  },
  {
   "description": "Vous pouvez ici filtrer les t\u00e2ches par statut. Par exemple vous pouvez voir uniquement les t\u00e2ches ayant le statut \"En retard\" ou \"Ouvert\" etc.",
   "element_selector": "div.layout-main-section.frappe-card > div.page-form.flex > div.standard-filter-section.flex > div:nth-child(4)",
   "fieldtype": "0",
   "has_next_condition": 0,
   "hide_buttons": 0,
   "is_table_field": 0,
   "modal_trigger": 0,
   "next_on_click": 0,
   "offset_x": 0,
   "offset_y": 0,
   "popover_element": 0,
   "position": "Bottom",
   "title": "Filtrez pas statut",
   "ui_tour": 1
  },
  {
   "description": "Pour voir uniquement les t\u00e2ches d'un certain niveau de priorit\u00e9",
   "element_selector": "div.layout-main-section.frappe-card > div.page-form.flex > div.standard-filter-section.flex > div:nth-child(5)",
   "fieldtype": "0",
   "has_next_condition": 0,
   "hide_buttons": 0,
   "is_table_field": 0,
   "modal_trigger": 0,
   "next_on_click": 0,
   "offset_x": 0,
   "offset_y": 0,
   "popover_element": 0,
   "position": "Bottom",
   "title": "Filtrez par priorit\u00e9",
   "ui_tour": 1
  }
 ],
 "title": "Vues de t\u00e2ches",
 "track_steps": 1,
 "ui_tour": 1,
 "view_name": "List",
 "workspace_name": ""
}