{
 "action": "Create Entry",
 "creation": "2020-05-14 17:38:27.496696",
 "docstatus": 0,
 "doctype": "Onboarding Step",
 "idx": 0,
 "is_complete": 0,
 "is_single": 0,
 "is_skipped": 0,
 "language": "en",
 "modified": "2023-08-10 16:03:56.555750",
 "modified_by": "Administrator",
 "name": "Create Opportunity",
 "owner": "Administrator",
 "reference_document": "Opportunity",
 "show_form_tour": 0,
 "show_full_form": 1,
 "title": "Create Opportunity",
 "validate_action": 1
}
