{
 "creation": "2023-08-31 11:29:30.994238",
 "dashboard_name": "",
 "docstatus": 0,
 "doctype": "Form Tour",
 "first_document": 0,
 "idx": 0,
 "include_name_field": 0,
 "is_standard": 1,
 "language": "fr",
 "list_name": "Kanban",
 "modified": "2023-08-31 12:19:42.752444",
 "modified_by": "Administrator",
 "module": "Projects",
 "name": "Vue Kanban",
 "new_document_form": 0,
 "owner": "Administrator",
 "page_name": "",
 "page_route": "[\"List\",\"Task\",\"Kanban\"]",
 "reference_doctype": "Task",
 "report_name": "",
 "save_on_complete": 0,
 "steps": [
  {
   "description": "Vous retrouverez ici vos t\u00e2ches tri\u00e9es par Statut ou Priorit\u00e9 selon l'option choisi \u00e0 la cr\u00e9ation du kanban.",
   "element_selector": "div.row.layout-main > div.col.layout-main-section-wrapper > div.layout-main-section > div.frappe-list > div.result > div.kanban",
   "fieldtype": "0",
   "has_next_condition": 0,
   "hide_buttons": 0,
   "is_table_field": 0,
   "modal_trigger": 0,
   "next_on_click": 0,
   "offset_x": 0,
   "offset_y": 0,
   "popover_element": 0,
   "position": "Mid Center",
   "title": "Bienvenue sur votre premier kanban !",
   "ui_tour": 1
  },
  {
   "description": "Pas de temps \u00e0 perdre ? <br>\nVous pouvez ajouter une t\u00e2che directement depuis votre kanban. <br>\nVous la retrouverez dans votre <a href='../task'><b>liste de t\u00e2ches</b></a> et pourrez compl\u00e9ter son contenu plus tard.",
   "element_selector": "div.col.layout-main-section-wrapper > div.layout-main-section > div.frappe-list > div.result > div.kanban > div:nth-child(3) > div.add-card",
   "fieldtype": "0",
   "has_next_condition": 0,
   "hide_buttons": 0,
   "is_table_field": 0,
   "modal_trigger": 0,
   "next_on_click": 0,
   "offset_x": 0,
   "offset_y": 0,
   "popover_element": 0,
   "position": "Bottom",
   "title": "Ajouter une t\u00e2che",
   "ui_tour": 1
  },
  {
   "description": "Attribuer une couleur \u00e0 votre colonne ou archivez la si elle n'est pas pertinente.",
   "element_selector": "div.layout-main-section > div.frappe-list > div.result > div.kanban > div:nth-child(3) > div.kanban-column-header > div",
   "fieldtype": "0",
   "has_next_condition": 0,
   "hide_buttons": 0,
   "is_table_field": 0,
   "modal_trigger": 0,
   "next_on_click": 0,
   "offset_x": 0,
   "offset_y": 0,
   "popover_element": 0,
   "position": "Bottom",
   "title": "Options",
   "ui_tour": 1
  },
  {
   "description": "Un bon gestionnaire de projet doit savoir d\u00e9l\u00e9guer. <br>\nCliquez ici pour attribuer cette t\u00e2che \u00e0 un utilisateur de dokos. Elle apparaitra dans leur to-do list.",
   "element_selector": "div.kanban > div:nth-child(4) > div.kanban-cards > div > div > div > div.kanban-card-meta > span.kanban-assignments > div > span > div",
   "fieldtype": "0",
   "has_next_condition": 0,
   "hide_buttons": 0,
   "is_table_field": 0,
   "modal_trigger": 0,
   "next_on_click": 0,
   "offset_x": 0,
   "offset_y": 0,
   "popover_element": 0,
   "position": "Bottom",
   "title": "Attribuer une t\u00e2che",
   "ui_tour": 1
  },
  {
   "description": "Vous pouvez cliquer ici pour acc\u00e9der au d\u00e9tail de la t\u00e2che",
   "element_selector": "div.frappe-list > div.result > div.kanban > div:nth-child(4) > div.kanban-cards > div > div > div > div.kanban-title-area > a > div",
   "fieldtype": "0",
   "has_next_condition": 0,
   "hide_buttons": 0,
   "is_table_field": 0,
   "modal_trigger": 0,
   "next_on_click": 0,
   "offset_x": 0,
   "offset_y": 0,
   "popover_element": 0,
   "position": "Bottom",
   "title": "Lien vers la t\u00e2che",
   "ui_tour": 1
  }
 ],
 "title": "Vue Kanban",
 "track_steps": 1,
 "ui_tour": 1,
 "view_name": "List",
 "workspace_name": ""
}