{
 "allow_roles": [
  {
   "role": "Sales Manager"
  },
  {
   "role": "Sales User"
  },
  {
   "role": "Stock Manager"
  },
  {
   "role": "Stock User"
  }
 ],
 "creation": "2020-06-01 12:44:42.589930",
 "docstatus": 0,
 "doctype": "Module Onboarding",
 "documentation_url": "https://docs.erpnext.com/docs/user/manual/en/selling",
 "idx": 0,
 "is_complete": 0,
 "language": "en",
 "modified": "2023-08-10 16:05:01.201032",
 "modified_by": "Administrator",
 "module": "Selling",
 "name": "Selling",
 "owner": "Administrator",
 "steps": [
  {
   "step": "Selling Settings"
  },
  {
   "step": "Sales Order"
  }
 ],
 "subtitle": "Products, Sales, Analysis, and more.",
 "success_message": "The Selling Module is all set up!",
 "title": "Let's Set Up the Selling Module."
}
