{
 "action": "Create Entry",
 "action_label": "Cr\u00e9er votre premi\u00e8re feuille de temps",
 "creation": "2023-08-25 15:32:55.072956",
 "description": "# Saisissez votre premi\u00e8re feuille de temps\n\nLes feuilles de temps permettent le suivi du temps pass\u00e9 sur les t\u00e2ches. Un remplissage rigoureux des feuilles de temps permet :\n- de suivre le temps pass\u00e9 sur chaque projet\n- de calculer l'avancement des projets\n- calculer le co\u00fbt des projets\n- de facturer les clients",
 "docstatus": 0,
 "doctype": "Onboarding Step",
 "idx": 11,
 "intro_video_url": "",
 "is_complete": 0,
 "is_single": 0,
 "is_skipped": 0,
 "language": "fr",
 "modified": "2023-08-30 11:00:54.947221",
 "modified_by": "Administrator",
 "name": "Cr\u00e9ez votre premi\u00e8re feuille de temps",
 "owner": "Administrator",
 "reference_document": "Timesheet",
 "show_form_tour": 0,
 "show_full_form": 1,
 "title": "Cr\u00e9ez votre premi\u00e8re feuille de temps",
 "validate_action": 1
}
