EESchema Schematic File Version 2
LIBS:power
LIBS:device
LIBS:switches
LIBS:relays
LIBS:motors
LIBS:transistors
LIBS:conn
LIBS:linear
LIBS:regul
LIBS:74xx
LIBS:cmos4000
LIBS:adc-dac
LIBS:memory
LIBS:xilinx
LIBS:microcontrollers
LIBS:dsp
LIBS:microchip
LIBS:analog_switches
LIBS:motorola
LIBS:texas
LIBS:intel
LIBS:audio
LIBS:interface
LIBS:digital-audio
LIBS:philips
LIBS:display
LIBS:cypress
LIBS:siliconi
LIBS:opto
LIBS:atmel
LIBS:contrib
LIBS:valves
LIBS:dc-dc
LIBS:references
LIBS:rpi-birdcam
LIBS:mechanical
LIBS:graphic_symbols
LIBS:modules
LIBS:rpi-birdcam-cache
EELAYER 25 0
EELAYER END
$Descr A4 11693 8268
encoding utf-8
Sheet 1 1
Title "Raspberry PI BirdCam Baseboard"
Date "2019-02-01"
Rev "2"
Comp "Copyright (c) 2018,2019 Andreas Messer"
Comment1 ""
Comment2 ""
Comment3 ""
Comment4 ""
$EndDescr
$Comp
L MIC4690 U104
U 1 1 5BD5C577
P 4100 1000
F 0 "U104" H 4150 1250 50  0000 C CNN
F 1 "MIC4690" H 4400 650 50  0000 L CNN
F 2 "Housings_SOIC:SOIC-8_3.9x4.9mm_Pitch1.27mm" H 4150 950 50  0001 C CNN
F 3 "" H 4150 950 50  0001 C CNN
	1    4100 1000
	1    0    0    -1  
$EndComp
$Comp
L R R127
U 1 1 5BD5C5D4
P 5450 1000
F 0 "R127" V 5530 1000 50  0000 C CNN
F 1 "3.01k" V 5450 1000 50  0000 C CNN
F 2 "Resistors_SMD:R_0603_HandSoldering" V 5380 1000 50  0001 C CNN
F 3 "" H 5450 1000 50  0001 C CNN
	1    5450 1000
	-1   0    0    1   
$EndComp
$Comp
L R R128
U 1 1 5BD5C696
P 5450 1400
F 0 "R128" V 5530 1400 50  0000 C CNN
F 1 "976" V 5450 1400 50  0000 C CNN
F 2 "Resistors_SMD:R_0603_HandSoldering" V 5380 1400 50  0001 C CNN
F 3 "" H 5450 1400 50  0001 C CNN
	1    5450 1400
	-1   0    0    1   
$EndComp
$Comp
L D_Schottky D111
U 1 1 5BD5C88A
P 5050 1400
F 0 "D111" H 5050 1500 50  0000 C CNN
F 1 "SS22" H 5050 1300 50  0000 C CNN
F 2 "Diodes_SMD:D_SMB" H 5050 1400 50  0001 C CNN
F 3 "" H 5050 1400 50  0001 C CNN
	1    5050 1400
	0    1    1    0   
$EndComp
$Comp
L L L102
U 1 1 5BD5CD14
P 5250 800
F 0 "L102" V 5200 800 50  0000 C CNN
F 1 "33µH" V 5325 800 50  0000 C CNN
F 2 "Choke_SMD:Choke_SMD_Wuerth-WE-PDF_Handsoldering" H 5250 800 50  0001 C CNN
F 3 "" H 5250 800 50  0001 C CNN
	1    5250 800 
	0    -1   -1   0   
$EndComp
$Comp
L C C116
U 1 1 5BD5CE67
P 5650 1200
F 0 "C116" H 5650 1450 50  0000 L CNN
F 1 "100nF" H 5650 1400 50  0000 L CNN
F 2 "Capacitors_SMD:C_0603_HandSoldering" H 5688 1050 50  0001 C CNN
F 3 "" H 5650 1200 50  0001 C CNN
	1    5650 1200
	1    0    0    -1  
$EndComp
$Comp
L CP C117
U 1 1 5BD5CEA8
P 5850 1200
F 0 "C117" H 5850 1450 50  0000 L CNN
F 1 "100µF" H 5850 1400 50  0000 L CNN
F 2 "Capacitors_Tantalum_SMD:CP_Tantalum_Case-D_EIA-7343-31_Hand" H 5888 1050 50  0001 C CNN
F 3 "" H 5850 1200 50  0001 C CNN
	1    5850 1200
	1    0    0    -1  
$EndComp
$Comp
L GND #PWR111
U 1 1 5BD5D76F
P 4100 1700
F 0 "#PWR111" H 4100 1450 50  0001 C CNN
F 1 "GND" H 4100 1550 50  0001 C CNN
F 2 "" H 4100 1700 50  0001 C CNN
F 3 "" H 4100 1700 50  0001 C CNN
	1    4100 1700
	1    0    0    -1  
$EndComp
$Comp
L C C110
U 1 1 5BD5D87B
P 3200 1250
F 0 "C110" H 3200 1450 50  0000 L CNN
F 1 "10µF" H 3200 1400 50  0000 L CNN
F 2 "Capacitors_SMD:C_1210_HandSoldering" H 3238 1100 50  0001 C CNN
F 3 "" H 3200 1250 50  0001 C CNN
	1    3200 1250
	1    0    0    -1  
$EndComp
$Comp
L C C108
U 1 1 5BD5E25C
P 3000 1250
F 0 "C108" H 3000 1450 50  0000 L CNN
F 1 "10µF" H 3000 1400 50  0000 L CNN
F 2 "Capacitors_SMD:C_1210_HandSoldering" H 3038 1100 50  0001 C CNN
F 3 "" H 3000 1250 50  0001 C CNN
	1    3000 1250
	1    0    0    -1  
$EndComp
$Comp
L C C107
U 1 1 5BD5E423
P 2800 1250
F 0 "C107" H 2800 1450 50  0000 L CNN
F 1 "10µF" H 2800 1400 50  0000 L CNN
F 2 "Capacitors_SMD:C_1210_HandSoldering" H 2838 1100 50  0001 C CNN
F 3 "" H 2800 1250 50  0001 C CNN
	1    2800 1250
	1    0    0    -1  
$EndComp
$Comp
L L L101
U 1 1 5BD5E70B
P 1800 900
F 0 "L101" V 1750 900 50  0000 C CNN
F 1 "47µH" V 1875 900 50  0000 C CNN
F 2 "Inductors:Inductor_Taiyo-Yuden_NR-50xx_HandSoldering" H 1800 900 50  0001 C CNN
F 3 "" H 1800 900 50  0001 C CNN
	1    1800 900 
	0    -1   -1   0   
$EndComp
$Comp
L Polyfuse F101
U 1 1 5BD5E7B5
P 1350 900
F 0 "F101" V 1250 900 50  0000 C CNN
F 1 "1812L075/24DR" V 1500 1000 50  0000 C CNN
F 2 "Resistors_SMD:R_1812_HandSoldering" H 1400 700 50  0001 L CNN
F 3 "" H 1350 900 50  0001 C CNN
	1    1350 900 
	0    1    1    0   
$EndComp
$Comp
L D_TVS D105
U 1 1 5BD5E914
P 2300 1250
F 0 "D105" H 2300 1350 50  0000 C CNN
F 1 "P4SMAJ18CA" H 2300 1150 50  0000 C CNN
F 2 "Diodes_SMD:D_SMA_Handsoldering" H 2300 1250 50  0001 C CNN
F 3 "" H 2300 1250 50  0001 C CNN
	1    2300 1250
	0    1    1    0   
$EndComp
$Comp
L D_Schottky D107
U 1 1 5BD5E9FA
P 2500 900
F 0 "D107" H 2500 1000 50  0000 C CNN
F 1 "SS14" H 2500 800 50  0000 C CNN
F 2 "Diodes_SMD:D_SMA_Handsoldering" H 2500 900 50  0001 C CNN
F 3 "" H 2500 900 50  0001 C CNN
	1    2500 900 
	-1   0    0    1   
$EndComp
$Comp
L R R125
U 1 1 5BD5F5EB
P 5150 2750
F 0 "R125" V 5150 3050 50  0000 C CNN
F 1 "33k" V 5150 2750 50  0000 C CNN
F 2 "Resistors_SMD:R_0603_HandSoldering" V 5080 2750 50  0001 C CNN
F 3 "" H 5150 2750 50  0001 C CNN
	1    5150 2750
	1    0    0    -1  
$EndComp
Text Label 6050 800  2    60   ~ 0
5V
Text Label 5550 2550 2    60   ~ 0
3.3V
$Comp
L R R123
U 1 1 5BD63DE8
P 5050 2750
F 0 "R123" V 5050 3050 50  0000 C CNN
F 1 "10k" V 5050 2750 50  0000 C CNN
F 2 "Resistors_SMD:R_0603_HandSoldering" V 4980 2750 50  0001 C CNN
F 3 "" H 5050 2750 50  0001 C CNN
	1    5050 2750
	1    0    0    -1  
$EndComp
$Comp
L R R126
U 1 1 5BD6416E
P 5150 3150
F 0 "R126" V 5050 3150 50  0000 C CNN
F 1 "1k" V 5150 3150 50  0000 C CNN
F 2 "Resistors_SMD:R_0603_HandSoldering" V 5080 3150 50  0001 C CNN
F 3 "" H 5150 3150 50  0001 C CNN
	1    5150 3150
	-1   0    0    1   
$EndComp
$Comp
L R R124
U 1 1 5BD6438A
P 5050 3150
F 0 "R124" V 5150 3150 50  0000 C CNN
F 1 "1k" V 5050 3150 50  0000 C CNN
F 2 "Resistors_SMD:R_0603_HandSoldering" V 4980 3150 50  0001 C CNN
F 3 "" H 5050 3150 50  0001 C CNN
	1    5050 3150
	-1   0    0    1   
$EndComp
$Comp
L R R121
U 1 1 5BD5F423
P 4150 2500
F 0 "R121" V 4050 2500 50  0000 C CNN
F 1 "2.2M" V 4150 2500 50  0000 C CNN
F 2 "Resistors_SMD:R_0603_HandSoldering" V 4080 2500 50  0001 C CNN
F 3 "" H 4150 2500 50  0001 C CNN
	1    4150 2500
	0    1    1    0   
$EndComp
$Comp
L R R122
U 1 1 5BD5F500
P 4150 2600
F 0 "R122" V 4230 2600 50  0000 C CNN
F 1 "10k" V 4150 2600 50  0000 C CNN
F 2 "Resistors_SMD:R_0603_HandSoldering" V 4080 2600 50  0001 C CNN
F 3 "" H 4150 2600 50  0001 C CNN
	1    4150 2600
	0    1    1    0   
$EndComp
$Comp
L D_Schottky_x2_KCom_AAK D110
U 1 1 5BD5FEA4
P 4850 2600
F 0 "D110" V 4450 2700 50  0000 C CNN
F 1 "BAT54C" V 4550 2750 50  0000 C CNN
F 2 "TO_SOT_Packages_SMD:SOT-23_Handsoldering" H 4850 2600 50  0001 C CNN
F 3 "" H 4850 2600 50  0001 C CNN
	1    4850 2600
	0    1    1    0   
$EndComp
$Comp
L R R119
U 1 1 5BD6233C
P 3950 2300
F 0 "R119" V 4030 2300 50  0000 C CNN
F 1 "470k" V 3950 2300 50  0000 C CNN
F 2 "Resistors_SMD:R_0603_HandSoldering" V 3880 2300 50  0001 C CNN
F 3 "" H 3950 2300 50  0001 C CNN
	1    3950 2300
	-1   0    0    1   
$EndComp
$Comp
L R R120
U 1 1 5BD6254E
P 4150 2100
F 0 "R120" V 4230 2100 50  0000 C CNN
F 1 "47k" V 4150 2100 50  0000 C CNN
F 2 "Resistors_SMD:R_0603_HandSoldering" V 4080 2100 50  0001 C CNN
F 3 "" H 4150 2100 50  0001 C CNN
	1    4150 2100
	0    -1   -1   0   
$EndComp
$Comp
L GND #PWR113
U 1 1 5BD64E36
P 4600 3150
F 0 "#PWR113" H 4600 2900 50  0001 C CNN
F 1 "GND" H 4600 3000 50  0001 C CNN
F 2 "" H 4600 3150 50  0001 C CNN
F 3 "" H 4600 3150 50  0001 C CNN
	1    4600 3150
	1    0    0    -1  
$EndComp
$Comp
L Conn_01x02 J101
U 1 1 5BD670F0
P 800 900
F 0 "J101" H 800 1000 50  0000 C CNN
F 1 "Conn_01x02" H 800 700 50  0000 C CNN
F 2 "Wire_Connections_Bridges:WireConnection_1.00mmDrill" H 800 900 50  0001 C CNN
F 3 "" H 800 900 50  0001 C CNN
	1    800  900 
	-1   0    0    -1  
$EndComp
$Comp
L GND #PWR101
U 1 1 5BD672C4
P 1050 1050
F 0 "#PWR101" H 1050 800 50  0001 C CNN
F 1 "GND" H 1050 900 50  0000 C CNN
F 2 "" H 1050 1050 50  0001 C CNN
F 3 "" H 1050 1050 50  0001 C CNN
	1    1050 1050
	1    0    0    -1  
$EndComp
$Comp
L CP C113
U 1 1 5BD67622
P 3950 2900
F 0 "C113" H 3975 3000 50  0000 L CNN
F 1 "220µF" H 3975 2800 50  0000 L CNN
F 2 "Capacitors_ThroughHole:CP_Radial_D7.5mm_P2.50mm" H 3988 2750 50  0001 C CNN
F 3 "" H 3950 2900 50  0001 C CNN
	1    3950 2900
	1    0    0    -1  
$EndComp
$Comp
L LED D102
U 1 1 5BD68407
P 1850 6500
F 0 "D102" H 1850 6600 50  0000 C CNN
F 1 "LED" H 1850 6400 50  0000 C CNN
F 2 "LEDs:LED_D5.0mm" H 1850 6500 50  0001 C CNN
F 3 "" H 1850 6500 50  0001 C CNN
	1    1850 6500
	-1   0    0    1   
$EndComp
$Comp
L LED D101
U 1 1 5BD68632
P 1850 6000
F 0 "D101" H 1850 6100 50  0000 C CNN
F 1 "LED" H 1850 5900 50  0000 C CNN
F 2 "LEDs:LED_D5.0mm" H 1850 6000 50  0001 C CNN
F 3 "" H 1850 6000 50  0001 C CNN
	1    1850 6000
	-1   0    0    1   
$EndComp
$Comp
L R R109
U 1 1 5BD686E0
P 1500 6500
F 0 "R109" V 1580 6500 50  0000 C CNN
F 1 "22" V 1500 6500 50  0000 C CNN
F 2 "Resistors_SMD:R_0603_HandSoldering" V 1430 6500 50  0001 C CNN
F 3 "" H 1500 6500 50  0001 C CNN
	1    1500 6500
	0    -1   -1   0   
$EndComp
$Comp
L R R108
U 1 1 5BD68922
P 1500 6000
F 0 "R108" V 1580 6000 50  0000 C CNN
F 1 "22" V 1500 6000 50  0000 C CNN
F 2 "Resistors_SMD:R_0603_HandSoldering" V 1430 6000 50  0001 C CNN
F 3 "" H 1500 6000 50  0001 C CNN
	1    1500 6000
	0    -1   -1   0   
$EndComp
$Comp
L LED D104
U 1 1 5BD68A32
P 2200 6500
F 0 "D104" H 2200 6600 50  0000 C CNN
F 1 "LED" H 2200 6400 50  0000 C CNN
F 2 "LEDs:LED_D5.0mm" H 2200 6500 50  0001 C CNN
F 3 "" H 2200 6500 50  0001 C CNN
	1    2200 6500
	-1   0    0    1   
$EndComp
$Comp
L LED D103
U 1 1 5BD68AD8
P 2200 6000
F 0 "D103" H 2200 6100 50  0000 C CNN
F 1 "LED" H 2200 5900 50  0000 C CNN
F 2 "LEDs:LED_D5.0mm" H 2200 6000 50  0001 C CNN
F 3 "" H 2200 6000 50  0001 C CNN
	1    2200 6000
	-1   0    0    1   
$EndComp
$Comp
L R R118
U 1 1 5BD6964B
P 3800 6850
F 0 "R118" V 3700 6850 50  0000 C CNN
F 1 "6.8k" V 3800 6850 50  0000 C CNN
F 2 "Resistors_SMD:R_0603_HandSoldering" V 3730 6850 50  0001 C CNN
F 3 "" H 3800 6850 50  0001 C CNN
	1    3800 6850
	0    1    1    0   
$EndComp
$Comp
L GND #PWR108
U 1 1 5BD69DD9
P 3200 6600
F 0 "#PWR108" H 3200 6350 50  0001 C CNN
F 1 "GND" H 3200 6450 50  0000 C CNN
F 2 "" H 3200 6600 50  0001 C CNN
F 3 "" H 3200 6600 50  0001 C CNN
	1    3200 6600
	1    0    0    -1  
$EndComp
$Comp
L R R117
U 1 1 5BD6A1FD
P 3800 6350
F 0 "R117" V 3700 6350 50  0000 C CNN
F 1 "6.8k" V 3800 6350 50  0000 C CNN
F 2 "Resistors_SMD:R_0603_HandSoldering" V 3730 6350 50  0001 C CNN
F 3 "" H 3800 6350 50  0001 C CNN
	1    3800 6350
	0    1    1    0   
$EndComp
Text Label 1150 6000 0    60   ~ 0
5V
$Comp
L LED D108
U 1 1 5BD6B8FE
P 2550 6000
F 0 "D108" H 2550 6100 50  0000 C CNN
F 1 "LED" H 2550 5900 50  0000 C CNN
F 2 "LEDs:LED_D5.0mm" H 2550 6000 50  0001 C CNN
F 3 "" H 2550 6000 50  0001 C CNN
	1    2550 6000
	-1   0    0    1   
$EndComp
$Comp
L LED D109
U 1 1 5BD6B998
P 2550 6500
F 0 "D109" H 2550 6600 50  0000 C CNN
F 1 "LED" H 2550 6400 50  0000 C CNN
F 2 "LEDs:LED_D5.0mm" H 2550 6500 50  0001 C CNN
F 3 "" H 2550 6500 50  0001 C CNN
	1    2550 6500
	-1   0    0    1   
$EndComp
$Comp
L PCF8563 U105
U 1 1 5BD6CC35
P 5150 4850
F 0 "U105" H 5250 4500 50  0000 L CNN
F 1 "PCF8563" H 5250 4400 50  0000 L CNN
F 2 "Housings_SOIC:SOIC-8_3.9x4.9mm_Pitch1.27mm" H 5150 4850 50  0001 C CNN
F 3 "" H 5150 4850 50  0001 C CNN
	1    5150 4850
	1    0    0    -1  
$EndComp
$Comp
L D_Schottky_x2_KCom_AAK D112
U 1 1 5BD6CDAE
P 5150 4150
F 0 "D112" H 5100 4350 50  0000 C CNN
F 1 "BAT54C" H 5150 4250 50  0000 C CNN
F 2 "TO_SOT_Packages_SMD:SOT-23_Handsoldering" H 5150 4150 50  0001 C CNN
F 3 "" H 5150 4150 50  0001 C CNN
	1    5150 4150
	1    0    0    -1  
$EndComp
$Comp
L C C114
U 1 1 5BD6D479
P 4250 5250
F 0 "C114" H 4050 5350 50  0000 L CNN
F 1 "C" H 4050 5150 50  0000 L CNN
F 2 "Capacitors_SMD:C_0603_HandSoldering" H 4288 5100 50  0001 C CNN
F 3 "" H 4250 5250 50  0001 C CNN
	1    4250 5250
	1    0    0    -1  
$EndComp
$Comp
L GND #PWR114
U 1 1 5BD6D892
P 5150 5500
F 0 "#PWR114" H 5150 5250 50  0001 C CNN
F 1 "GND" H 5150 5350 50  0000 C CNN
F 2 "" H 5150 5500 50  0001 C CNN
F 3 "" H 5150 5500 50  0001 C CNN
	1    5150 5500
	1    0    0    -1  
$EndComp
$Comp
L Battery_Cell BT101
U 1 1 5BD6DB56
P 4600 4150
F 0 "BT101" V 4400 3850 50  0000 L CNN
F 1 "CR2032" V 4500 3850 50  0000 L CNN
F 2 "rpi-birdcam:keystone_electronics_106" V 4600 4210 50  0001 C CNN
F 3 "" V 4600 4210 50  0001 C CNN
	1    4600 4150
	0    1    1    0   
$EndComp
$Comp
L C C115
U 1 1 5BD6DD71
P 4800 4400
F 0 "C115" V 4750 4450 50  0000 L CNN
F 1 "100nF" V 4850 4450 50  0000 L CNN
F 2 "Capacitors_SMD:C_0603_HandSoldering" H 4838 4250 50  0001 C CNN
F 3 "" H 4800 4400 50  0001 C CNN
	1    4800 4400
	0    1    1    0   
$EndComp
$Comp
L GND #PWR112
U 1 1 5BD6EFAD
P 4500 4450
F 0 "#PWR112" H 4500 4200 50  0001 C CNN
F 1 "GND" H 4500 4300 50  0000 C CNN
F 2 "" H 4500 4450 50  0001 C CNN
F 3 "" H 4500 4450 50  0001 C CNN
	1    4500 4450
	1    0    0    -1  
$EndComp
Text Label 5500 4150 0    60   ~ 0
3.3V
$Comp
L R R101
U 1 1 5BD73BE7
P 1050 2150
F 0 "R101" V 950 2150 50  0000 C CNN
F 1 "22k" V 1050 2150 50  0000 C CNN
F 2 "Resistors_SMD:R_0603_HandSoldering" V 980 2150 50  0001 C CNN
F 3 "" H 1050 2150 50  0001 C CNN
	1    1050 2150
	1    0    0    -1  
$EndComp
$Comp
L R R102
U 1 1 5BD73D93
P 1050 2950
F 0 "R102" V 950 2950 50  0000 C CNN
F 1 "4.7k" V 1050 2950 50  0000 C CNN
F 2 "Resistors_SMD:R_0603_HandSoldering" V 980 2950 50  0001 C CNN
F 3 "" H 1050 2950 50  0001 C CNN
	1    1050 2950
	1    0    0    -1  
$EndComp
$Comp
L POT RV101
U 1 1 5BD743C3
P 1050 2550
F 0 "RV101" V 950 2550 50  0000 C CNN
F 1 "2k" V 1050 2550 50  0000 C CNN
F 2 "Potentiometers:Potentiometer_Trimmer_Bourns_3296Y" H 1050 2550 50  0001 C CNN
F 3 "" H 1050 2550 50  0001 C CNN
	1    1050 2550
	1    0    0    -1  
$EndComp
$Comp
L R R110
U 1 1 5BD756E9
P 1600 2950
F 0 "R110" V 1680 2950 50  0000 C CNN
F 1 "470k" V 1600 2950 50  0000 C CNN
F 2 "Resistors_SMD:R_0603_HandSoldering" V 1530 2950 50  0001 C CNN
F 3 "" H 1600 2950 50  0001 C CNN
	1    1600 2950
	-1   0    0    1   
$EndComp
$Comp
L R R104
U 1 1 5BD75FBB
P 1400 2550
F 0 "R104" V 1480 2550 50  0000 C CNN
F 1 "56k" V 1400 2550 50  0000 C CNN
F 2 "Resistors_SMD:R_0603_HandSoldering" V 1330 2550 50  0001 C CNN
F 3 "" H 1400 2550 50  0001 C CNN
	1    1400 2550
	0    1    1    0   
$EndComp
$Comp
L C C101
U 1 1 5BD776DE
P 800 2750
F 0 "C101" H 600 2850 50  0000 L CNN
F 1 "100nF" H 600 2650 50  0000 L CNN
F 2 "Capacitors_SMD:C_0603_HandSoldering" H 838 2600 50  0001 C CNN
F 3 "" H 800 2750 50  0001 C CNN
	1    800  2750
	1    0    0    -1  
$EndComp
$Comp
L GND #PWR104
U 1 1 5BD77F3A
P 1850 3000
F 0 "#PWR104" H 1850 2750 50  0001 C CNN
F 1 "GND" H 1850 2850 50  0000 C CNN
F 2 "" H 1850 3000 50  0001 C CNN
F 3 "" H 1850 3000 50  0001 C CNN
	1    1850 3000
	1    0    0    -1  
$EndComp
$Comp
L GND #PWR102
U 1 1 5BD781C4
P 1050 3200
F 0 "#PWR102" H 1050 2950 50  0001 C CNN
F 1 "GND" H 1050 3050 50  0001 C CNN
F 2 "" H 1050 3200 50  0001 C CNN
F 3 "" H 1050 3200 50  0001 C CNN
	1    1050 3200
	1    0    0    -1  
$EndComp
$Comp
L R R105
U 1 1 5BD78458
P 1400 3400
F 0 "R105" V 1480 3400 50  0000 C CNN
F 1 "100k" V 1400 3400 50  0000 C CNN
F 2 "Resistors_SMD:R_0603_HandSoldering" V 1330 3400 50  0001 C CNN
F 3 "" H 1400 3400 50  0001 C CNN
	1    1400 3400
	-1   0    0    1   
$EndComp
$Comp
L R R115
U 1 1 5BD8878C
P 2900 2500
F 0 "R115" V 2980 2500 50  0000 C CNN
F 1 "47k" V 2900 2500 50  0000 C CNN
F 2 "Resistors_SMD:R_0603_HandSoldering" V 2830 2500 50  0001 C CNN
F 3 "" H 2900 2500 50  0001 C CNN
	1    2900 2500
	0    -1   -1   0   
$EndComp
$Comp
L R R116
U 1 1 5BD88AA9
P 3300 2500
F 0 "R116" V 3380 2500 50  0000 C CNN
F 1 "33k" V 3300 2500 50  0000 C CNN
F 2 "Resistors_SMD:R_0603_HandSoldering" V 3230 2500 50  0001 C CNN
F 3 "" H 3300 2500 50  0001 C CNN
	1    3300 2500
	0    -1   -1   0   
$EndComp
$Comp
L C C112
U 1 1 5BD88DF8
P 3500 2300
F 0 "C112" H 3500 2400 50  0000 L CNN
F 1 "100nF" H 3500 2200 50  0000 L CNN
F 2 "Capacitors_SMD:C_0603_HandSoldering" H 3538 2150 50  0001 C CNN
F 3 "" H 3500 2300 50  0001 C CNN
	1    3500 2300
	1    0    0    -1  
$EndComp
$Comp
L LM4120 U103
U 1 1 5BD8B73A
P 3250 3000
F 0 "U103" H 2950 2750 50  0000 C CNN
F 1 "LM4120" H 2950 2650 50  0000 C CNN
F 2 "TO_SOT_Packages_SMD:SOT-23-5" H 3250 3050 50  0001 C CIN
F 3 "" H 3250 3000 50  0001 C CNN
	1    3250 3000
	1    0    0    -1  
$EndComp
$Comp
L C C111
U 1 1 5BD8C776
P 3450 3350
F 0 "C111" V 3350 3400 50  0000 L CNN
F 1 "22nF" V 3550 3400 50  0000 L CNN
F 2 "Capacitors_SMD:C_0603_HandSoldering" H 3488 3200 50  0001 C CNN
F 3 "" H 3450 3350 50  0001 C CNN
	1    3450 3350
	0    1    1    0   
$EndComp
$Comp
L D_Schottky_x2_KCom_AAK D106
U 1 1 5BD97A38
P 2300 3200
F 0 "D106" H 2350 3100 50  0000 C CNN
F 1 "BAT54C" H 2300 3300 50  0000 C CNN
F 2 "TO_SOT_Packages_SMD:SOT-23_Handsoldering" H 2300 3200 50  0001 C CNN
F 3 "" H 2300 3200 50  0001 C CNN
	1    2300 3200
	-1   0    0    1   
$EndComp
$Comp
L R R111
U 1 1 5BD9A7E7
P 1600 3400
F 0 "R111" V 1680 3400 50  0000 C CNN
F 1 "10k" V 1600 3400 50  0000 C CNN
F 2 "Resistors_SMD:R_0603_HandSoldering" V 1530 3400 50  0001 C CNN
F 3 "" H 1600 3400 50  0001 C CNN
	1    1600 3400
	1    0    0    -1  
$EndComp
$Comp
L GND #PWR105
U 1 1 5BD9C75B
P 2100 5500
F 0 "#PWR105" H 2100 5250 50  0001 C CNN
F 1 "GND" H 2100 5350 50  0001 C CNN
F 2 "" H 2100 5500 50  0001 C CNN
F 3 "" H 2100 5500 50  0001 C CNN
	1    2100 5500
	1    0    0    -1  
$EndComp
$Comp
L C C109
U 1 1 5BD9CD6B
P 3000 4100
F 0 "C109" H 2800 4000 50  0000 L CNN
F 1 "100nF" H 2800 4200 50  0000 L CNN
F 2 "Capacitors_SMD:C_0603_HandSoldering" H 3038 3950 50  0001 C CNN
F 3 "" H 3000 4100 50  0001 C CNN
	1    3000 4100
	-1   0    0    1   
$EndComp
$Comp
L GND #PWR107
U 1 1 5BD9CFC7
P 3000 4300
F 0 "#PWR107" H 3000 4050 50  0001 C CNN
F 1 "GND" H 3000 4150 50  0001 C CNN
F 2 "" H 3000 4300 50  0001 C CNN
F 3 "" H 3000 4300 50  0001 C CNN
	1    3000 4300
	1    0    0    -1  
$EndComp
Text Notes 1550 2000 0    60   ~ 0
Undervoltage shutdown
Text Label 1950 3600 0    60   ~ 0
VREF_2.5V
$Comp
L C C106
U 1 1 5BD9F3FA
P 2500 4100
F 0 "C106" V 2350 3850 50  0000 L CNN
F 1 "100nF" V 2450 3850 50  0000 L CNN
F 2 "Capacitors_SMD:C_0603_HandSoldering" H 2538 3950 50  0001 C CNN
F 3 "" H 2500 4100 50  0001 C CNN
	1    2500 4100
	0    1    1    0   
$EndComp
$Comp
L GND #PWR106
U 1 1 5BD9F603
P 2300 4150
F 0 "#PWR106" H 2300 3900 50  0001 C CNN
F 1 "GND" H 2300 4000 50  0001 C CNN
F 2 "" H 2300 4150 50  0001 C CNN
F 3 "" H 2300 4150 50  0001 C CNN
	1    2300 4150
	1    0    0    -1  
$EndComp
$Comp
L R R114
U 1 1 5BD9FC0A
P 2500 4300
F 0 "R114" V 2600 4300 50  0000 C CNN
F 1 "1k" V 2500 4300 50  0000 C CNN
F 2 "Resistors_SMD:R_0603_HandSoldering" V 2430 4300 50  0001 C CNN
F 3 "" H 2500 4300 50  0001 C CNN
	1    2500 4300
	0    1    1    0   
$EndComp
Text Label 3500 3900 0    60   ~ 0
3.3V
$Comp
L R R103
U 1 1 5BDA1C6F
P 1200 4500
F 0 "R103" V 1100 4500 50  0000 C CNN
F 1 "100k" V 1200 4500 50  0000 C CNN
F 2 "Resistors_SMD:R_0603_HandSoldering" V 1130 4500 50  0001 C CNN
F 3 "" H 1200 4500 50  0001 C CNN
	1    1200 4500
	1    0    0    -1  
$EndComp
$Comp
L C C102
U 1 1 5BDA1E2C
P 1200 5250
F 0 "C102" H 1250 5150 50  0000 L CNN
F 1 "100nF" H 1250 5350 50  0000 L CNN
F 2 "Capacitors_SMD:C_0603_HandSoldering" H 1238 5100 50  0001 C CNN
F 3 "" H 1200 5250 50  0001 C CNN
	1    1200 5250
	-1   0    0    1   
$EndComp
$Comp
L LDR03 R106
U 1 1 5BDA26FA
P 1450 4500
F 0 "R106" V 1550 4500 50  0000 C CNN
F 1 "PGM5537" V 1600 4500 50  0000 C TNN
F 2 "Opto-Devices:Resistor_LDR_5x4.1_RM3" V 1625 4500 50  0001 C CNN
F 3 "" H 1450 4450 50  0001 C CNN
	1    1450 4500
	1    0    0    -1  
$EndComp
$Comp
L Thermistor_PTC TH101
U 1 1 5BDA280B
P 1900 4500
F 0 "TH101" V 2000 4500 50  0000 C CNN
F 1 "NTC 10k@25°C" H 1700 4800 50  0000 C CNN
F 2 "Varistors:RV_Disc_D7_W3.4_P5" H 1950 4300 50  0001 L CNN
F 3 "" H 1900 4500 50  0001 C CNN
	1    1900 4500
	1    0    0    -1  
$EndComp
$Comp
L C C105
U 1 1 5BDA2F26
P 2100 5250
F 0 "C105" H 1900 5350 50  0000 L CNN
F 1 "100nF" H 1850 5400 50  0000 L CNN
F 2 "Capacitors_SMD:C_0603_HandSoldering" H 2138 5100 50  0001 C CNN
F 3 "" H 2100 5250 50  0001 C CNN
	1    2100 5250
	-1   0    0    1   
$EndComp
$Comp
L R R112
U 1 1 5BDA3019
P 1900 5250
F 0 "R112" V 1800 5250 50  0000 C CNN
F 1 "10k" V 1900 5250 50  0000 C CNN
F 2 "Resistors_SMD:R_0603_HandSoldering" V 1830 5250 50  0001 C CNN
F 3 "" H 1900 5250 50  0001 C CNN
	1    1900 5250
	1    0    0    -1  
$EndComp
$Comp
L C C104
U 1 1 5BDA33E7
P 1650 5250
F 0 "C104" H 1600 4950 50  0000 L CNN
F 1 "100nF" H 1550 5000 50  0000 L CNN
F 2 "Capacitors_SMD:C_0603_HandSoldering" H 1688 5100 50  0001 C CNN
F 3 "" H 1650 5250 50  0001 C CNN
	1    1650 5250
	-1   0    0    1   
$EndComp
$Comp
L R R107
U 1 1 5BDA371B
P 1450 5250
F 0 "R107" V 1350 5250 50  0000 C CNN
F 1 "10k" V 1450 5250 50  0000 C CNN
F 2 "Resistors_SMD:R_0603_HandSoldering" V 1380 5250 50  0001 C CNN
F 3 "" H 1450 5250 50  0001 C CNN
	1    1450 5250
	1    0    0    -1  
$EndComp
$Comp
L MCP3204 U102
U 1 1 5BD735D0
P 2800 4800
F 0 "U102" H 3250 4350 50  0000 R CNN
F 1 "MCP3204" H 3250 4250 50  0000 R CNN
F 2 "Housings_SOIC:SOIC-14_3.9x8.7mm_Pitch1.27mm" H 3700 4500 50  0001 C CNN
F 3 "" H 3700 4500 50  0001 C CNN
	1    2800 4800
	1    0    0    -1  
$EndComp
NoConn ~ 5550 4950
$Comp
L GND #PWR110
U 1 1 5BDADDC7
P 3500 2550
F 0 "#PWR110" H 3500 2300 50  0001 C CNN
F 1 "GND" H 3500 2400 50  0001 C CNN
F 2 "" H 3500 2550 50  0001 C CNN
F 3 "" H 3500 2550 50  0001 C CNN
	1    3500 2550
	1    0    0    -1  
$EndComp
$Comp
L GND #PWR109
U 1 1 5BDB4B22
P 3250 3400
F 0 "#PWR109" H 3250 3150 50  0001 C CNN
F 1 "GND" H 3250 3250 50  0001 C CNN
F 2 "" H 3250 3400 50  0001 C CNN
F 3 "" H 3250 3400 50  0001 C CNN
	1    3250 3400
	1    0    0    -1  
$EndComp
$Comp
L RPI J103
U 1 1 5BDE1827
P 9300 4100
F 0 "J103" H 9300 6100 50  0000 C CNN
F 1 "LTE Cat.1 Pi HAT" H 9300 2000 50  0000 C CNN
F 2 "rpi-birdcam:Raspberry_PI_ShieldConnector" H 9300 4100 50  0001 C CNN
F 3 "" H 9300 4100 50  0001 C CNN
	1    9300 4100
	1    0    0    -1  
$EndComp
Text Label 8500 2200 0    60   ~ 0
3.3V
Text Label 8500 2300 0    60   ~ 0
5V
Text Label 8400 5200 0    60   ~ 0
LTE_RESET
Text Label 8400 5000 0    60   ~ 0
LTE_POWER
Text Label 8400 2900 0    60   ~ 0
LTE_TXD
Text Label 8400 3100 0    60   ~ 0
LTE_RXD
Text Label 8400 3200 0    60   ~ 0
LTE_RTS
Text Label 8400 5700 0    60   ~ 0
LTE_CTS
Text Label 8400 2400 0    60   ~ 0
RPI_SDA
Text Label 8400 2600 0    60   ~ 0
RPI_SCL
$Comp
L GND #PWR118
U 1 1 5BDE836A
P 8850 6000
F 0 "#PWR118" H 8850 5750 50  0001 C CNN
F 1 "GND" H 8850 5850 50  0000 C CNN
F 2 "" H 8850 6000 50  0001 C CNN
F 3 "" H 8850 6000 50  0001 C CNN
	1    8850 6000
	0    1    1    0   
$EndComp
$Comp
L RPI J102
U 1 1 5BDE9629
P 7150 4100
F 0 "J102" H 7150 6100 50  0000 C CNN
F 1 "RPI" H 7150 2000 50  0000 C CNN
F 2 "rpi-birdcam:Raspberry_PI_Zero_V1.2_SocketStrip" H 7150 4100 50  0001 C CNN
F 3 "" H 7150 4100 50  0001 C CNN
	1    7150 4100
	1    0    0    -1  
$EndComp
Text Label 6350 2200 0    60   ~ 0
3.3V
Text Label 6350 2300 0    60   ~ 0
5V
Text Label 6250 2400 0    60   ~ 0
RPI_SDA
Text Label 6250 2600 0    60   ~ 0
RPI_SCL
Text Label 6250 2900 0    60   ~ 0
LTE_TXD
Text Label 6250 3100 0    60   ~ 0
LTE_RXD
Text Label 6250 3200 0    60   ~ 0
LTE_RTS
Text Label 6250 5000 0    60   ~ 0
LTE_POWER
Text Label 6250 5200 0    60   ~ 0
LTE_RESET
Text Label 6250 5700 0    60   ~ 0
LTE_CTS
Text Label 6250 4000 0    60   ~ 0
RPI_MOSI
Text Label 6250 4200 0    60   ~ 0
RPI_MISO
Text Label 6250 4400 0    60   ~ 0
RPI_SCLK
Text Label 6250 4500 0    60   ~ 0
~ADC_CE~
NoConn ~ 8950 2800
NoConn ~ 8950 3300
NoConn ~ 8950 3400
NoConn ~ 8950 3600
NoConn ~ 8950 3700
NoConn ~ 8950 3900
NoConn ~ 8950 4000
NoConn ~ 8950 4200
NoConn ~ 8950 4300
NoConn ~ 8950 4400
NoConn ~ 8950 4500
NoConn ~ 8950 4700
NoConn ~ 8950 4800
NoConn ~ 8950 4900
NoConn ~ 8950 5300
NoConn ~ 8950 5900
NoConn ~ 8950 6100
Wire Wire Line
	4000 1650 4000 1500
Wire Wire Line
	4100 1500 4100 1700
Wire Wire Line
	4200 1650 4200 1500
Connection ~ 4100 1650
Wire Wire Line
	4300 1650 4300 1500
Connection ~ 4200 1650
Connection ~ 4300 1650
Wire Wire Line
	5050 800  5050 1250
Wire Wire Line
	5450 1650 5450 1550
Connection ~ 5050 800 
Wire Wire Line
	5400 800  6050 800 
Wire Wire Line
	5100 800  5050 800 
Wire Wire Line
	5050 1650 5050 1550
Wire Wire Line
	2300 1650 5850 1650
Wire Wire Line
	5850 1650 5850 1350
Wire Wire Line
	5650 1350 5650 1650
Connection ~ 5650 1650
Wire Wire Line
	5650 1050 5650 800 
Connection ~ 5650 800 
Wire Wire Line
	5850 800  5850 1050
Connection ~ 5450 1650
Wire Wire Line
	5450 850  5450 800 
Connection ~ 5450 800 
Wire Wire Line
	5450 1150 5450 1250
Wire Wire Line
	5450 1200 4900 1200
Connection ~ 5450 1200
Wire Wire Line
	5050 800  4900 900 
Connection ~ 5050 1650
Wire Wire Line
	2650 900  3400 900 
Wire Wire Line
	3200 900  3200 1100
Wire Wire Line
	3000 900  3000 1100
Connection ~ 3200 900 
Wire Wire Line
	3200 1400 3200 1650
Connection ~ 4000 1650
Wire Wire Line
	3000 1400 3000 1650
Connection ~ 3200 1650
Wire Wire Line
	3350 1200 3400 1200
Wire Wire Line
	2800 900  2800 1100
Connection ~ 3000 900 
Wire Wire Line
	2800 1400 2800 1650
Connection ~ 3000 1650
Wire Wire Line
	1500 900  1650 900 
Wire Wire Line
	1950 900  2350 900 
Wire Wire Line
	2300 900  2300 1100
Connection ~ 2300 900 
Connection ~ 2800 900 
Wire Wire Line
	2300 1400 2300 1650
Connection ~ 2800 1650
Wire Wire Line
	4800 2100 6000 2100
Wire Wire Line
	4600 2500 4600 2400
Connection ~ 4850 2100
Wire Wire Line
	4850 2100 4850 2300
Wire Wire Line
	4300 2100 4400 2100
Wire Wire Line
	4300 2500 4600 2500
Wire Wire Line
	3950 2450 3950 2750
Wire Wire Line
	4000 2500 3950 2500
Connection ~ 3950 2500
Wire Wire Line
	3950 2600 4000 2600
Connection ~ 3950 2600
Wire Wire Line
	4300 2600 4650 2600
Wire Wire Line
	4600 2600 4600 2650
Wire Wire Line
	3950 3050 3950 3100
Wire Wire Line
	3950 3100 4600 3100
Wire Wire Line
	4600 3050 4600 3150
Connection ~ 4600 2600
Connection ~ 4600 3100
Wire Wire Line
	5150 2900 5150 3000
Wire Wire Line
	5150 2600 5150 2550
Wire Wire Line
	5050 2550 5050 2600
Connection ~ 4350 2100
Connection ~ 3950 2100
Wire Wire Line
	1000 900  1200 900 
Wire Wire Line
	1000 1000 1050 1000
Wire Wire Line
	1050 1000 1050 1050
Wire Wire Line
	2000 6500 2050 6500
Wire Wire Line
	1650 6500 1700 6500
Wire Wire Line
	1650 6000 1700 6000
Wire Wire Line
	2000 6000 2050 6000
Wire Wire Line
	2700 6500 2750 6500
Wire Wire Line
	3200 6000 3200 6600
Wire Wire Line
	1150 6000 1350 6000
Wire Wire Line
	1300 6000 1300 6500
Wire Wire Line
	1300 6500 1350 6500
Connection ~ 1300 6000
Wire Wire Line
	2350 6000 2400 6000
Wire Wire Line
	2350 6500 2400 6500
Wire Wire Line
	4700 5050 4750 5050
Wire Wire Line
	4400 5050 4250 5050
Wire Wire Line
	4250 4650 4250 5100
Wire Wire Line
	4250 4650 4750 4650
Connection ~ 4250 5050
Wire Wire Line
	4250 5450 4250 5400
Wire Wire Line
	5150 5250 5150 5500
Wire Wire Line
	4550 5250 4550 5450
Connection ~ 4550 5450
Connection ~ 5150 5450
Wire Wire Line
	5150 4350 5150 4450
Connection ~ 5150 4400
Wire Wire Line
	5150 4400 4950 4400
Wire Wire Line
	5500 4150 5450 4150
Wire Wire Line
	4250 5450 5150 5450
Wire Wire Line
	4650 4400 4500 4400
Wire Wire Line
	4500 4150 4500 4450
Connection ~ 4500 4400
Wire Wire Line
	4800 4150 4850 4150
Connection ~ 2700 900 
Connection ~ 2150 900 
Wire Wire Line
	1550 2550 1650 2550
Connection ~ 1600 2550
Connection ~ 4350 2500
Wire Wire Line
	1050 2300 1050 2400
Wire Wire Line
	800  3150 1050 3150
Wire Wire Line
	1050 3100 1050 3200
Wire Wire Line
	1050 2700 1050 2800
Wire Wire Line
	800  2350 1100 2350
Connection ~ 1050 2350
Wire Wire Line
	1850 2950 1850 3000
Connection ~ 1050 3150
Wire Wire Line
	800  2350 800  2600
Wire Wire Line
	800  2900 800  3150
Wire Wire Line
	3300 2100 4000 2100
Wire Wire Line
	2800 3000 2850 3000
Wire Wire Line
	1850 2100 1850 2350
Wire Wire Line
	2800 3100 2850 3100
Connection ~ 3250 3350
Wire Wire Line
	3100 2400 3100 2500
Wire Wire Line
	3050 2500 3150 2500
Connection ~ 3100 2500
Wire Wire Line
	2700 2500 2750 2500
Connection ~ 2700 2100
Wire Wire Line
	1200 2550 1250 2550
Wire Wire Line
	1650 2750 1400 2750
Wire Wire Line
	1400 2750 1400 3250
Wire Wire Line
	2250 2650 2300 2650
Wire Wire Line
	2300 2650 2300 3000
Wire Wire Line
	1600 3200 2000 3200
Wire Wire Line
	1600 2550 1600 2800
Wire Wire Line
	1600 3100 1600 3250
Connection ~ 1600 3200
Wire Wire Line
	1400 3550 1400 3600
Wire Wire Line
	1600 3600 1600 3550
Connection ~ 1600 3600
Wire Wire Line
	2700 5450 2700 5300
Wire Wire Line
	1200 5450 2800 5450
Wire Wire Line
	2800 5450 2800 5300
Wire Wire Line
	2800 3900 2800 4400
Wire Notes Line
	600  1900 6100 1900
Wire Notes Line
	2650 1900 2650 3650
Wire Notes Line
	600  3650 6100 3650
Wire Notes Line
	600  600  600  6950
Wire Wire Line
	4350 2500 4350 2700
Wire Wire Line
	2650 4300 2700 4300
Wire Wire Line
	2700 4100 2700 4400
Connection ~ 2700 4300
Wire Wire Line
	2800 3900 3500 3900
Wire Wire Line
	3000 4250 3000 4300
Wire Wire Line
	3000 3950 3000 3900
Connection ~ 3000 3900
Wire Wire Line
	1200 4650 1200 5100
Wire Wire Line
	1200 4700 2200 4700
Connection ~ 1200 4700
Wire Wire Line
	1900 4900 2200 4900
Wire Wire Line
	1900 4650 1900 5100
Wire Wire Line
	2100 5100 2100 5050
Wire Wire Line
	2100 5050 1900 5050
Connection ~ 1900 5050
Wire Wire Line
	2100 5400 2100 5500
Wire Wire Line
	1900 5450 1900 5400
Wire Wire Line
	1650 5450 1650 5400
Connection ~ 1900 5450
Wire Wire Line
	1450 5450 1450 5400
Connection ~ 1650 5450
Wire Wire Line
	1200 5450 1200 5400
Connection ~ 1450 5450
Wire Wire Line
	1650 5100 1650 5050
Wire Wire Line
	1650 5050 1450 5050
Wire Wire Line
	1450 4650 1450 5100
Connection ~ 1450 5050
Connection ~ 1900 4900
Wire Wire Line
	2200 4800 1450 4800
Connection ~ 1450 4800
Wire Wire Line
	1450 4350 1450 4300
Wire Wire Line
	1900 4300 1900 4350
Connection ~ 1900 4300
Wire Wire Line
	2700 4100 2650 4100
Wire Wire Line
	2350 4100 2300 4100
Wire Wire Line
	2300 4100 2300 4150
Wire Wire Line
	1050 2750 1200 2750
Wire Wire Line
	1200 2750 1200 4350
Connection ~ 1050 2750
Connection ~ 2100 5450
Connection ~ 2700 5450
Wire Wire Line
	1800 2100 2900 2100
Wire Wire Line
	3450 2500 3500 2500
Wire Wire Line
	3500 2450 3500 2550
Wire Wire Line
	3500 2100 3500 2150
Connection ~ 3500 2100
Connection ~ 3500 2500
Wire Wire Line
	3250 3300 3250 3400
Wire Wire Line
	3350 1200 3350 1850
Wire Wire Line
	3950 2100 3950 2150
Wire Wire Line
	3350 1850 4350 1850
Wire Wire Line
	4350 1850 4350 2100
Connection ~ 3700 2100
Wire Wire Line
	2700 900  2700 2500
Wire Wire Line
	1400 3600 3700 3600
Wire Wire Line
	4350 2700 2700 2700
Wire Wire Line
	2700 2700 2700 3200
Wire Wire Line
	2700 3200 2600 3200
Wire Wire Line
	3700 2100 3700 2800
Wire Wire Line
	3700 2800 2800 2800
Wire Wire Line
	2800 2800 2800 3100
Connection ~ 2800 3000
Wire Wire Line
	3650 3000 3700 3000
Wire Wire Line
	3700 3350 3600 3350
Wire Wire Line
	3300 3350 3250 3350
Connection ~ 3700 3350
Connection ~ 2050 4300
Wire Wire Line
	1450 4300 2350 4300
Wire Wire Line
	8500 2200 8950 2200
Wire Wire Line
	8500 2300 8950 2300
Wire Wire Line
	8900 2300 8900 2500
Wire Wire Line
	8900 2500 8950 2500
Connection ~ 8900 2300
Wire Wire Line
	8950 5200 8400 5200
Wire Wire Line
	8400 5000 8950 5000
Wire Wire Line
	8400 5700 8950 5700
Wire Wire Line
	8400 3200 8950 3200
Wire Wire Line
	8400 3100 8950 3100
Wire Wire Line
	8400 2900 8950 2900
Wire Wire Line
	8400 2600 8950 2600
Wire Wire Line
	8400 2400 8950 2400
Wire Wire Line
	8900 2700 8900 6000
Wire Wire Line
	8900 3000 8950 3000
Wire Wire Line
	8950 5100 8900 5100
Wire Wire Line
	8900 5500 8950 5500
Connection ~ 8900 5500
Wire Wire Line
	6350 2200 6800 2200
Wire Wire Line
	6350 2300 6800 2300
Wire Wire Line
	6750 2300 6750 2500
Wire Wire Line
	6750 2500 6800 2500
Connection ~ 6750 2300
Wire Wire Line
	6250 2400 6800 2400
Wire Wire Line
	6250 2600 6800 2600
Wire Wire Line
	6250 2900 6800 2900
Wire Wire Line
	6250 3100 6800 3100
Wire Wire Line
	6250 3200 6800 3200
Wire Wire Line
	6250 5000 6800 5000
Wire Wire Line
	6250 5200 6800 5200
Wire Wire Line
	6250 5700 6800 5700
Wire Wire Line
	6250 4000 6800 4000
Wire Wire Line
	6250 4500 6800 4500
Wire Wire Line
	6800 4400 6250 4400
Wire Wire Line
	6250 4200 6800 4200
Wire Wire Line
	2050 4300 2050 3600
Connection ~ 2050 3600
Wire Wire Line
	3700 3000 3700 3600
Wire Notes Line
	6100 5750 600  5750
Wire Wire Line
	6000 2100 6000 5050
Connection ~ 5850 800 
Text Label 6350 3800 0    60   ~ 0
3.3V
Wire Wire Line
	6350 3800 6800 3800
Entry Wire Line
	6150 2300 6250 2400
Entry Wire Line
	6150 2500 6250 2600
Entry Wire Line
	6150 2800 6250 2900
Entry Wire Line
	6150 3000 6250 3100
Entry Wire Line
	6150 3100 6250 3200
Entry Wire Line
	6150 3900 6250 4000
Entry Wire Line
	6150 4100 6250 4200
Entry Wire Line
	6150 4300 6250 4400
Entry Wire Line
	6150 4400 6250 4500
Entry Wire Line
	6150 4900 6250 5000
Entry Wire Line
	6150 5100 6250 5200
Entry Wire Line
	6150 5600 6250 5700
Text Label 3850 4900 2    60   ~ 0
RPI_MOSI
Wire Wire Line
	3850 4900 3400 4900
Text Label 3850 4800 2    60   ~ 0
RPI_MISO
Wire Wire Line
	3850 4800 3400 4800
Text Label 3850 4700 2    60   ~ 0
RPI_SCLK
Wire Wire Line
	3850 4700 3400 4700
Text Label 3850 5000 2    60   ~ 0
~ADC_CE~
Wire Wire Line
	3400 5000 3850 5000
Entry Wire Line
	3850 4700 3950 4600
Entry Wire Line
	3850 4800 3950 4700
Entry Wire Line
	3850 5000 3950 4900
Entry Wire Line
	3850 4900 3950 4800
Wire Wire Line
	6000 5050 5550 5050
Wire Notes Line
	3800 1900 3800 3650
Wire Bus Line
	6150 1950 6150 5800
Wire Bus Line
	3950 3850 3950 4900
Wire Bus Line
	3950 3850 6050 3850
Entry Bus Bus
	6050 3850 6150 3750
Entry Wire Line
	8300 5600 8400 5700
Entry Wire Line
	8300 5100 8400 5200
Entry Wire Line
	8300 4900 8400 5000
Entry Wire Line
	8300 3100 8400 3200
Entry Wire Line
	8300 3000 8400 3100
Entry Wire Line
	8300 2800 8400 2900
Entry Wire Line
	8300 2500 8400 2600
Entry Wire Line
	8300 2300 8400 2400
Wire Bus Line
	6150 1950 8300 1950
Wire Bus Line
	8300 1950 8300 5700
Wire Wire Line
	6800 2700 6750 2700
Wire Wire Line
	6750 2700 6750 6000
Wire Wire Line
	6750 3000 6800 3000
Wire Wire Line
	6750 3500 6800 3500
Connection ~ 6750 3000
Wire Wire Line
	6750 4100 6800 4100
Connection ~ 6750 3500
Wire Wire Line
	6750 4600 6800 4600
Connection ~ 6750 4100
Wire Wire Line
	6750 5100 6800 5100
Connection ~ 6750 4600
Wire Wire Line
	6750 5500 6800 5500
Connection ~ 6750 5100
Wire Wire Line
	6700 6000 6800 6000
Connection ~ 6750 5500
$Comp
L GND #PWR117
U 1 1 5BE00A0E
P 6700 6000
F 0 "#PWR117" H 6700 5750 50  0001 C CNN
F 1 "GND" H 6700 5850 50  0001 C CNN
F 2 "" H 6700 6000 50  0001 C CNN
F 3 "" H 6700 6000 50  0001 C CNN
	1    6700 6000
	0    1    1    0   
$EndComp
Connection ~ 6750 6000
Text Label 5900 4750 2    60   ~ 0
RPI_SDA
Text Label 5900 4650 2    60   ~ 0
RPI_SCL
Wire Wire Line
	5550 4650 6050 4650
Wire Wire Line
	6050 4750 5550 4750
Entry Wire Line
	6050 4650 6150 4550
Entry Wire Line
	6050 4750 6150 4650
Wire Wire Line
	5750 5400 5750 6850
Wire Wire Line
	5600 5300 5600 6350
Wire Wire Line
	5600 6350 3950 6350
Wire Wire Line
	5750 6850 3950 6850
Wire Notes Line
	6100 600  6100 5750
Wire Notes Line
	600  6950 4100 6950
Wire Notes Line
	600  600  6100 600 
NoConn ~ 6800 2800
NoConn ~ 6800 3300
NoConn ~ 6800 3900
NoConn ~ 6800 4300
NoConn ~ 6800 4700
NoConn ~ 6800 4800
NoConn ~ 6800 4900
$Comp
L LM393 U101
U 2 1 5C08132D
P 6750 1200
F 0 "U101" H 6900 1350 50  0000 C CNN
F 1 "LM393" H 7000 1050 50  0000 C CNN
F 2 "Housings_SOIC:SOIC-8_3.9x4.9mm_Pitch1.27mm" H 6750 1200 50  0001 C CNN
F 3 "" H 6750 1200 50  0001 C CNN
	2    6750 1200
	1    0    0    -1  
$EndComp
Wire Wire Line
	6800 3600 5150 3600
Wire Wire Line
	5150 3600 5150 3300
Connection ~ 5150 2950
$Comp
L GND #PWR115
U 1 1 5C084A08
P 5700 3250
F 0 "#PWR115" H 5700 3000 50  0001 C CNN
F 1 "GND" H 5700 3100 50  0001 C CNN
F 2 "" H 5700 3250 50  0001 C CNN
F 3 "" H 5700 3250 50  0001 C CNN
	1    5700 3250
	1    0    0    -1  
$EndComp
Wire Wire Line
	5700 3150 5700 3250
Wire Wire Line
	5050 2550 5550 2550
Connection ~ 5150 2550
$Comp
L C C103
U 1 1 5C086159
P 1650 2100
F 0 "C103" H 1675 2200 50  0000 L CNN
F 1 "100nF" H 1675 2000 50  0000 L CNN
F 2 "Capacitors_SMD:C_0603_HandSoldering" H 1688 1950 50  0001 C CNN
F 3 "" H 1650 2100 50  0001 C CNN
	1    1650 2100
	0    1    1    0   
$EndComp
$Comp
L GND #PWR103
U 1 1 5C0863E5
P 1450 2400
F 0 "#PWR103" H 1450 2150 50  0001 C CNN
F 1 "GND" H 1450 2250 50  0001 C CNN
F 2 "" H 1450 2400 50  0001 C CNN
F 3 "" H 1450 2400 50  0001 C CNN
	1    1450 2400
	1    0    0    -1  
$EndComp
Wire Wire Line
	1450 2400 1450 2100
Wire Wire Line
	1450 2100 1500 2100
Connection ~ 1850 2100
Wire Wire Line
	4850 2900 4850 2950
Wire Wire Line
	4850 2950 5050 2950
Wire Wire Line
	5050 2900 5050 3000
Connection ~ 5050 2950
Wire Wire Line
	5150 2950 5400 2950
Wire Wire Line
	5700 2750 5700 2700
Wire Wire Line
	5700 2700 6000 2700
Connection ~ 6000 2700
Wire Wire Line
	6450 1300 6400 1300
Wire Wire Line
	6400 1100 6400 1550
Wire Wire Line
	6400 1100 6450 1100
Connection ~ 6400 1300
Wire Wire Line
	2700 6000 2750 6000
Wire Wire Line
	2950 6800 2950 6850
Wire Wire Line
	2950 6850 3650 6850
Wire Wire Line
	2950 6300 2950 6350
Wire Wire Line
	2950 6350 3650 6350
Wire Wire Line
	3150 6500 3200 6500
Wire Wire Line
	3200 6000 3150 6000
Connection ~ 3200 6500
$Comp
L SW_Push SW101
U 1 1 5C08DE3B
P 4600 2850
F 0 "SW101" V 4650 2950 50  0000 L CNN
F 1 "SW_Push" V 4550 3100 50  0000 C CNN
F 2 "Wire_Connections_Bridges:WireConnection_0.80mmDrill" H 4600 3050 50  0001 C CNN
F 3 "" H 4600 3050 50  0001 C CNN
	1    4600 2850
	0    -1   -1   0   
$EndComp
$Comp
L Q_NPN_BEC Q101
U 1 1 5C090A4F
P 2950 6100
F 0 "Q101" V 3050 5800 50  0000 R CNN
F 1 "BC847C" V 2950 5800 50  0000 R CNN
F 2 "TO_SOT_Packages_SMD:SOT-23_Handsoldering" H 3150 6200 50  0001 C CNN
F 3 "" H 2950 6100 50  0001 C CNN
	1    2950 6100
	0    -1   -1   0   
$EndComp
$Comp
L Q_NPN_BEC Q102
U 1 1 5C090D1F
P 2950 6600
F 0 "Q102" V 3050 6300 50  0000 R CNN
F 1 "BC847C" V 3000 6300 50  0000 R CNN
F 2 "TO_SOT_Packages_SMD:SOT-23_Handsoldering" H 3150 6700 50  0001 C CNN
F 3 "" H 2950 6600 50  0001 C CNN
	1    2950 6600
	0    -1   -1   0   
$EndComp
$Comp
L Q_NPN_BEC Q103
U 1 1 5C090E44
P 3100 2200
F 0 "Q103" V 3100 2550 50  0000 R CNN
F 1 "BC847C" V 3000 2550 50  0000 R CNN
F 2 "TO_SOT_Packages_SMD:SOT-23_Handsoldering" H 3300 2300 50  0001 C CNN
F 3 "" H 3100 2200 50  0001 C CNN
	1    3100 2200
	0    -1   -1   0   
$EndComp
$Comp
L Q_NPN_BEC Q104
U 1 1 5C091677
P 4600 2200
F 0 "Q104" V 4600 2550 50  0000 R CNN
F 1 "BC847C" V 4500 2550 50  0000 R CNN
F 2 "TO_SOT_Packages_SMD:SOT-23_Handsoldering" H 4800 2300 50  0001 C CNN
F 3 "" H 4600 2200 50  0001 C CNN
	1    4600 2200
	0    -1   -1   0   
$EndComp
$Comp
L Q_NPN_BEC Q105
U 1 1 5C0917AF
P 5600 2950
F 0 "Q105" H 5800 3000 50  0000 L CNN
F 1 "Q_NPN_BEC" H 5800 2900 50  0000 L CNN
F 2 "TO_SOT_Packages_SMD:SOT-23_Handsoldering" H 5800 3050 50  0001 C CNN
F 3 "" H 5600 2950 50  0001 C CNN
	1    5600 2950
	1    0    0    -1  
$EndComp
$Comp
L Mounting_Hole MK103
U 1 1 5C09792D
P 8600 1050
F 0 "MK103" H 8600 1250 50  0000 C CNN
F 1 "Case" H 8600 1175 50  0000 C CNN
F 2 "rpi-birdcam:Kradex_Z59" H 8600 1050 50  0001 C CNN
F 3 "" H 8600 1050 50  0001 C CNN
	1    8600 1050
	1    0    0    -1  
$EndComp
$Comp
L Mounting_Hole MK105
U 1 1 5C0981F1
P 9650 1050
F 0 "MK105" H 9650 1250 50  0000 C CNN
F 1 "Raspberry PI Camera Module V2.1" H 9650 1175 50  0000 C CNN
F 2 "rpi-birdcam:Raspberry_PI_Camera_Module_V2.1" H 9650 1050 50  0001 C CNN
F 3 "" H 9650 1050 50  0001 C CNN
	1    9650 1050
	1    0    0    -1  
$EndComp
$Comp
L Crystal_GND3 Y101
U 1 1 5C166F82
P 4550 5050
F 0 "Y101" H 4550 5275 50  0000 C CNN
F 1 "32.768 kHz" H 4550 5200 50  0000 C CNN
F 2 "Crystals:Crystal_AT310_d3.0mm_l10.0mm_Horizontal_1EP_style2" H 4550 5050 50  0001 C CNN
F 3 "" H 4550 5050 50  0001 C CNN
	1    4550 5050
	1    0    0    -1  
$EndComp
Wire Wire Line
	6400 1550 7100 1550
Wire Wire Line
	6650 1500 6650 1600
$Comp
L GND #PWR116
U 1 1 5C180EB4
P 6650 1600
F 0 "#PWR116" H 6650 1350 50  0001 C CNN
F 1 "GND" H 6650 1450 50  0000 C CNN
F 2 "" H 6650 1600 50  0001 C CNN
F 3 "" H 6650 1600 50  0001 C CNN
	1    6650 1600
	1    0    0    -1  
$EndComp
Connection ~ 6650 1550
Text Label 8500 3800 0    60   ~ 0
3.3V
Wire Wire Line
	8500 3800 8950 3800
Wire Wire Line
	8850 6000 8950 6000
Connection ~ 8900 6000
Wire Wire Line
	8900 4600 8950 4600
Connection ~ 8900 5100
Wire Wire Line
	8900 4100 8950 4100
Connection ~ 8900 4600
Wire Wire Line
	8900 3500 8950 3500
Connection ~ 8900 4100
Connection ~ 8900 3000
Connection ~ 8900 3500
Wire Wire Line
	8900 2700 8950 2700
Text Label 3500 1850 0    60   ~ 0
~PWR_EN~
Text Notes 2750 2000 0    60   ~ 0
Aux Voltage ~~1/2 Vcc
Wire Notes Line
	2650 2750 3800 2750
Text Notes 4400 2000 0    60   ~ 0
Power Switch with Soft Off
Text Label 2300 2650 3    60   ~ 0
~UV~
Text Notes 3800 3600 0    60   ~ 0
Soft-Off by C113, R122\ndischarge and \nthrough Q104 ~~ 4Sec
Text Notes 5150 2300 0    60   ~ 0
Power-Off by RPI \nthrough Q105
Text Notes 4150 3800 0    60   ~ 0
RTC with Wake-Alarm (Power On)
Text Label 6250 3400 0    60   ~ 0
~PWR_BTN~
Text Label 6250 3600 0    60   ~ 0
~PWR_OFF~
Text Label 6000 2700 2    60   ~ 0
~PWR_ON~
Wire Notes Line
	4000 3650 4000 5750
Wire Notes Line
	4100 6950 4100 5750
NoConn ~ 2200 5000
$Comp
L R R129
U 1 1 5C28CFF8
P 3450 4100
F 0 "R129" V 3550 4100 50  0000 C CNN
F 1 "10k" V 3450 4100 50  0000 C CNN
F 2 "Resistors_SMD:R_0603_HandSoldering" V 3380 4100 50  0001 C CNN
F 3 "" H 3450 4100 50  0001 C CNN
	1    3450 4100
	-1   0    0    1   
$EndComp
Wire Wire Line
	3450 3900 3450 3950
Connection ~ 3450 3900
Wire Wire Line
	3450 4250 3450 5000
Connection ~ 3450 5000
Wire Wire Line
	7100 1550 7100 1200
Wire Wire Line
	7100 1200 7050 1200
Wire Wire Line
	6800 5300 5600 5300
Wire Wire Line
	6800 5400 5750 5400
NoConn ~ 6800 6100
Text Label 8400 5800 0    60   ~ 0
LTE_RST2
Text Label 8400 5600 0    60   ~ 0
LTE_INH
Text Label 8400 5400 0    60   ~ 0
LTE_DTR
Wire Wire Line
	6800 3400 5050 3400
Wire Wire Line
	5050 3400 5050 3300
Text Label 6250 5800 0    60   ~ 0
LTE_RST2
Text Label 6250 5600 0    60   ~ 0
LTE_INH
Wire Wire Line
	8400 5600 8950 5600
Wire Wire Line
	8950 5800 8400 5800
Wire Wire Line
	6800 5800 6250 5800
Wire Wire Line
	6250 5600 6800 5600
Entry Wire Line
	6150 5500 6250 5600
Entry Wire Line
	6150 5700 6250 5800
Entry Wire Line
	8300 5500 8400 5600
Entry Wire Line
	8300 5700 8400 5800
Text Label 6250 5900 0    60   ~ 0
LTE_DTR
Wire Wire Line
	6250 5900 6800 5900
Wire Wire Line
	8950 5400 8400 5400
Entry Wire Line
	8300 5300 8400 5400
Entry Wire Line
	6150 5800 6250 5900
Text Notes 7700 5450 0    60   ~ 0
WARNING:\nDifferent PIN
$Comp
L R R113
U 1 1 5C54A81B
P 5500 3200
F 0 "R113" V 5600 3200 50  0000 C CNN
F 1 "10k" V 5500 3200 50  0000 C CNN
F 2 "Resistors_SMD:R_0603_HandSoldering" V 5430 3200 50  0001 C CNN
F 3 "" H 5500 3200 50  0001 C CNN
	1    5500 3200
	0    1    1    0   
$EndComp
Wire Wire Line
	5650 3200 5700 3200
Connection ~ 5700 3200
$Comp
L C C118
U 1 1 5C54BB2A
P 5300 2750
F 0 "C118" H 5350 2850 50  0000 L CNN
F 1 "1µF" H 5350 2650 50  0000 L CNN
F 2 "Capacitors_SMD:C_0603_HandSoldering" H 5338 2600 50  0001 C CNN
F 3 "" H 5300 2750 50  0001 C CNN
	1    5300 2750
	1    0    0    -1  
$EndComp
Wire Wire Line
	5300 2600 5300 2550
Connection ~ 5300 2550
Wire Wire Line
	5300 2900 5300 3200
Connection ~ 5300 2950
Wire Wire Line
	5300 3200 5350 3200
$Comp
L LM393 U101
U 1 1 5BD732E8
P 1950 2650
F 0 "U101" H 2000 2950 50  0000 C CNN
F 1 "LM393" H 2000 2850 50  0000 C CNN
F 2 "Housings_SOIC:SOIC-8_3.9x4.9mm_Pitch1.27mm" H 1950 2650 50  0001 C CNN
F 3 "" H 1950 2650 50  0001 C CNN
	1    1950 2650
	1    0    0    -1  
$EndComp
Wire Wire Line
	1150 900  1150 1950
Wire Wire Line
	1150 1950 1050 1950
Wire Wire Line
	1050 1950 1050 2000
Connection ~ 1150 900 
$Comp
L D_Zener D113
U 1 1 5C72B017
P 1250 2350
F 0 "D113" H 1250 2450 50  0000 C CNN
F 1 "3.6V" H 1250 2250 50  0000 C CNN
F 2 "Diodes_SMD:D_MiniMELF_Handsoldering" H 1250 2350 50  0001 C CNN
F 3 "" H 1250 2350 50  0001 C CNN
	1    1250 2350
	1    0    0    -1  
$EndComp
Wire Wire Line
	1400 2350 1450 2350
Connection ~ 1450 2350
$EndSCHEMATC
