[
  {
    "count": 1,
    "qstamp": 0.0,
    "number": 0,
    "time_signature": "3/4",
    "nominal_length": 3.0,
    "actual_length": 1.0,
    "start_repeat": false,
    "end_repeat": false,
    "next": [
      2
    ]
  },
  {
    "count": 2,
    "qstamp": 1.0,
    "number": 1,
    "time_signature": "3/4",
    "nominal_length": 3.0,
    "actual_length": 3.0,
    "start_repeat": false,
    "end_repeat": false,
    "next": [
      3
    ]
  },
  {
    "count": 3,
    "qstamp": 4.0,
    "number": 2,
    "time_signature": "3/4",
    "nominal_length": 3.0,
    "actual_length": 3.0,
    "start_repeat": false,
    "end_repeat": false,
    "next": [
      4
    ]
  },
  {
    "count": 4,
    "qstamp": 7.0,
    "number": 3,
    "time_signature": "3/4",
    "nominal_length": 3.0,
    "actual_length": 3.0,
    "start_repeat": false,
    "end_repeat": false,
    "next": [
      5
    ]
  },
  {
    "count": 5,
    "qstamp": 10.0,
    "number": 4,
    "time_signature": "3/4",
    "nominal_length": 3.0,
    "actual_length": 3.0,
    "start_repeat": false,
    "end_repeat": false,
    "next": [
      6
    ]
  },
  {
    "count": 6,
    "qstamp": 13.0,
    "number": 5,
    "time_signature": "3/4",
    "nominal_length": 3.0,
    "actual_length": 3.0,
    "start_repeat": false,
    "end_repeat": false,
    "next": [
      7
    ]
  },
  {
    "count": 7,
    "qstamp": 16.0,
    "number": 6,
    "time_signature": "3/4",
    "nominal_length": 3.0,
    "actual_length": 3.0,
    "start_repeat": false,
    "end_repeat": false,
    "next": [
      8
    ]
  },
  {
    "count": 8,
    "qstamp": 19.0,
    "number": 7,
    "time_signature": "3/4",
    "nominal_length": 3.0,
    "actual_length": 3.0,
    "start_repeat": false,
    "end_repeat": false,
    "next": [
      9
    ]
  },
  {
    "count": 9,
    "qstamp": 22.0,
    "number": 8,
    "time_signature": "3/4",
    "nominal_length": 3.0,
    "actual_length": 3.0,
    "start_repeat": false,
    "end_repeat": false,
    "next": [
      10
    ]
  },
  {
    "count": 10,
    "qstamp": 25.0,
    "number": 9,
    "time_signature": "3/4",
    "nominal_length": 3.0,
    "actual_length": 3.0,
    "start_repeat": false,
    "end_repeat": false,
    "next": [
      11
    ]
  },
  {
    "count": 11,
    "qstamp": 28.0,
    "number": 10,
    "time_signature": "3/4",
    "nominal_length": 3.0,
    "actual_length": 3.0,
    "start_repeat": false,
    "end_repeat": false,
    "next": [
      12
    ]
  },
  {
    "count": 12,
    "qstamp": 31.0,
    "number": 11,
    "time_signature": "3/4",
    "nominal_length": 3.0,
    "actual_length": 3.0,
    "start_repeat": false,
    "end_repeat": false,
    "next": [
      13
    ]
  },
  {
    "count": 13,
    "qstamp": 34.0,
    "number": 12,
    "time_signature": "3/4",
    "nominal_length": 3.0,
    "actual_length": 3.0,
    "start_repeat": false,
    "end_repeat": false,
    "next": [
      14
    ]
  },
  {
    "count": 14,
    "qstamp": 37.0,
    "number": 13,
    "time_signature": "3/4",
    "nominal_length": 3.0,
    "actual_length": 3.0,
    "start_repeat": false,
    "end_repeat": false,
    "next": [
      15
    ]
  },
  {
    "count": 15,
    "qstamp": 40.0,
    "number": 14,
    "time_signature": "3/4",
    "nominal_length": 3.0,
    "actual_length": 3.0,
    "start_repeat": false,
    "end_repeat": false,
    "next": [
      16
    ]
  },
  {
    "count": 16,
    "qstamp": 43.0,
    "number": 15,
    "time_signature": "3/4",
    "nominal_length": 3.0,
    "actual_length": 3.0,
    "start_repeat": false,
    "end_repeat": false,
    "next": []
  }
]