[
  {
    "count": 1,
    "qstamp": 0.0,
    "number": 0,
    "time_signature": "3/4",
    "nominal_length": 3.0,
    "actual_length": 1.0,
    "start_repeat": false,
    "end_repeat": false,
    "next": [
      2
    ]
  },
  {
    "count": 2,
    "qstamp": 1.0,
    "number": 1,
    "time_signature": "3/4",
    "nominal_length": 3.0,
    "actual_length": 3.0,
    "start_repeat": false,
    "end_repeat": false,
    "next": [
      3
    ]
  },
  {
    "count": 3,
    "qstamp": 4.0,
    "number": 2,
    "time_signature": "3/4",
    "nominal_length": 3.0,
    "actual_length": 3.25,
    "start_repeat": false,
    "end_repeat": false,
    "next": [
      4
    ]
  },
  {
    "count": 4,
    "qstamp": 7.25,
    "number": 3,
    "time_signature": "3/4",
    "nominal_length": 3.0,
    "actual_length": 3.0,
    "start_repeat": false,
    "end_repeat": false,
    "next": [
      5
    ]
  },
  {
    "count": 5,
    "qstamp": 10.25,
    "number": 4,
    "time_signature": "3/4",
    "nominal_length": 3.0,
    "actual_length": 2.0,
    "start_repeat": false,
    "end_repeat": false,
    "next": []
  }
]