[
  {
    "count": 1,
    "qstamp": 0.0,
    "number": 1,
    "time_signature": "4/4",
    "nominal_length": 4.0,
    "actual_length": 1.5,
    "start_repeat": false,
    "end_repeat": false,
    "next": [
      2
    ]
  },
  {
    "count": 2,
    "qstamp": 1.5,
    "number": 2,
    "time_signature": "4/4",
    "nominal_length": 4.0,
    "actual_length": 4.0,
    "start_repeat": false,
    "end_repeat": false,
    "next": [
      3
    ]
  },
  {
    "count": 3,
    "qstamp": 5.5,
    "number": 3,
    "time_signature": "4/4",
    "nominal_length": 4.0,
    "actual_length": 4.0,
    "start_repeat": false,
    "end_repeat": false,
    "next": [
      4
    ]
  },
  {
    "count": 4,
    "qstamp": 9.5,
    "number": 4,
    "time_signature": "4/4",
    "nominal_length": 4.0,
    "actual_length": 4.0,
    "start_repeat": false,
    "end_repeat": false,
    "next": [
      5
    ]
  },
  {
    "count": 5,
    "qstamp": 13.5,
    "number": 5,
    "time_signature": "4/4",
    "nominal_length": 4.0,
    "actual_length": 2.0,
    "start_repeat": false,
    "end_repeat": false,
    "next": []
  }
]