[
  {
    "count": 1,
    "qstamp": 0.0,
    "number": 0,
    "time_signature": "6/8",
    "nominal_length": 3.0,
    "actual_length": 0.5,
    "start_repeat": false,
    "end_repeat": false,
    "next": [
      2
    ]
  },
  {
    "count": 2,
    "qstamp": 0.5,
    "number": 1,
    "time_signature": "6/8",
    "nominal_length": 3.0,
    "actual_length": 3.0,
    "start_repeat": false,
    "end_repeat": false,
    "next": [
      3
    ]
  },
  {
    "count": 3,
    "qstamp": 3.5,
    "number": 2,
    "time_signature": "6/8",
    "nominal_length": 3.0,
    "actual_length": 3.0,
    "start_repeat": false,
    "end_repeat": false,
    "next": [
      4
    ]
  },
  {
    "count": 4,
    "qstamp": 6.5,
    "number": 3,
    "time_signature": "6/8",
    "nominal_length": 3.0,
    "actual_length": 3.0,
    "start_repeat": false,
    "end_repeat": false,
    "next": [
      5
    ]
  },
  {
    "count": 5,
    "qstamp": 9.5,
    "number": 4,
    "time_signature": "6/8",
    "nominal_length": 3.0,
    "actual_length": 3.5,
    "start_repeat": false,
    "end_repeat": false,
    "next": [
      6
    ]
  },
  {
    "count": 6,
    "qstamp": 13.0,
    "number": 5,
    "time_signature": "6/8",
    "nominal_length": 3.0,
    "actual_length": 3.0,
    "start_repeat": false,
    "end_repeat": false,
    "next": [
      7
    ]
  },
  {
    "count": 7,
    "qstamp": 16.0,
    "number": 6,
    "time_signature": "6/8",
    "nominal_length": 3.0,
    "actual_length": 3.0,
    "start_repeat": false,
    "end_repeat": false,
    "next": [
      8
    ]
  },
  {
    "count": 8,
    "qstamp": 19.0,
    "number": 7,
    "time_signature": "6/8",
    "nominal_length": 3.0,
    "actual_length": 3.0,
    "start_repeat": false,
    "end_repeat": false,
    "next": [
      9
    ]
  },
  {
    "count": 9,
    "qstamp": 22.0,
    "number": 8,
    "time_signature": "6/8",
    "nominal_length": 3.0,
    "actual_length": 3.0,
    "start_repeat": false,
    "end_repeat": true,
    "next": [
      1
    ]
  }
]