[
  {
    "count": 1,
    "qstamp": 0.0,
    "number": 0,
    "time_signature": "7/8",
    "nominal_length": 3.5,
    "actual_length": 1.0,
    "start_repeat": false,
    "end_repeat": false,
    "next": [
      2
    ]
  },
  {
    "count": 2,
    "qstamp": 1.0,
    "number": 1,
    "time_signature": "7/8",
    "nominal_length": 3.5,
    "actual_length": 3.5,
    "start_repeat": false,
    "end_repeat": false,
    "next": [
      3
    ]
  },
  {
    "count": 3,
    "qstamp": 4.5,
    "number": 2,
    "time_signature": "7/8",
    "nominal_length": 3.5,
    "actual_length": 3.5,
    "start_repeat": false,
    "end_repeat": false,
    "next": [
      4
    ]
  },
  {
    "count": 4,
    "qstamp": 8.0,
    "number": 3,
    "time_signature": "7/8",
    "nominal_length": 3.5,
    "actual_length": 3.5,
    "start_repeat": false,
    "end_repeat": false,
    "next": [
      5
    ]
  },
  {
    "count": 5,
    "qstamp": 11.5,
    "number": 4,
    "time_signature": "7/8",
    "nominal_length": 3.5,
    "actual_length": 3.5,
    "start_repeat": false,
    "end_repeat": false,
    "next": [
      6
    ]
  },
  {
    "count": 6,
    "qstamp": 15.0,
    "number": 5,
    "time_signature": "7/8",
    "nominal_length": 3.5,
    "actual_length": 3.5,
    "start_repeat": false,
    "end_repeat": false,
    "next": [
      7
    ]
  },
  {
    "count": 7,
    "qstamp": 18.5,
    "number": 6,
    "time_signature": "7/8",
    "nominal_length": 3.5,
    "actual_length": 3.5,
    "start_repeat": false,
    "end_repeat": false,
    "next": [
      8
    ]
  },
  {
    "count": 8,
    "qstamp": 22.0,
    "number": 7,
    "time_signature": "3/4",
    "nominal_length": 3.0,
    "actual_length": 3.0,
    "start_repeat": false,
    "end_repeat": false,
    "next": [
      9
    ]
  },
  {
    "count": 9,
    "qstamp": 25.0,
    "number": 8,
    "time_signature": "3/4",
    "nominal_length": 3.0,
    "actual_length": 2.0,
    "start_repeat": false,
    "end_repeat": false,
    "next": []
  }
]