[
  {
    "count": 1,
    "qstamp": 0.0,
    "number": 1,
    "time_signature": "3/4",
    "nominal_length": 3.0,
    "actual_length": 3.0,
    "start_repeat": false,
    "end_repeat": false,
    "next": [
      2
    ]
  },
  {
    "count": 2,
    "qstamp": 3.0,
    "number": 2,
    "time_signature": "3/4",
    "nominal_length": 3.0,
    "actual_length": 3.0,
    "start_repeat": false,
    "end_repeat": false,
    "next": [
      3
    ]
  },
  {
    "count": 3,
    "qstamp": 6.0,
    "number": 3,
    "time_signature": "3/4",
    "nominal_length": 3.0,
    "actual_length": 3.0,
    "start_repeat": false,
    "end_repeat": false,
    "next": [
      4
    ]
  },
  {
    "count": 4,
    "qstamp": 9.0,
    "number": 4,
    "time_signature": "3/4",
    "nominal_length": 3.0,
    "actual_length": 3.0,
    "start_repeat": false,
    "end_repeat": false,
    "next": [
      5
    ]
  },
  {
    "count": 5,
    "qstamp": 12.0,
    "number": 5,
    "time_signature": "3/4",
    "nominal_length": 3.0,
    "actual_length": 3.0,
    "start_repeat": false,
    "end_repeat": false,
    "next": [
      6
    ]
  },
  {
    "count": 6,
    "qstamp": 15.0,
    "number": 6,
    "time_signature": "3/4",
    "nominal_length": 3.0,
    "actual_length": 3.0,
    "start_repeat": false,
    "end_repeat": false,
    "next": []
  }
]