[
  {
    "count": 1,
    "qstamp": 0.0,
    "number": 1,
    "time_signature": "7/8",
    "nominal_length": 3.5,
    "actual_length": 3.5,
    "start_repeat": false,
    "end_repeat": false,
    "next": [
      2
    ]
  },
  {
    "count": 2,
    "qstamp": 3.5,
    "number": 2,
    "time_signature": "7/8",
    "nominal_length": 3.5,
    "actual_length": 2.5,
    "start_repeat": false,
    "end_repeat": false,
    "next": [
      3
    ]
  },
  {
    "count": 3,
    "qstamp": 6.0,
    "number": 3,
    "time_signature": "7/8",
    "nominal_length": 3.5,
    "actual_length": 3.5,
    "start_repeat": false,
    "end_repeat": false,
    "next": [
      4
    ]
  },
  {
    "count": 4,
    "qstamp": 9.5,
    "number": 4,
    "time_signature": "7/8",
    "nominal_length": 3.5,
    "actual_length": 2.0,
    "start_repeat": false,
    "end_repeat": false,
    "next": [
      5
    ]
  },
  {
    "count": 5,
    "qstamp": 11.5,
    "number": 5,
    "time_signature": "7/8",
    "nominal_length": 3.5,
    "actual_length": 0.5,
    "start_repeat": true,
    "end_repeat": false,
    "next": [
      6
    ]
  },
  {
    "count": 6,
    "qstamp": 12.0,
    "number": 6,
    "time_signature": "7/8",
    "nominal_length": 3.5,
    "actual_length": 3.5,
    "start_repeat": false,
    "end_repeat": false,
    "next": [
      7
    ]
  },
  {
    "count": 7,
    "qstamp": 15.5,
    "number": 7,
    "time_signature": "7/8",
    "nominal_length": 3.5,
    "actual_length": 2.5,
    "start_repeat": false,
    "end_repeat": false,
    "next": [
      8
    ]
  },
  {
    "count": 8,
    "qstamp": 18.0,
    "number": 8,
    "time_signature": "7/8",
    "nominal_length": 3.5,
    "actual_length": 3.5,
    "start_repeat": false,
    "end_repeat": false,
    "next": [
      9
    ]
  },
  {
    "count": 9,
    "qstamp": 21.5,
    "number": 9,
    "time_signature": "7/8",
    "nominal_length": 3.5,
    "actual_length": 2.5,
    "start_repeat": false,
    "end_repeat": true,
    "next": [
      5
    ]
  }
]