[
  {
    "count": 1,
    "qstamp": 0.0,
    "number": 0,
    "time_signature": "4/4",
    "nominal_length": 4.0,
    "actual_length": 1.0,
    "start_repeat": false,
    "end_repeat": false,
    "next": [
      2
    ]
  },
  {
    "count": 2,
    "qstamp": 1.0,
    "number": 1,
    "time_signature": "4/4",
    "nominal_length": 4.0,
    "actual_length": 4.0,
    "start_repeat": false,
    "end_repeat": false,
    "next": [
      3
    ]
  },
  {
    "count": 3,
    "qstamp": 5.0,
    "number": 2,
    "time_signature": "4/4",
    "nominal_length": 4.0,
    "actual_length": 4.0,
    "start_repeat": false,
    "end_repeat": false,
    "next": [
      4
    ]
  },
  {
    "count": 4,
    "qstamp": 9.0,
    "number": 3,
    "time_signature": "4/4",
    "nominal_length": 4.0,
    "actual_length": 4.0,
    "start_repeat": false,
    "end_repeat": false,
    "next": [
      5
    ]
  },
  {
    "count": 5,
    "qstamp": 13.0,
    "number": 4,
    "time_signature": "3/4",
    "nominal_length": 3.0,
    "actual_length": 3.0,
    "start_repeat": false,
    "end_repeat": false,
    "next": [
      6
    ]
  },
  {
    "count": 6,
    "qstamp": 16.0,
    "number": 5,
    "time_signature": "4/4",
    "nominal_length": 4.0,
    "actual_length": 4.0,
    "start_repeat": false,
    "end_repeat": false,
    "next": [
      7
    ]
  },
  {
    "count": 7,
    "qstamp": 20.0,
    "number": 6,
    "time_signature": "4/4",
    "nominal_length": 4.0,
    "actual_length": 4.0,
    "start_repeat": false,
    "end_repeat": false,
    "next": [
      8
    ]
  },
  {
    "count": 8,
    "qstamp": 24.0,
    "number": 7,
    "time_signature": "4/4",
    "nominal_length": 4.0,
    "actual_length": 4.0,
    "start_repeat": false,
    "end_repeat": false,
    "next": [
      9
    ]
  },
  {
    "count": 9,
    "qstamp": 28.0,
    "number": 8,
    "time_signature": "4/4",
    "nominal_length": 4.0,
    "actual_length": 3.0,
    "start_repeat": false,
    "end_repeat": false,
    "next": []
  }
]