[
  {
    "onset": 0.5,
    "date": 0
  },
  {
    "onset": 2.5,
    "date": 1.9084800000000002
  },
  {
    "onset": 10.5,
    "date": 8.307712
  },
  {
    "onset": 18.5,
    "date": 14.434560000000001
  },
  {
    "onset": 23.5,
    "date": 17.92
  }
]