[
  {
    "count": 1,
    "qstamp": 0.0,
    "number": 0,
    "time_signature": "6/8",
    "nominal_length": 3.0,
    "actual_length": 0.5,
    "start_repeat": false,
    "end_repeat": false,
    "next": [
      2
    ]
  },
  {
    "count": 2,
    "qstamp": 0.5,
    "number": 1,
    "time_signature": "6/8",
    "nominal_length": 3.0,
    "actual_length": 3.0,
    "start_repeat": false,
    "end_repeat": false,
    "next": [
      3
    ]
  },
  {
    "count": 3,
    "qstamp": 3.5,
    "number": 2,
    "time_signature": "6/8",
    "nominal_length": 3.0,
    "actual_length": 2.0,
    "start_repeat": false,
    "end_repeat": false,
    "next": [
      4
    ]
  },
  {
    "count": 4,
    "qstamp": 5.5,
    "number": 3,
    "time_signature": "6/8",
    "nominal_length": 3.0,
    "actual_length": 3.0,
    "start_repeat": false,
    "end_repeat": false,
    "next": [
      5
    ]
  },
  {
    "count": 5,
    "qstamp": 8.5,
    "number": 4,
    "time_signature": "6/8",
    "nominal_length": 3.0,
    "actual_length": 2.5,
    "start_repeat": false,
    "end_repeat": false,
    "next": [
      6
    ]
  },
  {
    "count": 6,
    "qstamp": 11.0,
    "number": 4,
    "time_signature": "6/8",
    "nominal_length": 3.0,
    "actual_length": 0.5,
    "start_repeat": false,
    "end_repeat": false,
    "next": [
      7
    ]
  },
  {
    "count": 7,
    "qstamp": 11.5,
    "number": 5,
    "time_signature": "6/8",
    "nominal_length": 3.0,
    "actual_length": 3.0,
    "start_repeat": false,
    "end_repeat": false,
    "next": [
      8
    ]
  },
  {
    "count": 8,
    "qstamp": 14.5,
    "number": 6,
    "time_signature": "6/8",
    "nominal_length": 3.0,
    "actual_length": 2.0,
    "start_repeat": false,
    "end_repeat": false,
    "next": [
      9
    ]
  },
  {
    "count": 9,
    "qstamp": 16.5,
    "number": 7,
    "time_signature": "6/8",
    "nominal_length": 3.0,
    "actual_length": 3.0,
    "start_repeat": false,
    "end_repeat": false,
    "next": [
      10
    ]
  },
  {
    "count": 10,
    "qstamp": 19.5,
    "number": 8,
    "time_signature": "6/8",
    "nominal_length": 3.0,
    "actual_length": 2.0,
    "start_repeat": false,
    "end_repeat": false,
    "next": []
  }
]