[
  {
    "count": 1,
    "qstamp": 0.0,
    "number": 1,
    "time_signature": "4/4",
    "nominal_length": 4.0,
    "actual_length": 4.0,
    "start_repeat": false,
    "end_repeat": false,
    "next": [
      2
    ]
  },
  {
    "count": 2,
    "qstamp": 4.0,
    "number": 2,
    "time_signature": "4/4",
    "nominal_length": 4.0,
    "actual_length": 4.0,
    "start_repeat": false,
    "end_repeat": false,
    "next": [
      3
    ]
  },
  {
    "count": 3,
    "qstamp": 8.0,
    "number": 3,
    "time_signature": "4/4",
    "nominal_length": 4.0,
    "actual_length": 4.0,
    "start_repeat": false,
    "end_repeat": false,
    "next": [
      4
    ]
  },
  {
    "count": 4,
    "qstamp": 12.0,
    "number": 4,
    "time_signature": "4/4",
    "nominal_length": 4.0,
    "actual_length": 4.0,
    "start_repeat": false,
    "end_repeat": false,
    "next": []
  }
]