{
  "version": "1.2",
  "versionCode": "12",
  "zipUrl": "https://gitlab.com/api/v4/projects/53302540/packages/generic/magiskhidedenyrestore/1.2/magiskhidedenyrestore-1.2.zip",
  "changelog": "https://gitlab.com/adrian.m.miller/magiskhidedenyrestore/-/raw/main/changelog.md"
}

