module gitlab.com/adhocguru/fcp/libs/logs

go 1.16

require (
	github.com/HdrHistogram/hdrhistogram-go v1.1.0 // indirect
	github.com/certifi/gocertifi v0.0.0-20210507211836-431795d63e8d // indirect
	github.com/davecgh/go-spew v1.1.1
	github.com/dgrijalva/jwt-go v3.2.0+incompatible // indirect
	github.com/dimiro1/health v0.0.0-20191019130555-c5cbb4d46ffc
	github.com/evalphobia/logrus_sentry v0.8.2
	github.com/getsentry/raven-go v0.2.0
	github.com/gomodule/redigo v2.0.0+incompatible
	github.com/grpc-ecosystem/go-grpc-prometheus v1.2.0
	github.com/grpc-ecosystem/grpc-opentracing v0.0.0-20180507213350-8e809c8a8645
	github.com/jinzhu/gorm v1.9.16
	github.com/labstack/echo v3.3.10+incompatible
	github.com/labstack/gommon v0.3.0 // indirect
	github.com/nbio/st v0.0.0-20140626010706-e9e8d9816f32 // indirect
	github.com/opentracing/opentracing-go v1.2.0
	github.com/pkg/errors v0.9.1
	github.com/prometheus/client_golang v1.11.0
	github.com/sirupsen/logrus v1.8.1
	github.com/stretchr/testify v1.7.0
	github.com/uber/jaeger-client-go v2.29.1+incompatible
	github.com/uber/jaeger-lib v2.4.1+incompatible // indirect
	github.com/valyala/fasttemplate v1.2.1 // indirect
	gitlab.com/adhocguru/fcp/libs/orm v0.0.0-20211007072559-aae75f0df0ff
	go.uber.org/atomic v1.9.0 // indirect
	google.golang.org/grpc v1.41.0
	gopkg.in/gemnasium/logrus-graylog-hook.v2 v2.0.7
	gopkg.in/h2non/gentleman.v2 v2.0.5
)
