<?xml version="1.0" encoding="UTF-8" standalone="no"?>
<svg
   version="1.1"
   width="21.000720cm"
   height="14.800580cm"
   viewBox="0 0 82680 58270"
   id="svg968"
   xmlns="http://www.w3.org/2000/svg"
   xmlns:svg="http://www.w3.org/2000/svg"
   xmlns:rdf="http://www.w3.org/1999/02/22-rdf-syntax-ns#"
   xmlns:cc="http://creativecommons.org/ns#"
   xmlns:dc="http://purl.org/dc/elements/1.1/">
  <defs
     id="defs972">
    <linearGradient
       id="linearGradient4103">
      <stop
         style="stop-color:#000000;stop-opacity:1;"
         offset="0"
         id="stop4099" />
      <stop
         style="stop-color:#000000;stop-opacity:0;"
         offset="1"
         id="stop4101" />
    </linearGradient>
  </defs>
  <title
     id="title2">SVG Picture created as Patch-F_Cu.svg date 2021/10/07 07:41:40 </title>
  <desc
     id="desc4">Picture generated by PCBNEW </desc>
  <g
     style="fill:#000000; fill-opacity:1;stroke:#000000; stroke-opacity:1; stroke-linecap:round; stroke-linejoin:round;"
     transform="translate(0 0) scale(1 1)"
     id="g6" />
  <g
     style="fill:#000000; fill-opacity:0.0;  stroke:#000000; stroke-width:-0.000393701; stroke-opacity:1;  stroke-linecap:round; stroke-linejoin:round;"
     id="g8" />
  <g
     style="fill:#000000; fill-opacity:0.0;  stroke:#000000; stroke-width:39.3701; stroke-opacity:1;  stroke-linecap:round; stroke-linejoin:round;"
     id="g10" />
  <g
     style="fill:#000000; fill-opacity:0.0;  stroke:#000000; stroke-width:39.3701; stroke-opacity:1;  stroke-linecap:round; stroke-linejoin:round;"
     id="g16" />
  <g
     style="fill:#000000; fill-opacity:0.0;  stroke:#000000; stroke-width:59.0551; stroke-opacity:1;  stroke-linecap:round; stroke-linejoin:round;"
     id="g20">
    <rect
       x="3937.01"
       y="3937.01"
       width="74806"
       height="50396"
       rx="0"
       id="rect18" />
  </g>
  <g
     style="fill:#000000; fill-opacity:0.0;  stroke:#000000; stroke-width:39.3701; stroke-opacity:1;  stroke-linecap:round; stroke-linejoin:round;"
     id="g22" />
  <g
     style="fill:#000000; fill-opacity:0.0;  stroke:#000000; stroke-width:59.0551; stroke-opacity:1;  stroke-linecap:round; stroke-linejoin:round;"
     id="g26">
    <rect
       x="4724.41"
       y="4724.41"
       width="73231.2"
       height="48821.2"
       rx="0"
       id="rect24" />
  </g>
  <g
     style="fill:#000000; fill-opacity:0.0;  stroke:#000000; stroke-width:39.3701; stroke-opacity:1;  stroke-linecap:round; stroke-linejoin:round;"
     id="g28" />
  <g
     style="fill:#000000; fill-opacity:0.0;  stroke:#000000; stroke-width:59.0551; stroke-opacity:1;  stroke-linecap:round; stroke-linejoin:round;"
     id="g32">
    <path
       d="M23622 4724 L23622 3937 "
       id="path30" />
  </g>
  <g
     style="fill:#000000; fill-opacity:0.0;  stroke:#000000; stroke-width:39.3701; stroke-opacity:1;  stroke-linecap:round; stroke-linejoin:round;"
     id="g34" />
  <g
     style="fill:#000000; fill-opacity:0.0;  stroke:#000000; stroke-width:59.0551; stroke-opacity:1;  stroke-linecap:round; stroke-linejoin:round;"
     id="g38">
    <path
       d="M43307 4724 L43307 3937 "
       id="path36" />
  </g>
  <g
     style="fill:#000000; fill-opacity:0.0;  stroke:#000000; stroke-width:39.3701; stroke-opacity:1;  stroke-linecap:round; stroke-linejoin:round;"
     id="g40" />
  <g
     style="fill:#000000; fill-opacity:0.0;  stroke:#000000; stroke-width:59.0551; stroke-opacity:1;  stroke-linecap:round; stroke-linejoin:round;"
     id="g44">
    <path
       d="M62992 4724 L62992 3937 "
       id="path42" />
  </g>
  <g
     style="fill:#000000; fill-opacity:0.0;  stroke:#000000; stroke-width:39.3701; stroke-opacity:1;  stroke-linecap:round; stroke-linejoin:round;"
     id="g46" />
  <g
     style="fill:#000000; fill-opacity:0.0;  stroke:#000000; stroke-width:59.0551; stroke-opacity:1;  stroke-linecap:round; stroke-linejoin:round;"
     id="g54">
    <text
       x="13779.5"
       y="4586.61"
       textLength="487.439"
       font-size="682.415"
       lengthAdjust="spacingAndGlyphs"
       text-anchor="start"
       opacity="0"
       id="text48">1</text>
    <path
       d="M14199 4562 L13906 4562 "
       id="path50" />
    <path
       d="M14052 4562 L14052 4050 L14004 4123 L13955 4172 L13906 4196 "
       id="path52" />
  </g>
  <g
     style="fill:#000000; fill-opacity:0.0;  stroke:#000000; stroke-width:39.3701; stroke-opacity:1;  stroke-linecap:round; stroke-linejoin:round;"
     id="g56" />
  <g
     style="fill:#000000; fill-opacity:0.0;  stroke:#000000; stroke-width:59.0551; stroke-opacity:1;  stroke-linecap:round; stroke-linejoin:round;"
     id="g62">
    <text
       x="33464.6"
       y="4586.61"
       textLength="546.494"
       font-size="682.415"
       lengthAdjust="spacingAndGlyphs"
       text-anchor="start"
       opacity="0"
       id="text58">2</text>
    <path
       d="M33591 4099 L33615 4074 L33664 4050 L33786 4050 L33835 4074 L33859 4099 L33884 4147 L33884 4196 L33859 4269 L33567 4562 L33884 4562 "
       id="path60" />
  </g>
  <g
     style="fill:#000000; fill-opacity:0.0;  stroke:#000000; stroke-width:39.3701; stroke-opacity:1;  stroke-linecap:round; stroke-linejoin:round;"
     id="g64" />
  <g
     style="fill:#000000; fill-opacity:0.0;  stroke:#000000; stroke-width:59.0551; stroke-opacity:1;  stroke-linecap:round; stroke-linejoin:round;"
     id="g70">
    <text
       x="53149.6"
       y="4586.61"
       textLength="546.494"
       font-size="682.415"
       lengthAdjust="spacingAndGlyphs"
       text-anchor="start"
       opacity="0"
       id="text66">3</text>
    <path
       d="M53252 4050 L53569 4050 L53398 4245 L53471 4245 L53520 4269 L53544 4294 L53569 4342 L53569 4464 L53544 4513 L53520 4537 L53471 4562 L53325 4562 L53276 4537 L53252 4513 "
       id="path68" />
  </g>
  <g
     style="fill:#000000; fill-opacity:0.0;  stroke:#000000; stroke-width:39.3701; stroke-opacity:1;  stroke-linecap:round; stroke-linejoin:round;"
     id="g72" />
  <g
     style="fill:#000000; fill-opacity:0.0;  stroke:#000000; stroke-width:59.0551; stroke-opacity:1;  stroke-linecap:round; stroke-linejoin:round;"
     id="g80">
    <text
       x="72834.6"
       y="4586.61"
       textLength="546.494"
       font-size="682.415"
       lengthAdjust="spacingAndGlyphs"
       text-anchor="start"
       opacity="0"
       id="text74">4</text>
    <path
       d="M73205 4221 L73205 4562 "
       id="path76" />
    <path
       d="M73083 4026 L72961 4391 L73278 4391 "
       id="path78" />
  </g>
  <g
     style="fill:#000000; fill-opacity:0.0;  stroke:#000000; stroke-width:39.3701; stroke-opacity:1;  stroke-linecap:round; stroke-linejoin:round;"
     id="g82" />
  <g
     style="fill:#000000; fill-opacity:0.0;  stroke:#000000; stroke-width:59.0551; stroke-opacity:1;  stroke-linecap:round; stroke-linejoin:round;"
     id="g86">
    <path
       d="M23622 53545 L23622 54332 "
       id="path84" />
  </g>
  <g
     style="fill:#000000; fill-opacity:0.0;  stroke:#000000; stroke-width:39.3701; stroke-opacity:1;  stroke-linecap:round; stroke-linejoin:round;"
     id="g88" />
  <g
     style="fill:#000000; fill-opacity:0.0;  stroke:#000000; stroke-width:59.0551; stroke-opacity:1;  stroke-linecap:round; stroke-linejoin:round;"
     id="g92">
    <path
       d="M43307 53545 L43307 54332 "
       id="path90" />
  </g>
  <g
     style="fill:#000000; fill-opacity:0.0;  stroke:#000000; stroke-width:39.3701; stroke-opacity:1;  stroke-linecap:round; stroke-linejoin:round;"
     id="g94" />
  <g
     style="fill:#000000; fill-opacity:0.0;  stroke:#000000; stroke-width:59.0551; stroke-opacity:1;  stroke-linecap:round; stroke-linejoin:round;"
     id="g98">
    <path
       d="M62992 53545 L62992 54332 "
       id="path96" />
  </g>
  <g
     style="fill:#000000; fill-opacity:0.0;  stroke:#000000; stroke-width:39.3701; stroke-opacity:1;  stroke-linecap:round; stroke-linejoin:round;"
     id="g100" />
  <g
     style="fill:#000000; fill-opacity:0.0;  stroke:#000000; stroke-width:59.0551; stroke-opacity:1;  stroke-linecap:round; stroke-linejoin:round;"
     id="g108">
    <text
       x="13779.5"
       y="54195.2"
       textLength="546.494"
       font-size="682.415"
       lengthAdjust="spacingAndGlyphs"
       text-anchor="start"
       opacity="0"
       id="text102">1</text>
    <path
       d="M14199 54170 L13906 54170 "
       id="path104" />
    <path
       d="M14052 54170 L14052 53659 L14004 53732 L13955 53780 L13906 53805 "
       id="path106" />
  </g>
  <g
     style="fill:#000000; fill-opacity:0.0;  stroke:#000000; stroke-width:39.3701; stroke-opacity:1;  stroke-linecap:round; stroke-linejoin:round;"
     id="g110" />
  <g
     style="fill:#000000; fill-opacity:0.0;  stroke:#000000; stroke-width:59.0551; stroke-opacity:1;  stroke-linecap:round; stroke-linejoin:round;"
     id="g116">
    <text
       x="33464.6"
       y="54195.2"
       textLength="546.494"
       font-size="682.415"
       lengthAdjust="spacingAndGlyphs"
       text-anchor="start"
       opacity="0"
       id="text112">2</text>
    <path
       d="M33591 53707 L33615 53683 L33664 53659 L33786 53659 L33835 53683 L33859 53707 L33884 53756 L33884 53805 L33859 53878 L33567 54170 L33884 54170 "
       id="path114" />
  </g>
  <g
     style="fill:#000000; fill-opacity:0.0;  stroke:#000000; stroke-width:39.3701; stroke-opacity:1;  stroke-linecap:round; stroke-linejoin:round;"
     id="g118" />
  <g
     style="fill:#000000; fill-opacity:0.0;  stroke:#000000; stroke-width:59.0551; stroke-opacity:1;  stroke-linecap:round; stroke-linejoin:round;"
     id="g124">
    <text
       x="53149.6"
       y="54195.2"
       textLength="546.494"
       font-size="682.415"
       lengthAdjust="spacingAndGlyphs"
       text-anchor="start"
       opacity="0"
       id="text120">3</text>
    <path
       d="M53252 53659 L53569 53659 L53398 53853 L53471 53853 L53520 53878 L53544 53902 L53569 53951 L53569 54073 L53544 54122 L53520 54146 L53471 54170 L53325 54170 L53276 54146 L53252 54122 "
       id="path122" />
  </g>
  <g
     style="fill:#000000; fill-opacity:0.0;  stroke:#000000; stroke-width:39.3701; stroke-opacity:1;  stroke-linecap:round; stroke-linejoin:round;"
     id="g126" />
  <g
     style="fill:#000000; fill-opacity:0.0;  stroke:#000000; stroke-width:59.0551; stroke-opacity:1;  stroke-linecap:round; stroke-linejoin:round;"
     id="g134">
    <text
       x="72834.6"
       y="54195.2"
       textLength="546.494"
       font-size="682.415"
       lengthAdjust="spacingAndGlyphs"
       text-anchor="start"
       opacity="0"
       id="text128">4</text>
    <path
       d="M73205 53829 L73205 54170 "
       id="path130" />
    <path
       d="M73083 53634 L72961 54000 L73278 54000 "
       id="path132" />
  </g>
  <g
     style="fill:#000000; fill-opacity:0.0;  stroke:#000000; stroke-width:39.3701; stroke-opacity:1;  stroke-linecap:round; stroke-linejoin:round;"
     id="g136" />
  <g
     style="fill:#000000; fill-opacity:0.0;  stroke:#000000; stroke-width:59.0551; stroke-opacity:1;  stroke-linecap:round; stroke-linejoin:round;"
     id="g140">
    <path
       d="M3937 23622 L4724 23622 "
       id="path138" />
  </g>
  <g
     style="fill:#000000; fill-opacity:0.0;  stroke:#000000; stroke-width:39.3701; stroke-opacity:1;  stroke-linecap:round; stroke-linejoin:round;"
     id="g142" />
  <g
     style="fill:#000000; fill-opacity:0.0;  stroke:#000000; stroke-width:59.0551; stroke-opacity:1;  stroke-linecap:round; stroke-linejoin:round;"
     id="g146">
    <path
       d="M3937 43307 L4724 43307 "
       id="path144" />
  </g>
  <g
     style="fill:#000000; fill-opacity:0.0;  stroke:#000000; stroke-width:39.3701; stroke-opacity:1;  stroke-linecap:round; stroke-linejoin:round;"
     id="g148" />
  <g
     style="fill:#000000; fill-opacity:0.0;  stroke:#000000; stroke-width:59.0551; stroke-opacity:1;  stroke-linecap:round; stroke-linejoin:round;"
     id="g156">
    <text
       x="4330.71"
       y="14035.4"
       textLength="497.75"
       font-size="682.415"
       lengthAdjust="spacingAndGlyphs"
       text-anchor="middle"
       opacity="0"
       id="text150">A</text>
    <path
       d="M4208 13864 L4452 13864 "
       id="path152" />
    <path
       d="M4160 14011 L4330 13499 L4501 14011 "
       id="path154" />
  </g>
  <g
     style="fill:#000000; fill-opacity:0.0;  stroke:#000000; stroke-width:39.3701; stroke-opacity:1;  stroke-linecap:round; stroke-linejoin:round;"
     id="g158" />
  <g
     style="fill:#000000; fill-opacity:0.0;  stroke:#000000; stroke-width:59.0551; stroke-opacity:1;  stroke-linecap:round; stroke-linejoin:round;"
     id="g164">
    <text
       x="4330.71"
       y="33720.5"
       textLength="570.866"
       font-size="682.415"
       lengthAdjust="spacingAndGlyphs"
       text-anchor="middle"
       opacity="0"
       id="text160">B</text>
    <path
       d="M4367 33428 L4440 33452 L4464 33476 L4489 33525 L4489 33598 L4464 33647 L4440 33671 L4391 33696 L4196 33696 L4196 33184 L4367 33184 L4416 33208 L4440 33233 L4464 33281 L4464 33330 L4440 33379 L4416 33403 L4367 33428 L4196 33428 "
       id="path162" />
  </g>
  <g
     style="fill:#000000; fill-opacity:0.0;  stroke:#000000; stroke-width:39.3701; stroke-opacity:1;  stroke-linecap:round; stroke-linejoin:round;"
     id="g166" />
  <g
     style="fill:#000000; fill-opacity:0.0;  stroke:#000000; stroke-width:59.0551; stroke-opacity:1;  stroke-linecap:round; stroke-linejoin:round;"
     id="g172">
    <text
       x="4330.71"
       y="53405.5"
       textLength="570.866"
       font-size="682.415"
       lengthAdjust="spacingAndGlyphs"
       text-anchor="middle"
       opacity="0"
       id="text168">C</text>
    <path
       d="M4489 53332 L4464 53356 L4391 53381 L4342 53381 L4269 53356 L4221 53308 L4196 53259 L4172 53161 L4172 53088 L4196 52991 L4221 52942 L4269 52893 L4342 52869 L4391 52869 L4464 52893 L4489 52918 "
       id="path170" />
  </g>
  <g
     style="fill:#000000; fill-opacity:0.0;  stroke:#000000; stroke-width:39.3701; stroke-opacity:1;  stroke-linecap:round; stroke-linejoin:round;"
     id="g174" />
  <g
     style="fill:#000000; fill-opacity:0.0;  stroke:#000000; stroke-width:59.0551; stroke-opacity:1;  stroke-linecap:round; stroke-linejoin:round;"
     id="g178">
    <path
       d="M78742 23622 L77955 23622 "
       id="path176" />
  </g>
  <g
     style="fill:#000000; fill-opacity:0.0;  stroke:#000000; stroke-width:39.3701; stroke-opacity:1;  stroke-linecap:round; stroke-linejoin:round;"
     id="g180" />
  <g
     style="fill:#000000; fill-opacity:0.0;  stroke:#000000; stroke-width:59.0551; stroke-opacity:1;  stroke-linecap:round; stroke-linejoin:round;"
     id="g184">
    <path
       d="M78742 43307 L77955 43307 "
       id="path182" />
  </g>
  <g
     style="fill:#000000; fill-opacity:0.0;  stroke:#000000; stroke-width:39.3701; stroke-opacity:1;  stroke-linecap:round; stroke-linejoin:round;"
     id="g186" />
  <g
     style="fill:#000000; fill-opacity:0.0;  stroke:#000000; stroke-width:59.0551; stroke-opacity:1;  stroke-linecap:round; stroke-linejoin:round;"
     id="g194">
    <text
       x="78349.3"
       y="14035.4"
       textLength="497.75"
       font-size="682.415"
       lengthAdjust="spacingAndGlyphs"
       text-anchor="middle"
       opacity="0"
       id="text188">A</text>
    <path
       d="M78227 13864 L78471 13864 "
       id="path190" />
    <path
       d="M78178 14011 L78349 13499 L78519 14011 "
       id="path192" />
  </g>
  <g
     style="fill:#000000; fill-opacity:0.0;  stroke:#000000; stroke-width:39.3701; stroke-opacity:1;  stroke-linecap:round; stroke-linejoin:round;"
     id="g196" />
  <g
     style="fill:#000000; fill-opacity:0.0;  stroke:#000000; stroke-width:59.0551; stroke-opacity:1;  stroke-linecap:round; stroke-linejoin:round;"
     id="g202">
    <text
       x="78349.3"
       y="33720.5"
       textLength="570.866"
       font-size="682.415"
       lengthAdjust="spacingAndGlyphs"
       text-anchor="middle"
       opacity="0"
       id="text198">B</text>
    <path
       d="M78385 33428 L78458 33452 L78483 33476 L78507 33525 L78507 33598 L78483 33647 L78458 33671 L78410 33696 L78215 33696 L78215 33184 L78385 33184 L78434 33208 L78458 33233 L78483 33281 L78483 33330 L78458 33379 L78434 33403 L78385 33428 L78215 33428 "
       id="path200" />
  </g>
  <g
     style="fill:#000000; fill-opacity:0.0;  stroke:#000000; stroke-width:39.3701; stroke-opacity:1;  stroke-linecap:round; stroke-linejoin:round;"
     id="g204" />
  <g
     style="fill:#000000; fill-opacity:0.0;  stroke:#000000; stroke-width:59.0551; stroke-opacity:1;  stroke-linecap:round; stroke-linejoin:round;"
     id="g210">
    <text
       x="78349.3"
       y="53405.5"
       textLength="570.866"
       font-size="682.415"
       lengthAdjust="spacingAndGlyphs"
       text-anchor="middle"
       opacity="0"
       id="text206">C</text>
    <path
       d="M78507 53332 L78483 53356 L78410 53381 L78361 53381 L78288 53356 L78239 53308 L78215 53259 L78190 53161 L78190 53088 L78215 52991 L78239 52942 L78288 52893 L78361 52869 L78410 52869 L78483 52893 L78507 52918 "
       id="path208" />
  </g>
  <g
     style="fill:#000000; fill-opacity:0.0;  stroke:#000000; stroke-width:39.3701; stroke-opacity:1;  stroke-linecap:round; stroke-linejoin:round;"
     id="g212" />
  <g
     style="fill:#000000; fill-opacity:0.0;  stroke:#000000; stroke-width:39.3701; stroke-opacity:1;  stroke-linecap:round; stroke-linejoin:round;"
     id="g258" />
  <g
     style="fill:#000000; fill-opacity:0.0;  stroke:#000000; stroke-width:39.3701; stroke-opacity:1;  stroke-linecap:round; stroke-linejoin:round;"
     id="g264" />
  <g
     style="fill:#000000; fill-opacity:0.0;  stroke:#000000; stroke-width:39.3701; stroke-opacity:1;  stroke-linecap:round; stroke-linejoin:round;"
     id="g426" />
  <g
     style="fill:#000000; fill-opacity:0.0;  stroke:#000000; stroke-width:39.3701; stroke-opacity:1;  stroke-linecap:round; stroke-linejoin:round;"
     id="g432" />
  <g
     style="fill:#000000; fill-opacity:0.0;  stroke:#000000; stroke-width:39.3701; stroke-opacity:1;  stroke-linecap:round; stroke-linejoin:round;"
     id="g460" />
  <g
     style="fill:#000000; fill-opacity:0.0;  stroke:#000000; stroke-width:39.3701; stroke-opacity:1;  stroke-linecap:round; stroke-linejoin:round;"
     id="g490" />
  <g
     style="fill:#000000; fill-opacity:0.0;  stroke:#000000; stroke-width:39.3701; stroke-opacity:1;  stroke-linecap:round; stroke-linejoin:round;"
     id="g516" />
  <g
     style="fill:#000000; fill-opacity:0.0;  stroke:#000000; stroke-width:39.3701; stroke-opacity:1;  stroke-linecap:round; stroke-linejoin:round;"
     id="g522" />
  <g
     style="fill:#000000; fill-opacity:0.0;  stroke:#000000; stroke-width:39.3701; stroke-opacity:1;  stroke-linecap:round; stroke-linejoin:round;"
     id="g608" />
  <g
     style="fill:#000000; fill-opacity:0.0;  stroke:#000000; stroke-width:39.3701; stroke-opacity:1;  stroke-linecap:round; stroke-linejoin:round;"
     id="g680" />
  <g
     style="fill:#000000; fill-opacity:0.0;  stroke:#000000; stroke-width:39.3701; stroke-opacity:1;  stroke-linecap:round; stroke-linejoin:round;"
     id="g686" />
  <g
     style="fill:#000000; fill-opacity:0.0;  stroke:#000000; stroke-width:39.3701; stroke-opacity:1;  stroke-linecap:round; stroke-linejoin:round;"
     id="g710" />
  <g
     style="fill:#000000; fill-opacity:0.0;  stroke:#000000; stroke-width:39.3701; stroke-opacity:1;  stroke-linecap:round; stroke-linejoin:round;"
     id="g832" />
  <g
     style="fill:#000000; fill-opacity:0.0;  stroke:#000000; stroke-width:39.3701; stroke-opacity:1;  stroke-linecap:round; stroke-linejoin:round;"
     id="g864" />
  <g
     style="fill:#000000; fill-opacity:0.0;  stroke:#000000; stroke-width:39.3701; stroke-opacity:1;  stroke-linecap:round; stroke-linejoin:round;"
     id="g870" />
  <g
     style="fill:#000000;fill-opacity:1;stroke:#000000;stroke-width:59.0551;stroke-opacity:1;stroke-linecap:round;stroke-linejoin:round"
     id="g906">
    <g
       id="g874"
       style="stroke:#000000;stroke-opacity:1;fill:#000000;fill-opacity:1" />
    <g
       id="g876"
       style="stroke:#000000;stroke-opacity:1;fill:#000000;fill-opacity:1" />
    <g
       id="g878"
       style="stroke:#000000;stroke-opacity:1;fill:#000000;fill-opacity:1" />
    <g
       id="g880"
       style="stroke:#000000;stroke-opacity:1;fill:#000000;fill-opacity:1" />
    <g
       id="g882"
       style="stroke:#000000;stroke-opacity:1;fill:#000000;fill-opacity:1" />
    <g
       style="fill:#000000;fill-opacity:1;stroke:#000000;stroke-width:59.0551;stroke-opacity:1;stroke-linecap:round;stroke-linejoin:round"
       id="g884" />
    <g
       style="fill:#000000;fill-opacity:1;stroke:#000000;stroke-width:39.3701;stroke-opacity:1;stroke-linecap:round;stroke-linejoin:round"
       id="g890" />
    <g
       id="g892"
       style="stroke:#000000;stroke-opacity:1;fill:#000000;fill-opacity:1" />
    <g
       id="g894"
       style="stroke:#000000;stroke-opacity:1;fill:#000000;fill-opacity:1" />
    <g
       id="g896"
       style="stroke:#000000;stroke-opacity:1;fill:#000000;fill-opacity:1" />
    <g
       style="fill:#000000;fill-opacity:1;stroke:#000000;stroke-width:39.3701;stroke-opacity:1;stroke-linecap:round;stroke-linejoin:round"
       id="g904">
      <g
         id="g898"
         style="stroke:#000000;stroke-opacity:1;fill:#000000;fill-opacity:1" />
      <g
         style="fill:#000000;fill-opacity:1;stroke:#000000;stroke-width:10;stroke-opacity:1;stroke-linecap:round;stroke-linejoin:round"
         id="g902">
        <path
           style="fill:#000000;fill-opacity:1;stroke:#000000;stroke-width:10;stroke-opacity:1;stroke-linecap:round;stroke-linejoin:round;fill-rule:evenodd"
           d="M 44069.9,25551.2 41828.6,27792.5 33744.8,27792.5 33744.8,23690.8 36343.1,23690.8 36343.1,26053.4 36343.2,26054.4 36343.5,26055.3 36344,26056.2 36344.6,26057 36345.3,26057.6 36346.2,26058 36347.1,26058.3 36348.1,26058.4 41466.6,26058.4 41467.6,26058.3 41468.5,26058 41469.4,26057.6 41470.1,26057 41470.8,26056.2 41471.2,26055.3 41471.5,26054.4 41471.6,26053.4 41471.6,23690.8 41471.5,23689.9 41471.2,23688.9 41470.8,23688 41470.1,23687.3 41469.4,23686.7 41468.5,23686.2 41467.6,23685.9 41466.6,23685.8 40875.7,23685.8 40874.7,23685.9 40873.8,23686.2 40872.9,23686.7 40872.1,23687.3 40871.5,23688 40871.1,23688.9 40870.8,23689.9 40870.7,23690.8 40870.7,25457.5 36944.1,25457.5 36944.1,23690.8 36944,23689.9 36943.7,23688.9 36943.2,23688 36942.6,23687.3 36941.8,23686.7 36941,23686.2 36940,23685.9 36939.1,23685.8 36348.1,23685.8 36347.1,23685.9 36346.2,23686.2 36345.3,23686.7 36344.6,23687.3 36344,23688 36343.5,23688.9 36343.2,23689.9 36343.1,23690.8 33744.8,23690.8 33744.8,20066.5 38475.6,20066.5 38545.5,20133.4 38650.6,20193.9 38765.5,20232.7 38885.7,20248.3 39006.7,20240.2 39123.8,20208.6 39232.5,20154.8 39264.5,20133.4 39334.4,20066.5 38905,19637.1 38475.6,20066.5 33744.8,20066.5 33744.8,19708.8 33842.9,19610.7 38286.7,19610.7 38294.8,19731.7 38326.4,19848.8 38380.2,19957.5 38401.6,19989.5 38468.5,20059.4 38897.9,19630 38912.1,19630 39341.5,20059.4 39408.4,19989.5 39468.9,19884.4 39507.7,19769.5 39523.3,19649.3 39515.2,19528.3 39483.6,19411.2 39429.8,19302.5 39408.4,19270.5 39341.5,19200.6 38912.1,19630 38897.9,19630 38468.5,19200.6 38401.6,19270.5 38341.1,19375.6 38302.3,19490.5 38286.7,19610.7 33842.9,19610.7 34260.1,19193.5 38475.6,19193.5 38905,19622.9 39334.4,19193.5 39264.5,19126.6 39159.4,19066.1 39044.5,19027.3 38924.3,19011.7 38803.3,19019.8 38686.2,19051.4 38577.5,19105.2 38545.5,19126.6 38475.6,19193.5 34260.1,19193.5 35986.1,17467.5 44069.9,17467.5 Z"
           id="path900" />
      </g>
    </g>
  </g>
  <g
     style="fill:#FFFFFF; fill-opacity:1.0;  stroke:#FFFFFF; stroke-width:10; stroke-opacity:1;  stroke-linecap:round; stroke-linejoin:round;"
     id="g908" />
  <g
     style="fill:#000000;fill-opacity:1;stroke:#FFFFFF;stroke-width:0;stroke-opacity:1;stroke-linecap:round;stroke-linejoin:round"
     id="g912">
    <circle
       cx="46542.8"
       cy="30267.8"
       r="433.071"
       id="circle910"
       style="fill:#000000" />
  </g>
  <g
     style="fill:#FFFFFF; fill-opacity:1.0;  stroke:#FFFFFF; stroke-width:39.3701; stroke-opacity:1;  stroke-linecap:round; stroke-linejoin:round;"
     id="g914" />
  <g
     style="fill:#000000;fill-opacity:1;stroke:#FFFFFF;stroke-width:0;stroke-opacity:1;stroke-linecap:round;stroke-linejoin:round"
     id="g918">
    <circle
       cx="46542.8"
       cy="14992.2"
       r="433.071"
       id="circle916"
       style="fill:#000000" />
  </g>
  <g
     style="fill:#FFFFFF; fill-opacity:1.0;  stroke:#FFFFFF; stroke-width:39.3701; stroke-opacity:1;  stroke-linecap:round; stroke-linejoin:round;"
     id="g920" />
  <g
     style="fill:#000000;fill-opacity:1;stroke:#FFFFFF;stroke-width:0;stroke-opacity:1;stroke-linecap:round;stroke-linejoin:round"
     id="g924">
    <circle
       cx="31267.2"
       cy="30267.8"
       r="433.071"
       id="circle922"
       style="fill:#000000" />
  </g>
  <g
     style="fill:#FFFFFF; fill-opacity:1.0;  stroke:#FFFFFF; stroke-width:39.3701; stroke-opacity:1;  stroke-linecap:round; stroke-linejoin:round;"
     id="g926" />
  <g
     style="fill:#000000;fill-opacity:1;stroke:#FFFFFF;stroke-width:0;stroke-opacity:1;stroke-linecap:round;stroke-linejoin:round"
     id="g930">
    <circle
       cx="31267.2"
       cy="14992.2"
       r="433.071"
       id="circle928"
       style="fill:#000000" />
  </g>
  <g
     style="fill:#FFFFFF; fill-opacity:1.0;  stroke:#FFFFFF; stroke-width:39.3701; stroke-opacity:1;  stroke-linecap:round; stroke-linejoin:round;"
     id="g932" />
  <g
     style="fill:#FFFFFF; fill-opacity:1.0;  stroke:#FFFFFF; stroke-width:39.3701; stroke-opacity:1;  stroke-linecap:round; stroke-linejoin:round;"
     id="g938" />
  <g
     style="fill:#000000; fill-opacity:1.0;  stroke:#000000; stroke-width:39.3701; stroke-opacity:1;  stroke-linecap:round; stroke-linejoin:round;"
     id="g940" />
  <g
     style="fill:#C2C200; fill-opacity:1.0;  stroke:#C2C200; stroke-width:39.3701; stroke-opacity:1;  stroke-linecap:round; stroke-linejoin:round;"
     id="g942" />
  <g
     style="fill:#C2C200; fill-opacity:1.0;  stroke:#C2C200; stroke-width:0.393701; stroke-opacity:1;  stroke-linecap:round; stroke-linejoin:round;"
     id="g944" />
  <g
     style="fill:#C2C200; fill-opacity:0.0;  stroke:#C2C200; stroke-width:0.393701; stroke-opacity:1;  stroke-linecap:round; stroke-linejoin:round;"
     id="g966">
    <path
       d="M48156 31881 L48156 13378 "
       id="path946" />
    <path
       d="M48156 13378 L29653 13378 "
       id="path948" />
    <path
       d="M29653 13378 L29653 31881 "
       id="path950" />
    <path
       d="M29653 31881 L48156 31881 "
       id="path952" />
    <g
       id="g954" />
    <g
       id="g956" />
    <g
       id="g958" />
    <g
       id="g960" />
    <g
       id="g962" />
    <g
       id="g964" />
  </g>
  <rect
     style="fill:none;fill-opacity:1;stroke-width:118.11023592;stroke:#000000;stroke-opacity:1;stroke-miterlimit:4;stroke-dasharray:none"
     id="rect3879"
     width="18490.4"
     height="18490.4"
     x="29665.602"
     y="13390.601"
     ry="0" />
  <ellipse
     style="fill:#000000;fill-opacity:1;stroke:#000000;stroke-width:118.11;stroke-miterlimit:4;stroke-dasharray:none;stroke-opacity:1"
     id="path8174"
     cx="39127.105"
     cy="19773.447"
     rx="853.29565"
     ry="842.15576" />
  <metadata
     id="metadata8362">
    <rdf:RDF>
      <cc:Work
         rdf:about="">
        <dc:title>SVG Picture created as Patch-F_Cu.svg date 2021/10/07 07:41:40 </dc:title>
      </cc:Work>
    </rdf:RDF>
  </metadata>
</svg>
