//WIP Weapon Icon
Sprite "PWIPA0", 20, 20
{
	Offset 10, 35
	Patch "WPNSHEET", 0, -120
	Patch "WPPKUPL1", 18, 4
}

Sprite "PWIPB0", 20, 20
{
	Offset 10, 35
	Patch "WPNSHEET", 0, -120
	{
		Blend "#FFFFFF", 0.3
	}
	Patch "WPPKUPL1", 18, 4
	{
		Blend "#FFFFFF", 0.3
	}
}

Sprite "PWIPC0", 20, 20
{
	Offset 10, 35
	Patch "WPNSHEET", 0, -120
	Patch "WPPKUPL2", 18, 4
}

Sprite "PWIPD0", 20, 20
{
	Offset 10, 35
	Patch "WPNSHEET", 0, -120
	{
		Blend "#FFFFFF", 0.3
	}
	Patch "WPPKUPL2", 18, 4
	{
		Blend "#FFFFFF", 0.3
	}
}

Sprite "PWIPE0", 20, 20
{
	Offset 10, 35
	Patch "WPNSHEET", 0, -120
	Patch "WPPKUPL3", 18, 4
}

Sprite "PWIPF0", 20, 20
{
	Offset 10, 35
	Patch "WPNSHEET", 0, -120
	{
		Blend "#FFFFFF", 0.3
	}
	Patch "WPPKUPL3", 18, 4
	{
		Blend "#FFFFFF", 0.3
	}
}

Sprite "PWIPG0", 20, 20
{
	Offset 10, 35
	Patch "WPNSHEET", 0, -120
	Patch "WPPKUPL4", 18, 4
}

Sprite "PWIPH0", 20, 20
{
	Offset 10, 35
	Patch "WPNSHEET", 0, -120
	{
		Blend "#FFFFFF", 0.3
	}
	Patch "WPPKUPL4", 18, 4
	{
		Blend "#FFFFFF", 0.3
	}
}

//POWER
//Crush Blast
Sprite "PCBLA0", 20, 20
{
	Offset 10, 35
	Patch "WPNSHEET", 0, 0
	Patch "WPPKUPL1", 18, 4
}

Sprite "PCBLB0", 20, 20
{
	Offset 10, 35
	Patch "WPNSHEET", 0, 0
	{
		Blend "#FFFFFF", 0.3
	}
	Patch "WPPKUPL1", 18, 4
	{
		Blend "#FFFFFF", 0.3
	}
}

Sprite "PCBLC0", 20, 20
{
	Offset 10, 35
	Patch "WPNSHEET", 0, 0
	Patch "WPPKUPL2", 18, 4
}

Sprite "PCBLD0", 20, 20
{
	Offset 10, 35
	Patch "WPNSHEET", 0, 0
	{
		Blend "#FFFFFF", 0.3
	}
	Patch "WPPKUPL2", 18, 4
	{
		Blend "#FFFFFF", 0.3
	}
}

Sprite "PCBLE0", 20, 20
{
	Offset 10, 35
	Patch "WPNSHEET", 0, 0
	Patch "WPPKUPL3", 18, 4
}

Sprite "PCBLF0", 20, 20
{
	Offset 10, 35
	Patch "WPNSHEET", 0, 0
	{
		Blend "#FFFFFF", 0.3
	}
	Patch "WPPKUPL3", 18, 4
	{
		Blend "#FFFFFF", 0.3
	}
}

Sprite "PCBLG0", 20, 20
{
	Offset 10, 35
	Patch "WPNSHEET", 0, 0
	Patch "WPPKUPL4", 18, 4
}

Sprite "PCBLH0", 20, 20
{
	Offset 10, 35
	Patch "WPNSHEET", 0, 0
	{
		Blend "#FFFFFF", 0.3
	}
	Patch "WPPKUPL4", 18, 4
	{
		Blend "#FFFFFF", 0.3
	}
}

//Scrap Launcher
Sprite "PSLNA0", 20, 20
{
	Offset 10, 35
	Patch "WPNSHEET", -20, 0
	Patch "WPPKUPL1", 18, 4
}

Sprite "PSLNB0", 20, 20
{
	Offset 10, 35
	Patch "WPNSHEET", -20, 0
	{
		Blend "#FFFFFF", 0.3
	}
	Patch "WPPKUPL1", 18, 4
	{
		Blend "#FFFFFF", 0.3
	}
}

Sprite "PSLNC0", 20, 20
{
	Offset 10, 35
	Patch "WPNSHEET", -20, 0
	Patch "WPPKUPL2", 18, 4
}

Sprite "PSLND0", 20, 20
{
	Offset 10, 35
	Patch "WPNSHEET", -20, 0
	{
		Blend "#FFFFFF", 0.3
	}
	Patch "WPPKUPL2", 18, 4
	{
		Blend "#FFFFFF", 0.3
	}
}

Sprite "PSLNE0", 20, 20
{
	Offset 10, 35
	Patch "WPNSHEET", -20, 0
	Patch "WPPKUPL3", 18, 4
}

Sprite "PSLNF0", 20, 20
{
	Offset 10, 35
	Patch "WPNSHEET", -20, 0
	{
		Blend "#FFFFFF", 0.3
	}
	Patch "WPPKUPL3", 18, 4
	{
		Blend "#FFFFFF", 0.3
	}
}

Sprite "PSLNG0", 20, 20
{
	Offset 10, 35
	Patch "WPNSHEET", -20, 0
	Patch "WPPKUPL4", 18, 4
}

Sprite "PSLNH0", 20, 20
{
	Offset 10, 35
	Patch "WPNSHEET", -20, 0
	{
		Blend "#FFFFFF", 0.3
	}
	Patch "WPPKUPL4", 18, 4
	{
		Blend "#FFFFFF", 0.3
	}
}

//Triple Wyvern
Sprite "PTWYA0", 20, 20
{
	Offset 10, 35
	Patch "WPNSHEET", -40, 0
	Patch "WPPKUPL1", 18, 4
}

Sprite "PTWYB0", 20, 20
{
	Offset 10, 35
	Patch "WPNSHEET", -40, 0
	{
		Blend "#FFFFFF", 0.3
	}
	Patch "WPPKUPL1", 18, 4
	{
		Blend "#FFFFFF", 0.3
	}
}

Sprite "PTWYC0", 20, 20
{
	Offset 10, 35
	Patch "WPNSHEET", -40, 0
	Patch "WPPKUPL2", 18, 4
}

Sprite "PTWYD0", 20, 20
{
	Offset 10, 35
	Patch "WPNSHEET", -40, 0
	{
		Blend "#FFFFFF", 0.3
	}
	Patch "WPPKUPL2", 18, 4
	{
		Blend "#FFFFFF", 0.3
	}
}

Sprite "PTWYE0", 20, 20
{
	Offset 10, 35
	Patch "WPNSHEET", -40, 0
	Patch "WPPKUPL3", 18, 4
}

Sprite "PTWYF0", 20, 20
{
	Offset 10, 35
	Patch "WPNSHEET", -40, 0
	{
		Blend "#FFFFFF", 0.3
	}
	Patch "WPPKUPL3", 18, 4
	{
		Blend "#FFFFFF", 0.3
	}
}

Sprite "PTWYG0", 20, 20
{
	Offset 10, 35
	Patch "WPNSHEET", -40, 0
	Patch "WPPKUPL4", 18, 4
}

Sprite "PTWYH0", 20, 20
{
	Offset 10, 35
	Patch "WPNSHEET", -40, 0
	{
		Blend "#FFFFFF", 0.3
	}
	Patch "WPPKUPL4", 18, 4
	{
		Blend "#FFFFFF", 0.3
	}
}

//Shotwave
Sprite "PSTWA0", 20, 20
{
	Offset 10, 35
	Patch "WPNSHEET", -60, 0
	Patch "WPPKUPL1", 18, 4
}

Sprite "PSTWB0", 20, 20
{
	Offset 10, 35
	Patch "WPNSHEET", -60, 0
	{
		Blend "#FFFFFF", 0.3
	}
	Patch "WPPKUPL1", 18, 4
	{
		Blend "#FFFFFF", 0.3
	}
}

Sprite "PSTWC0", 20, 20
{
	Offset 10, 35
	Patch "WPNSHEET", -60, 0
	Patch "WPPKUPL2", 18, 4
}

Sprite "PSTWD0", 20, 20
{
	Offset 10, 35
	Patch "WPNSHEET", -60, 0
	{
		Blend "#FFFFFF", 0.3
	}
	Patch "WPPKUPL2", 18, 4
	{
		Blend "#FFFFFF", 0.3
	}
}

Sprite "PSTWE0", 20, 20
{
	Offset 10, 35
	Patch "WPNSHEET", -60, 0
	Patch "WPPKUPL3", 18, 4
}

Sprite "PSTWF0", 20, 20
{
	Offset 10, 35
	Patch "WPNSHEET", -60, 0
	{
		Blend "#FFFFFF", 0.3
	}
	Patch "WPPKUPL3", 18, 4
	{
		Blend "#FFFFFF", 0.3
	}
}

Sprite "PSTWG0", 20, 20
{
	Offset 10, 35
	Patch "WPNSHEET", -60, 0
	Patch "WPPKUPL4", 18, 4
}

Sprite "PSTWH0", 20, 20
{
	Offset 10, 35
	Patch "WPNSHEET", -60, 0
	{
		Blend "#FFFFFF", 0.3
	}
	Patch "WPPKUPL4", 18, 4
	{
		Blend "#FFFFFF", 0.3
	}
}

//Sniper Cannon
Sprite "PSNCA0", 20, 20
{
	Offset 10, 35
	Patch "WPNSHEET", -80, 0
	Patch "WPPKUPL1", 18, 4
}

Sprite "PSNCB0", 20, 20
{
	Offset 10, 35
	Patch "WPNSHEET", -80, 0
	{
		Blend "#FFFFFF", 0.3
	}
	Patch "WPPKUPL1", 18, 4
	{
		Blend "#FFFFFF", 0.3
	}
}

Sprite "PSNCC0", 20, 20
{
	Offset 10, 35
	Patch "WPNSHEET", -80, 0
	Patch "WPPKUPL2", 18, 4
}

Sprite "PSNCD0", 20, 20
{
	Offset 10, 35
	Patch "WPNSHEET", -80, 0
	{
		Blend "#FFFFFF", 0.3
	}
	Patch "WPPKUPL2", 18, 4
	{
		Blend "#FFFFFF", 0.3
	}
}

Sprite "PSNCE0", 20, 20
{
	Offset 10, 35
	Patch "WPNSHEET", -80, 0
	Patch "WPPKUPL3", 18, 4
}

Sprite "PSNCF0", 20, 20
{
	Offset 10, 35
	Patch "WPNSHEET", -80, 0
	{
		Blend "#FFFFFF", 0.3
	}
	Patch "WPPKUPL3", 18, 4
	{
		Blend "#FFFFFF", 0.3
	}
}

Sprite "PSNCG0", 20, 20
{
	Offset 10, 35
	Patch "WPNSHEET", -80, 0
	Patch "WPPKUPL4", 18, 4
}

Sprite "PSNCH0", 20, 20
{
	Offset 10, 35
	Patch "WPNSHEET", -80, 0
	{
		Blend "#FFFFFF", 0.3
	}
	Patch "WPPKUPL4", 18, 4
	{
		Blend "#FFFFFF", 0.3
	}
}

//Crash Comet
Sprite "PCRCA0", 20, 20
{
	Offset 10, 35
	Patch "WPNSHEET", -100, 0
	Patch "WPPKUPL1", 18, 4
}

Sprite "PCRCB0", 20, 20
{
	Offset 10, 35
	Patch "WPNSHEET", -100, 0
	{
		Blend "#FFFFFF", 0.3
	}
	Patch "WPPKUPL1", 18, 4
	{
		Blend "#FFFFFF", 0.3
	}
}

Sprite "PCRCC0", 20, 20
{
	Offset 10, 35
	Patch "WPNSHEET", -100, 0
	Patch "WPPKUPL2", 18, 4
}

Sprite "PCRCD0", 20, 20
{
	Offset 10, 35
	Patch "WPNSHEET", -100, 0
	{
		Blend "#FFFFFF", 0.3
	}
	Patch "WPPKUPL2", 18, 4
	{
		Blend "#FFFFFF", 0.3
	}
}

Sprite "PCRCE0", 20, 20
{
	Offset 10, 35
	Patch "WPNSHEET", -100, 0
	Patch "WPPKUPL3", 18, 4
}

Sprite "PCRCF0", 20, 20
{
	Offset 10, 35
	Patch "WPNSHEET", -100, 0
	{
		Blend "#FFFFFF", 0.3
	}
	Patch "WPPKUPL3", 18, 4
	{
		Blend "#FFFFFF", 0.3
	}
}

Sprite "PCRCG0", 20, 20
{
	Offset 10, 35
	Patch "WPNSHEET", -100, 0
	Patch "WPPKUPL4", 18, 4
}

Sprite "PCRCH0", 20, 20
{
	Offset 10, 35
	Patch "WPNSHEET", -100, 0
	{
		Blend "#FFFFFF", 0.3
	}
	Patch "WPPKUPL4", 18, 4
	{
		Blend "#FFFFFF", 0.3
	}
}

//Bloodletter Magnum
Sprite "PBLDA0", 20, 20
{
	Offset 10, 35
	Patch "WPNSHEET", -120, 0
	Patch "WPPKUPL1", 18, 4
}

Sprite "PBLDB0", 20, 20
{
	Offset 10, 35
	Patch "WPNSHEET", -120, 0
	{
		Blend "#FFFFFF", 0.3
	}
	Patch "WPPKUPL1", 18, 4
	{
		Blend "#FFFFFF", 0.3
	}
}

Sprite "PBLDC0", 20, 20
{
	Offset 10, 35
	Patch "WPNSHEET", -120, 0
	Patch "WPPKUPL2", 18, 4
}

Sprite "PBLDD0", 20, 20
{
	Offset 10, 35
	Patch "WPNSHEET", -120, 0
	{
		Blend "#FFFFFF", 0.3
	}
	Patch "WPPKUPL2", 18, 4
	{
		Blend "#FFFFFF", 0.3
	}
}

Sprite "PBLDE0", 20, 20
{
	Offset 10, 35
	Patch "WPNSHEET", -120, 0
	Patch "WPPKUPL3", 18, 4
}

Sprite "PBLDF0", 20, 20
{
	Offset 10, 35
	Patch "WPNSHEET", -120, 0
	{
		Blend "#FFFFFF", 0.3
	}
	Patch "WPPKUPL3", 18, 4
	{
		Blend "#FFFFFF", 0.3
	}
}

Sprite "PBLDG0", 20, 20
{
	Offset 10, 35
	Patch "WPNSHEET", -120, 0
	Patch "WPPKUPL4", 18, 4
}

Sprite "PBLDH0", 20, 20
{
	Offset 10, 35
	Patch "WPNSHEET", -120, 0
	{
		Blend "#FFFFFF", 0.3
	}
	Patch "WPPKUPL4", 18, 4
	{
		Blend "#FFFFFF", 0.3
	}
}

//Decimator
Sprite "PDECA0", 20, 20
{
	Offset 10, 35
	Patch "WPNSHEET", -140, 0
	Patch "WPPKUPL1", 18, 4
}

Sprite "PDECB0", 20, 20
{
	Offset 10, 35
	Patch "WPNSHEET", -140, 0
	{
		Blend "#FFFFFF", 0.3
	}
	Patch "WPPKUPL1", 18, 4
	{
		Blend "#FFFFFF", 0.3
	}
}

Sprite "PDECC0", 20, 20
{
	Offset 10, 35
	Patch "WPNSHEET", -140, 0
	Patch "WPPKUPL2", 18, 4
}

Sprite "PDECD0", 20, 20
{
	Offset 10, 35
	Patch "WPNSHEET", -140, 0
	{
		Blend "#FFFFFF", 0.3
	}
	Patch "WPPKUPL2", 18, 4
	{
		Blend "#FFFFFF", 0.3
	}
}

Sprite "PDECE0", 20, 20
{
	Offset 10, 35
	Patch "WPNSHEET", -140, 0
	Patch "WPPKUPL3", 18, 4
}

Sprite "PDECF0", 20, 20
{
	Offset 10, 35
	Patch "WPNSHEET", -140, 0
	{
		Blend "#FFFFFF", 0.3
	}
	Patch "WPPKUPL3", 18, 4
	{
		Blend "#FFFFFF", 0.3
	}
}

Sprite "PDECG0", 20, 20
{
	Offset 10, 35
	Patch "WPNSHEET", -140, 0
	Patch "WPPKUPL4", 18, 4
}

Sprite "PDECH0", 20, 20
{
	Offset 10, 35
	Patch "WPNSHEET", -140, 0
	{
		Blend "#FFFFFF", 0.3
	}
	Patch "WPPKUPL4", 18, 4
	{
		Blend "#FFFFFF", 0.3
	}
}

//AREA
//Spread Shot
Sprite "PSPRA0", 20, 20
{
	Offset 10, 35
	Patch "WPNSHEET", 0, -20
	Patch "WPPKUPL1", 18, 4
}

Sprite "PSPRB0", 20, 20
{
	Offset 10, 35
	Patch "WPNSHEET", 0, -20
	{
		Blend "#FFFFFF", 0.3
	}
	Patch "WPPKUPL1", 18, 4
	{
		Blend "#FFFFFF", 0.3
	}
}

Sprite "PSPRC0", 20, 20
{
	Offset 10, 35
	Patch "WPNSHEET", 0, -20
	Patch "WPPKUPL2", 18, 4
}

Sprite "PSPRD0", 20, 20
{
	Offset 10, 35
	Patch "WPNSHEET", 0, -20
	{
		Blend "#FFFFFF", 0.3
	}
	Patch "WPPKUPL2", 18, 4
	{
		Blend "#FFFFFF", 0.3
	}
}

Sprite "PSPRE0", 20, 20
{
	Offset 10, 35
	Patch "WPNSHEET", 0, -20
	Patch "WPPKUPL3", 18, 4
}

Sprite "PSPRF0", 20, 20
{
	Offset 10, 35
	Patch "WPNSHEET", 0, -20
	{
		Blend "#FFFFFF", 0.3
	}
	Patch "WPPKUPL3", 18, 4
	{
		Blend "#FFFFFF", 0.3
	}
}

Sprite "PSPRG0", 20, 20
{
	Offset 10, 35
	Patch "WPNSHEET", 0, -20
	Patch "WPPKUPL4", 18, 4
}

Sprite "PSPRH0", 20, 20
{
	Offset 10, 35
	Patch "WPNSHEET", 0, -20
	{
		Blend "#FFFFFF", 0.3
	}
	Patch "WPPKUPL4", 18, 4
	{
		Blend "#FFFFFF", 0.3
	}
}

//Buster
Sprite "PBUSA0", 20, 20
{
	Offset 10, 35
	Patch "WPNSHEET", -20, -20
	Patch "WPPKUPL1", 18, 4
}

Sprite "PBUSB0", 20, 20
{
	Offset 10, 35
	Patch "WPNSHEET", -20, -20
	{
		Blend "#FFFFFF", 0.3
	}
	Patch "WPPKUPL1", 18, 4
	{
		Blend "#FFFFFF", 0.3
	}
}

Sprite "PBUSC0", 20, 20
{
	Offset 10, 35
	Patch "WPNSHEET", -20, -20
	Patch "WPPKUPL2", 18, 4
}

Sprite "PBUSD0", 20, 20
{
	Offset 10, 35
	Patch "WPNSHEET", -20, -20
	{
		Blend "#FFFFFF", 0.3
	}
	Patch "WPPKUPL2", 18, 4
	{
		Blend "#FFFFFF", 0.3
	}
}

Sprite "PBUSE0", 20, 20
{
	Offset 10, 35
	Patch "WPNSHEET", -20, -20
	Patch "WPPKUPL3", 18, 4
}

Sprite "PBUSF0", 20, 20
{
	Offset 10, 35
	Patch "WPNSHEET", -20, -20
	{
		Blend "#FFFFFF", 0.3
	}
	Patch "WPPKUPL3", 18, 4
	{
		Blend "#FFFFFF", 0.3
	}
}

Sprite "PBUSG0", 20, 20
{
	Offset 10, 35
	Patch "WPNSHEET", -20, -20
	Patch "WPPKUPL4", 18, 4
}

Sprite "PBUSH0", 20, 20
{
	Offset 10, 35
	Patch "WPNSHEET", -20, -20
	{
		Blend "#FFFFFF", 0.3
	}
	Patch "WPPKUPL4", 18, 4
	{
		Blend "#FFFFFF", 0.3
	}
}

//Blaze Stream
Sprite "PBSTA0", 20, 20
{
	Offset 10, 35
	Patch "WPNSHEET", -40, -20
	Patch "WPPKUPL1", 18, 4
}

Sprite "PBSTB0", 20, 20
{
	Offset 10, 35
	Patch "WPNSHEET", -40, -20
	{
		Blend "#FFFFFF", 0.3
	}
	Patch "WPPKUPL1", 18, 4
	{
		Blend "#FFFFFF", 0.3
	}
}

Sprite "PBSTC0", 20, 20
{
	Offset 10, 35
	Patch "WPNSHEET", -40, -20
	Patch "WPPKUPL2", 18, 4
}

Sprite "PBSTD0", 20, 20
{
	Offset 10, 35
	Patch "WPNSHEET", -40, -20
	{
		Blend "#FFFFFF", 0.3
	}
	Patch "WPPKUPL2", 18, 4
	{
		Blend "#FFFFFF", 0.3
	}
}

Sprite "PBSTE0", 20, 20
{
	Offset 10, 35
	Patch "WPNSHEET", -40, -20
	Patch "WPPKUPL3", 18, 4
}

Sprite "PBSTF0", 20, 20
{
	Offset 10, 35
	Patch "WPNSHEET", -40, -20
	{
		Blend "#FFFFFF", 0.3
	}
	Patch "WPPKUPL3", 18, 4
	{
		Blend "#FFFFFF", 0.3
	}
}

Sprite "PBSTG0", 20, 20
{
	Offset 10, 35
	Patch "WPNSHEET", -40, -20
	Patch "WPPKUPL4", 18, 4
}

Sprite "PBSTH0", 20, 20
{
	Offset 10, 35
	Patch "WPNSHEET", -40, -20
	{
		Blend "#FFFFFF", 0.3
	}
	Patch "WPPKUPL4", 18, 4
	{
		Blend "#FFFFFF", 0.3
	}
}

//Storm Mine
Sprite "PSGRA0", 20, 20
{
	Offset 10, 35
	Patch "WPNSHEET", -60, -20
	Patch "WPPKUPL1", 18, 4
}

Sprite "PSGRB0", 20, 20
{
	Offset 10, 35
	Patch "WPNSHEET", -60, -20
	{
		Blend "#FFFFFF", 0.3
	}
	Patch "WPPKUPL1", 18, 4
	{
		Blend "#FFFFFF", 0.3
	}
}

Sprite "PSGRC0", 20, 20
{
	Offset 10, 35
	Patch "WPNSHEET", -60, -20
	Patch "WPPKUPL2", 18, 4
}

Sprite "PSGRD0", 20, 20
{
	Offset 10, 35
	Patch "WPNSHEET", -60, -20
	{
		Blend "#FFFFFF", 0.3
	}
	Patch "WPPKUPL2", 18, 4
	{
		Blend "#FFFFFF", 0.3
	}
}

Sprite "PSGRE0", 20, 20
{
	Offset 10, 35
	Patch "WPNSHEET", -60, -20
	Patch "WPPKUPL3", 18, 4
}

Sprite "PSGRF0", 20, 20
{
	Offset 10, 35
	Patch "WPNSHEET", -60, -20
	{
		Blend "#FFFFFF", 0.3
	}
	Patch "WPPKUPL3", 18, 4
	{
		Blend "#FFFFFF", 0.3
	}
}

Sprite "PSGRG0", 20, 20
{
	Offset 10, 35
	Patch "WPNSHEET", -60, -20
	Patch "WPPKUPL4", 18, 4
}

Sprite "PSGRH0", 20, 20
{
	Offset 10, 35
	Patch "WPNSHEET", -60, -20
	{
		Blend "#FFFFFF", 0.3
	}
	Patch "WPPKUPL4", 18, 4
	{
		Blend "#FFFFFF", 0.3
	}
}

//Volley Shot
Sprite "PVLSA0", 20, 20
{
	Offset 10, 35
	Patch "WPNSHEET", -80, -20
	Patch "WPPKUPL1", 18, 4
}

Sprite "PVLSB0", 20, 20
{
	Offset 10, 35
	Patch "WPNSHEET", -80, -20
	{
		Blend "#FFFFFF", 0.3
	}
	Patch "WPPKUPL1", 18, 4
	{
		Blend "#FFFFFF", 0.3
	}
}

Sprite "PVLSC0", 20, 20
{
	Offset 10, 35
	Patch "WPNSHEET", -80, -20
	Patch "WPPKUPL2", 18, 4
}

Sprite "PVLSD0", 20, 20
{
	Offset 10, 35
	Patch "WPNSHEET", -80, -20
	{
		Blend "#FFFFFF", 0.3
	}
	Patch "WPPKUPL2", 18, 4
	{
		Blend "#FFFFFF", 0.3
	}
}

Sprite "PVLSE0", 20, 20
{
	Offset 10, 35
	Patch "WPNSHEET", -80, -20
	Patch "WPPKUPL3", 18, 4
}

Sprite "PVLSF0", 20, 20
{
	Offset 10, 35
	Patch "WPNSHEET", -80, -20
	{
		Blend "#FFFFFF", 0.3
	}
	Patch "WPPKUPL3", 18, 4
	{
		Blend "#FFFFFF", 0.3
	}
}

Sprite "PVLSG0", 20, 20
{
	Offset 10, 35
	Patch "WPNSHEET", -80, -20
	Patch "WPPKUPL4", 18, 4
}

Sprite "PVLSH0", 20, 20
{
	Offset 10, 35
	Patch "WPNSHEET", -80, -20
	{
		Blend "#FFFFFF", 0.3
	}
	Patch "WPPKUPL4", 18, 4
	{
		Blend "#FFFFFF", 0.3
	}
}

//Toxic Storm
Sprite "PACSA0", 20, 20
{
	Offset 10, 35
	Patch "WPNSHEET", -100, -20
	Patch "WPPKUPL1", 18, 4
}

Sprite "PACSB0", 20, 20
{
	Offset 10, 35
	Patch "WPNSHEET", -100, -20
	{
		Blend "#FFFFFF", 0.3
	}
	Patch "WPPKUPL1", 18, 4
	{
		Blend "#FFFFFF", 0.3
	}
}

Sprite "PACSC0", 20, 20
{
	Offset 10, 35
	Patch "WPNSHEET", -100, -20
	Patch "WPPKUPL2", 18, 4
}

Sprite "PACSD0", 20, 20
{
	Offset 10, 35
	Patch "WPNSHEET", -100, -20
	{
		Blend "#FFFFFF", 0.3
	}
	Patch "WPPKUPL2", 18, 4
	{
		Blend "#FFFFFF", 0.3
	}
}

Sprite "PACSE0", 20, 20
{
	Offset 10, 35
	Patch "WPNSHEET", -100, -20
	Patch "WPPKUPL3", 18, 4
}

Sprite "PACSF0", 20, 20
{
	Offset 10, 35
	Patch "WPNSHEET", -100, -20
	{
		Blend "#FFFFFF", 0.3
	}
	Patch "WPPKUPL3", 18, 4
	{
		Blend "#FFFFFF", 0.3
	}
}

Sprite "PACSG0", 20, 20
{
	Offset 10, 35
	Patch "WPNSHEET", -100, -20
	Patch "WPPKUPL4", 18, 4
}

Sprite "PACSH0", 20, 20
{
	Offset 10, 35
	Patch "WPNSHEET", -100, -20
	{
		Blend "#FFFFFF", 0.3
	}
	Patch "WPPKUPL4", 18, 4
	{
		Blend "#FFFFFF", 0.3
	}
}

//Void Coil
Sprite "PVDCA0", 20, 20
{
	Offset 10, 35
	Patch "WPNSHEET", -120, -20
	Patch "WPPKUPL1", 18, 4
}

Sprite "PVDCB0", 20, 20
{
	Offset 10, 35
	Patch "WPNSHEET", -120, -20
	{
		Blend "#FFFFFF", 0.3
	}
	Patch "WPPKUPL1", 18, 4
	{
		Blend "#FFFFFF", 0.3
	}
}

Sprite "PVDCC0", 20, 20
{
	Offset 10, 35
	Patch "WPNSHEET", -120, -20
	Patch "WPPKUPL2", 18, 4
}

Sprite "PVDCD0", 20, 20
{
	Offset 10, 35
	Patch "WPNSHEET", -120, -20
	{
		Blend "#FFFFFF", 0.3
	}
	Patch "WPPKUPL2", 18, 4
	{
		Blend "#FFFFFF", 0.3
	}
}

Sprite "PVDCE0", 20, 20
{
	Offset 10, 35
	Patch "WPNSHEET", -120, -20
	Patch "WPPKUPL3", 18, 4
}

Sprite "PVDCF0", 20, 20
{
	Offset 10, 35
	Patch "WPNSHEET", -120, -20
	{
		Blend "#FFFFFF", 0.3
	}
	Patch "WPPKUPL3", 18, 4
	{
		Blend "#FFFFFF", 0.3
	}
}

Sprite "PVDCG0", 20, 20
{
	Offset 10, 35
	Patch "WPNSHEET", -120, -20
	Patch "WPPKUPL4", 18, 4
}

Sprite "PVDCH0", 20, 20
{
	Offset 10, 35
	Patch "WPNSHEET", -120, -20
	{
		Blend "#FFFFFF", 0.3
	}
	Patch "WPPKUPL4", 18, 4
	{
		Blend "#FFFFFF", 0.3
	}
}

//Crowd Control
Sprite "PCRDA0", 20, 20
{
	Offset 10, 35
	Patch "WPNSHEET", -140, -20
	Patch "WPPKUPL1", 18, 4
}

Sprite "PCRDB0", 20, 20
{
	Offset 10, 35
	Patch "WPNSHEET", -140, -20
	{
		Blend "#FFFFFF", 0.3
	}
	Patch "WPPKUPL1", 18, 4
	{
		Blend "#FFFFFF", 0.3
	}
}

Sprite "PCRDC0", 20, 20
{
	Offset 10, 35
	Patch "WPNSHEET", -140, -20
	Patch "WPPKUPL2", 18, 4
}

Sprite "PCRDD0", 20, 20
{
	Offset 10, 35
	Patch "WPNSHEET", -140, -20
	{
		Blend "#FFFFFF", 0.3
	}
	Patch "WPPKUPL2", 18, 4
	{
		Blend "#FFFFFF", 0.3
	}
}

Sprite "PCRDE0", 20, 20
{
	Offset 10, 35
	Patch "WPNSHEET", -140, -20
	Patch "WPPKUPL3", 18, 4
}

Sprite "PCRDF0", 20, 20
{
	Offset 10, 35
	Patch "WPNSHEET", -140, -20
	{
		Blend "#FFFFFF", 0.3
	}
	Patch "WPPKUPL3", 18, 4
	{
		Blend "#FFFFFF", 0.3
	}
}

Sprite "PCRDG0", 20, 20
{
	Offset 10, 35
	Patch "WPNSHEET", -140, -20
	Patch "WPPKUPL4", 18, 4
}

Sprite "PCRDH0", 20, 20
{
	Offset 10, 35
	Patch "WPNSHEET", -140, -20
	{
		Blend "#FFFFFF", 0.3
	}
	Patch "WPPKUPL4", 18, 4
	{
		Blend "#FFFFFF", 0.3
	}
}

//RAPID
//Spitfire
Sprite "PBRSA0", 20, 20
{
	Offset 10, 35
	Patch "WPNSHEET", 0, -40
	Patch "WPPKUPL1", 18, 4
}

Sprite "PBRSB0", 20, 20
{
	Offset 10, 35
	Patch "WPNSHEET", 0, -40
	{
		Blend "#FFFFFF", 0.3
	}
	Patch "WPPKUPL1", 18, 4
	{
		Blend "#FFFFFF", 0.3
	}
}

Sprite "PBRSC0", 20, 20
{
	Offset 10, 35
	Patch "WPNSHEET", 0, -40
	Patch "WPPKUPL2", 18, 4
}

Sprite "PBRSD0", 20, 20
{
	Offset 10, 35
	Patch "WPNSHEET", 0, -40
	{
		Blend "#FFFFFF", 0.3
	}
	Patch "WPPKUPL2", 18, 4
	{
		Blend "#FFFFFF", 0.3
	}
}

Sprite "PBRSE0", 20, 20
{
	Offset 10, 35
	Patch "WPNSHEET", 0, -40
	Patch "WPPKUPL3", 18, 4
}

Sprite "PBRSF0", 20, 20
{
	Offset 10, 35
	Patch "WPNSHEET", 0, -40
	{
		Blend "#FFFFFF", 0.3
	}
	Patch "WPPKUPL3", 18, 4
	{
		Blend "#FFFFFF", 0.3
	}
}

Sprite "PBRSG0", 20, 20
{
	Offset 10, 35
	Patch "WPNSHEET", 0, -40
	Patch "WPPKUPL4", 18, 4
}

Sprite "PBRSH0", 20, 20
{
	Offset 10, 35
	Patch "WPNSHEET", 0, -40
	{
		Blend "#FFFFFF", 0.3
	}
	Patch "WPPKUPL4", 18, 4
	{
		Blend "#FFFFFF", 0.3
	}
}

//Hunting Laser
Sprite "PHNLA0", 20, 20
{
	Offset 10, 35
	Patch "WPNSHEET", -20, -40
	Patch "WPPKUPL1", 18, 4
}

Sprite "PHNLB0", 20, 20
{
	Offset 10, 35
	Patch "WPNSHEET", -20, -40
	{
		Blend "#FFFFFF", 0.3
	}
	Patch "WPPKUPL1", 18, 4
	{
		Blend "#FFFFFF", 0.3
	}
}

Sprite "PHNLC0", 20, 20
{
	Offset 10, 35
	Patch "WPNSHEET", -20, -40
	Patch "WPPKUPL2", 18, 4
}

Sprite "PHNLD0", 20, 20
{
	Offset 10, 35
	Patch "WPNSHEET", -20, -40
	{
		Blend "#FFFFFF", 0.3
	}
	Patch "WPPKUPL2", 18, 4
	{
		Blend "#FFFFFF", 0.3
	}
}

Sprite "PHNLE0", 20, 20
{
	Offset 10, 35
	Patch "WPNSHEET", -20, -40
	Patch "WPPKUPL3", 18, 4
}

Sprite "PHNLF0", 20, 20
{
	Offset 10, 35
	Patch "WPNSHEET", -20, -40
	{
		Blend "#FFFFFF", 0.3
	}
	Patch "WPPKUPL3", 18, 4
	{
		Blend "#FFFFFF", 0.3
	}
}

Sprite "PHNLG0", 20, 20
{
	Offset 10, 35
	Patch "WPNSHEET", -20, -40
	Patch "WPPKUPL4", 18, 4
}

Sprite "PHNLH0", 20, 20
{
	Offset 10, 35
	Patch "WPNSHEET", -20, -40
	{
		Blend "#FFFFFF", 0.3
	}
	Patch "WPPKUPL4", 18, 4
	{
		Blend "#FFFFFF", 0.3
	}
}

//Viper Wave
Sprite "PVPWA0", 20, 20
{
	Offset 10, 35
	Patch "WPNSHEET", -40, -40
	Patch "WPPKUPL1", 18, 4
}

Sprite "PVPWB0", 20, 20
{
	Offset 10, 35
	Patch "WPNSHEET", -40, -40
	{
		Blend "#FFFFFF", 0.3
	}
	Patch "WPPKUPL1", 18, 4
	{
		Blend "#FFFFFF", 0.3
	}
}

Sprite "PVPWC0", 20, 20
{
	Offset 10, 35
	Patch "WPNSHEET", -40, -40
	Patch "WPPKUPL2", 18, 4
}

Sprite "PVPWD0", 20, 20
{
	Offset 10, 35
	Patch "WPNSHEET", -40, -40
	{
		Blend "#FFFFFF", 0.3
	}
	Patch "WPPKUPL2", 18, 4
	{
		Blend "#FFFFFF", 0.3
	}
}

Sprite "PVPWE0", 20, 20
{
	Offset 10, 35
	Patch "WPNSHEET", -40, -40
	Patch "WPPKUPL3", 18, 4
}

Sprite "PVPWF0", 20, 20
{
	Offset 10, 35
	Patch "WPNSHEET", -40, -40
	{
		Blend "#FFFFFF", 0.3
	}
	Patch "WPPKUPL3", 18, 4
	{
		Blend "#FFFFFF", 0.3
	}
}

Sprite "PVPWG0", 20, 20
{
	Offset 10, 35
	Patch "WPNSHEET", -40, -40
	Patch "WPPKUPL4", 18, 4
}

Sprite "PVPWH0", 20, 20
{
	Offset 10, 35
	Patch "WPNSHEET", -40, -40
	{
		Blend "#FFFFFF", 0.3
	}
	Patch "WPPKUPL4", 18, 4
	{
		Blend "#FFFFFF", 0.3
	}
}

//Repeaters
Sprite "PPREA0", 20, 20
{
	Offset 10, 35
	Patch "WPNSHEET", -60, -40
	Patch "WPPKUPL1", 18, 4
}

Sprite "PPREB0", 20, 20
{
	Offset 10, 35
	Patch "WPNSHEET", -60, -40
	{
		Blend "#FFFFFF", 0.3
	}
	Patch "WPPKUPL1", 18, 4
	{
		Blend "#FFFFFF", 0.3
	}
}

Sprite "PPREC0", 20, 20
{
	Offset 10, 35
	Patch "WPNSHEET", -60, -40
	Patch "WPPKUPL2", 18, 4
}

Sprite "PPRED0", 20, 20
{
	Offset 10, 35
	Patch "WPNSHEET", -60, -40
	{
		Blend "#FFFFFF", 0.3
	}
	Patch "WPPKUPL2", 18, 4
	{
		Blend "#FFFFFF", 0.3
	}
}

Sprite "PPREE0", 20, 20
{
	Offset 10, 35
	Patch "WPNSHEET", -60, -40
	Patch "WPPKUPL3", 18, 4
}

Sprite "PPREF0", 20, 20
{
	Offset 10, 35
	Patch "WPNSHEET", -60, -40
	{
		Blend "#FFFFFF", 0.3
	}
	Patch "WPPKUPL3", 18, 4
	{
		Blend "#FFFFFF", 0.3
	}
}

Sprite "PPREG0", 20, 20
{
	Offset 10, 35
	Patch "WPNSHEET", -60, -40
	Patch "WPPKUPL4", 18, 4
}

Sprite "PPREH0", 20, 20
{
	Offset 10, 35
	Patch "WPNSHEET", -60, -40
	{
		Blend "#FFFFFF", 0.3
	}
	Patch "WPPKUPL4", 18, 4
	{
		Blend "#FFFFFF", 0.3
	}
}

//Hyper Burst
Sprite "PHYBA0", 20, 20
{
	Offset 10, 35
	Patch "WPNSHEET", -80, -40
	Patch "WPPKUPL1", 18, 4
}

Sprite "PHYBB0", 20, 20
{
	Offset 10, 35
	Patch "WPNSHEET", -80, -40
	{
		Blend "#FFFFFF", 0.3
	}
	Patch "WPPKUPL1", 18, 4
	{
		Blend "#FFFFFF", 0.3
	}
}

Sprite "PHYBC0", 20, 20
{
	Offset 10, 35
	Patch "WPNSHEET", -80, -40
	Patch "WPPKUPL2", 18, 4
}

Sprite "PHYBD0", 20, 20
{
	Offset 10, 35
	Patch "WPNSHEET", -80, -40
	{
		Blend "#FFFFFF", 0.3
	}
	Patch "WPPKUPL2", 18, 4
	{
		Blend "#FFFFFF", 0.3
	}
}

Sprite "PHYBE0", 20, 20
{
	Offset 10, 35
	Patch "WPNSHEET", -80, -40
	Patch "WPPKUPL3", 18, 4
}

Sprite "PHYBF0", 20, 20
{
	Offset 10, 35
	Patch "WPNSHEET", -80, -40
	{
		Blend "#FFFFFF", 0.3
	}
	Patch "WPPKUPL3", 18, 4
	{
		Blend "#FFFFFF", 0.3
	}
}

Sprite "PHYBG0", 20, 20
{
	Offset 10, 35
	Patch "WPNSHEET", -80, -40
	Patch "WPPKUPL4", 18, 4
}

Sprite "PHYBH0", 20, 20
{
	Offset 10, 35
	Patch "WPNSHEET", -80, -40
	{
		Blend "#FFFFFF", 0.3
	}
	Patch "WPPKUPL4", 18, 4
	{
		Blend "#FFFFFF", 0.3
	}
}

//Riotous Riveter
Sprite "PRIRA0", 20, 20
{
	Offset 10, 35
	Patch "WPNSHEET", -100, -40
	Patch "WPPKUPL1", 18, 4
}

Sprite "PRIRB0", 20, 20
{
	Offset 10, 35
	Patch "WPNSHEET", -100, -40
	{
		Blend "#FFFFFF", 0.3
	}
	Patch "WPPKUPL1", 18, 4
	{
		Blend "#FFFFFF", 0.3
	}
}

Sprite "PRIRC0", 20, 20
{
	Offset 10, 35
	Patch "WPNSHEET", -100, -40
	Patch "WPPKUPL2", 18, 4
}

Sprite "PRIRD0", 20, 20
{
	Offset 10, 35
	Patch "WPNSHEET", -100, -40
	{
		Blend "#FFFFFF", 0.3
	}
	Patch "WPPKUPL2", 18, 4
	{
		Blend "#FFFFFF", 0.3
	}
}

Sprite "PRIRE0", 20, 20
{
	Offset 10, 35
	Patch "WPNSHEET", -100, -40
	Patch "WPPKUPL3", 18, 4
}

Sprite "PRIRF0", 20, 20
{
	Offset 10, 35
	Patch "WPNSHEET", -100, -40
	{
		Blend "#FFFFFF", 0.3
	}
	Patch "WPPKUPL3", 18, 4
	{
		Blend "#FFFFFF", 0.3
	}
}

Sprite "PRIRG0", 20, 20
{
	Offset 10, 35
	Patch "WPNSHEET", -100, -40
	Patch "WPPKUPL4", 18, 4
}

Sprite "PRIRH0", 20, 20
{
	Offset 10, 35
	Patch "WPNSHEET", -100, -40
	{
		Blend "#FFFFFF", 0.3
	}
	Patch "WPPKUPL4", 18, 4
	{
		Blend "#FFFFFF", 0.3
	}
}

//Splintergun
Sprite "PSPGA0", 20, 20
{
	Offset 10, 35
	Patch "WPNSHEET", -120, -40
	Patch "WPPKUPL1", 18, 4
}

Sprite "PSPGB0", 20, 20
{
	Offset 10, 35
	Patch "WPNSHEET", -120, -40
	{
		Blend "#FFFFFF", 0.3
	}
	Patch "WPPKUPL1", 18, 4
	{
		Blend "#FFFFFF", 0.3
	}
}

Sprite "PSPGC0", 20, 20
{
	Offset 10, 35
	Patch "WPNSHEET", -120, -40
	Patch "WPPKUPL2", 18, 4
}

Sprite "PSPGD0", 20, 20
{
	Offset 10, 35
	Patch "WPNSHEET", -120, -40
	{
		Blend "#FFFFFF", 0.3
	}
	Patch "WPPKUPL2", 18, 4
	{
		Blend "#FFFFFF", 0.3
	}
}

Sprite "PSPGE0", 20, 20
{
	Offset 10, 35
	Patch "WPNSHEET", -120, -40
	Patch "WPPKUPL3", 18, 4
}

Sprite "PSPGF0", 20, 20
{
	Offset 10, 35
	Patch "WPNSHEET", -120, -40
	{
		Blend "#FFFFFF", 0.3
	}
	Patch "WPPKUPL3", 18, 4
	{
		Blend "#FFFFFF", 0.3
	}
}

Sprite "PSPGG0", 20, 20
{
	Offset 10, 35
	Patch "WPNSHEET", -120, -40
	Patch "WPPKUPL4", 18, 4
}

Sprite "PSPGH0", 20, 20
{
	Offset 10, 35
	Patch "WPNSHEET", -120, -40
	{
		Blend "#FFFFFF", 0.3
	}
	Patch "WPPKUPL4", 18, 4
	{
		Blend "#FFFFFF", 0.3
	}
}

//TECH
//Assassin Vulcan
Sprite "PRPVA0", 20, 20
{
	Offset 10, 35
	Patch "WPNSHEET", 0, -60
	Patch "WPPKUPL1", 18, 4
}

Sprite "PRPVB0", 20, 20
{
	Offset 10, 35
	Patch "WPNSHEET", 0, -60
	{
		Blend "#FFFFFF", 0.3
	}
	Patch "WPPKUPL1", 18, 4
	{
		Blend "#FFFFFF", 0.3
	}
}

Sprite "PRPVC0", 20, 20
{
	Offset 10, 35
	Patch "WPNSHEET", 0, -60
	Patch "WPPKUPL2", 18, 4
}

Sprite "PRPVD0", 20, 20
{
	Offset 10, 35
	Patch "WPNSHEET", 0, -60
	{
		Blend "#FFFFFF", 0.3
	}
	Patch "WPPKUPL2", 18, 4
	{
		Blend "#FFFFFF", 0.3
	}
}

Sprite "PRPVE0", 20, 20
{
	Offset 10, 35
	Patch "WPNSHEET", 0, -60
	Patch "WPPKUPL3", 18, 4
}

Sprite "PRPVF0", 20, 20
{
	Offset 10, 35
	Patch "WPNSHEET", 0, -60
	{
		Blend "#FFFFFF", 0.3
	}
	Patch "WPPKUPL3", 18, 4
	{
		Blend "#FFFFFF", 0.3
	}
}

Sprite "PRPVG0", 20, 20
{
	Offset 10, 35
	Patch "WPNSHEET", 0, -60
	Patch "WPPKUPL4", 18, 4
}

Sprite "PRPVH0", 20, 20
{
	Offset 10, 35
	Patch "WPNSHEET", 0, -60
	{
		Blend "#FFFFFF", 0.3
	}
	Patch "WPPKUPL4", 18, 4
	{
		Blend "#FFFFFF", 0.3
	}
}

//Winged Reaver
Sprite "PWRVA0", 20, 20
{
	Offset 10, 35
	Patch "WPNSHEET", -20, -60
	Patch "WPPKUPL1", 18, 4
}

Sprite "PWRVB0", 20, 20
{
	Offset 10, 35
	Patch "WPNSHEET", -20, -60
	{
		Blend "#FFFFFF", 0.3
	}
	Patch "WPPKUPL1", 18, 4
	{
		Blend "#FFFFFF", 0.3
	}
}

Sprite "PWRVC0", 20, 20
{
	Offset 10, 35
	Patch "WPNSHEET", -20, -60
	Patch "WPPKUPL2", 18, 4
}

Sprite "PWRVD0", 20, 20
{
	Offset 10, 35
	Patch "WPNSHEET", -20, -60
	{
		Blend "#FFFFFF", 0.3
	}
	Patch "WPPKUPL2", 18, 4
	{
		Blend "#FFFFFF", 0.3
	}
}

Sprite "PWRVE0", 20, 20
{
	Offset 10, 35
	Patch "WPNSHEET", -20, -60
	Patch "WPPKUPL3", 18, 4
}

Sprite "PWRVF0", 20, 20
{
	Offset 10, 35
	Patch "WPNSHEET", -20, -60
	{
		Blend "#FFFFFF", 0.3
	}
	Patch "WPPKUPL3", 18, 4
	{
		Blend "#FFFFFF", 0.3
	}
}

Sprite "PWRVG0", 20, 20
{
	Offset 10, 35
	Patch "WPNSHEET", -20, -60
	Patch "WPPKUPL4", 18, 4
}

Sprite "PWRVH0", 20, 20
{
	Offset 10, 35
	Patch "WPNSHEET", -20, -60
	{
		Blend "#FFFFFF", 0.3
	}
	Patch "WPPKUPL4", 18, 4
	{
		Blend "#FFFFFF", 0.3
	}
}

//Metal Monstrosity
Sprite "PMTMA0", 20, 20
{
	Offset 10, 35
	Patch "WPNSHEET", -40, -60
	Patch "WPPKUPL1", 18, 4
}

Sprite "PMTMB0", 20, 20
{
	Offset 10, 35
	Patch "WPNSHEET", -40, -60
	{
		Blend "#FFFFFF", 0.3
	}
	Patch "WPPKUPL1", 18, 4
	{
		Blend "#FFFFFF", 0.3
	}
}

Sprite "PMTMC0", 20, 20
{
	Offset 10, 35
	Patch "WPNSHEET", -40, -60
	Patch "WPPKUPL2", 18, 4
}

Sprite "PMTMD0", 20, 20
{
	Offset 10, 35
	Patch "WPNSHEET", -40, -60
	{
		Blend "#FFFFFF", 0.3
	}
	Patch "WPPKUPL2", 18, 4
	{
		Blend "#FFFFFF", 0.3
	}
}

Sprite "PMTME0", 20, 20
{
	Offset 10, 35
	Patch "WPNSHEET", -40, -60
	Patch "WPPKUPL3", 18, 4
}

Sprite "PMTMF0", 20, 20
{
	Offset 10, 35
	Patch "WPNSHEET", -40, -60
	{
		Blend "#FFFFFF", 0.3
	}
	Patch "WPPKUPL3", 18, 4
	{
		Blend "#FFFFFF", 0.3
	}
}

Sprite "PMTMG0", 20, 20
{
	Offset 10, 35
	Patch "WPNSHEET", -40, -60
	Patch "WPPKUPL4", 18, 4
}

Sprite "PMTMH0", 20, 20
{
	Offset 10, 35
	Patch "WPNSHEET", -40, -60
	{
		Blend "#FFFFFF", 0.3
	}
	Patch "WPPKUPL4", 18, 4
	{
		Blend "#FFFFFF", 0.3
	}
}

//Mag Shurikens
Sprite "PMAGA0", 20, 20
{
	Offset 10, 35
	Patch "WPNSHEET", -60, -60
	Patch "WPPKUPL1", 18, 4
}

Sprite "PMAGB0", 20, 20
{
	Offset 10, 35
	Patch "WPNSHEET", -60, -60
	{
		Blend "#FFFFFF", 0.3
	}
	Patch "WPPKUPL1", 18, 4
	{
		Blend "#FFFFFF", 0.3
	}
}

Sprite "PMAGC0", 20, 20
{
	Offset 10, 35
	Patch "WPNSHEET", -60, -60
	Patch "WPPKUPL2", 18, 4
}

Sprite "PMAGD0", 20, 20
{
	Offset 10, 35
	Patch "WPNSHEET", -60, -60
	{
		Blend "#FFFFFF", 0.3
	}
	Patch "WPPKUPL2", 18, 4
	{
		Blend "#FFFFFF", 0.3
	}
}

Sprite "PMAGE0", 20, 20
{
	Offset 10, 35
	Patch "WPNSHEET", -60, -60
	Patch "WPPKUPL3", 18, 4
}

Sprite "PMAGF0", 20, 20
{
	Offset 10, 35
	Patch "WPNSHEET", -60, -60
	{
		Blend "#FFFFFF", 0.3
	}
	Patch "WPPKUPL3", 18, 4
	{
		Blend "#FFFFFF", 0.3
	}
}

Sprite "PMAGG0", 20, 20
{
	Offset 10, 35
	Patch "WPNSHEET", -60, -60
	Patch "WPPKUPL4", 18, 4
}

Sprite "PMAGH0", 20, 20
{
	Offset 10, 35
	Patch "WPNSHEET", -60, -60
	{
		Blend "#FFFFFF", 0.3
	}
	Patch "WPPKUPL4", 18, 4
	{
		Blend "#FFFFFF", 0.3
	}
}

//Scatter Bomber
Sprite "PSCBA0", 20, 20
{
	Offset 10, 35
	Patch "WPNSHEET", -80, -60
	Patch "WPPKUPL1", 18, 4
}

Sprite "PSCBB0", 20, 20
{
	Offset 10, 35
	Patch "WPNSHEET", -80, -60
	{
		Blend "#FFFFFF", 0.3
	}
	Patch "WPPKUPL1", 18, 4
	{
		Blend "#FFFFFF", 0.3
	}
}

Sprite "PSCBC0", 20, 20
{
	Offset 10, 35
	Patch "WPNSHEET", -80, -60
	Patch "WPPKUPL2", 18, 4
}

Sprite "PSCBD0", 20, 20
{
	Offset 10, 35
	Patch "WPNSHEET", -80, -60
	{
		Blend "#FFFFFF", 0.3
	}
	Patch "WPPKUPL2", 18, 4
	{
		Blend "#FFFFFF", 0.3
	}
}

Sprite "PSCBE0", 20, 20
{
	Offset 10, 35
	Patch "WPNSHEET", -80, -60
	Patch "WPPKUPL3", 18, 4
}

Sprite "PSCBF0", 20, 20
{
	Offset 10, 35
	Patch "WPNSHEET", -80, -60
	{
		Blend "#FFFFFF", 0.3
	}
	Patch "WPPKUPL3", 18, 4
	{
		Blend "#FFFFFF", 0.3
	}
}

Sprite "PSCBG0", 20, 20
{
	Offset 10, 35
	Patch "WPNSHEET", -80, -60
	Patch "WPPKUPL4", 18, 4
}

Sprite "PSCBH0", 20, 20
{
	Offset 10, 35
	Patch "WPNSHEET", -80, -60
	{
		Blend "#FFFFFF", 0.3
	}
	Patch "WPPKUPL4", 18, 4
	{
		Blend "#FFFFFF", 0.3
	}
}

//Redline
Sprite "PRDLA0", 20, 20
{
	Offset 10, 35
	Patch "WPNSHEET", -100, -60
	Patch "WPPKUPL1", 18, 4
}

Sprite "PRDLB0", 20, 20
{
	Offset 10, 35
	Patch "WPNSHEET", -100, -60
	{
		Blend "#FFFFFF", 0.3
	}
	Patch "WPPKUPL1", 18, 4
	{
		Blend "#FFFFFF", 0.3
	}
}

Sprite "PRDLC0", 20, 20
{
	Offset 10, 35
	Patch "WPNSHEET", -100, -60
	Patch "WPPKUPL2", 18, 4
}

Sprite "PRDLD0", 20, 20
{
	Offset 10, 35
	Patch "WPNSHEET", -100, -60
	{
		Blend "#FFFFFF", 0.3
	}
	Patch "WPPKUPL2", 18, 4
	{
		Blend "#FFFFFF", 0.3
	}
}

Sprite "PRDLE0", 20, 20
{
	Offset 10, 35
	Patch "WPNSHEET", -100, -60
	Patch "WPPKUPL3", 18, 4
}

Sprite "PRDLF0", 20, 20
{
	Offset 10, 35
	Patch "WPNSHEET", -100, -60
	{
		Blend "#FFFFFF", 0.3
	}
	Patch "WPPKUPL3", 18, 4
	{
		Blend "#FFFFFF", 0.3
	}
}

Sprite "PRDLG0", 20, 20
{
	Offset 10, 35
	Patch "WPNSHEET", -100, -60
	Patch "WPPKUPL4", 18, 4
}

Sprite "PRDLH0", 20, 20
{
	Offset 10, 35
	Patch "WPNSHEET", -100, -60
	{
		Blend "#FFFFFF", 0.3
	}
	Patch "WPPKUPL4", 18, 4
	{
		Blend "#FFFFFF", 0.3
	}
}

//Electrocutioner
Sprite "PELCA0", 20, 20
{
	Offset 10, 35
	Patch "WPNSHEET", -120, -60
	Patch "WPPKUPL1", 18, 4
}

Sprite "PELCB0", 20, 20
{
	Offset 10, 35
	Patch "WPNSHEET", -120, -60
	{
		Blend "#FFFFFF", 0.3
	}
	Patch "WPPKUPL1", 18, 4
	{
		Blend "#FFFFFF", 0.3
	}
}

Sprite "PELCC0", 20, 20
{
	Offset 10, 35
	Patch "WPNSHEET", -120, -60
	Patch "WPPKUPL2", 18, 4
}

Sprite "PELCD0", 20, 20
{
	Offset 10, 35
	Patch "WPNSHEET", -120, -60
	{
		Blend "#FFFFFF", 0.3
	}
	Patch "WPPKUPL2", 18, 4
	{
		Blend "#FFFFFF", 0.3
	}
}

Sprite "PELCE0", 20, 20
{
	Offset 10, 35
	Patch "WPNSHEET", -120, -60
	Patch "WPPKUPL3", 18, 4
}

Sprite "PELCF0", 20, 20
{
	Offset 10, 35
	Patch "WPNSHEET", -120, -60
	{
		Blend "#FFFFFF", 0.3
	}
	Patch "WPPKUPL3", 18, 4
	{
		Blend "#FFFFFF", 0.3
	}
}

Sprite "PELCG0", 20, 20
{
	Offset 10, 35
	Patch "WPNSHEET", -120, -60
	Patch "WPPKUPL4", 18, 4
}

Sprite "PELCH0", 20, 20
{
	Offset 10, 35
	Patch "WPNSHEET", -120, -60
	{
		Blend "#FFFFFF", 0.3
	}
	Patch "WPPKUPL4", 18, 4
	{
		Blend "#FFFFFF", 0.3
	}
}

//Stinger
Sprite "PSTNA0", 20, 20
{
	Offset 10, 35
	Patch "WPNSHEET", -140, -60
	Patch "WPPKUPL1", 18, 4
}

Sprite "PSTNB0", 20, 20
{
	Offset 10, 35
	Patch "WPNSHEET", -140, -60
	{
		Blend "#FFFFFF", 0.3
	}
	Patch "WPPKUPL1", 18, 4
	{
		Blend "#FFFFFF", 0.3
	}
}

Sprite "PSTNC0", 20, 20
{
	Offset 10, 35
	Patch "WPNSHEET", -140, -60
	Patch "WPPKUPL2", 18, 4
}

Sprite "PSTND0", 20, 20
{
	Offset 10, 35
	Patch "WPNSHEET", -140, -60
	{
		Blend "#FFFFFF", 0.3
	}
	Patch "WPPKUPL2", 18, 4
	{
		Blend "#FFFFFF", 0.3
	}
}

Sprite "PSTNE0", 20, 20
{
	Offset 10, 35
	Patch "WPNSHEET", -140, -60
	Patch "WPPKUPL3", 18, 4
}

Sprite "PSTNF0", 20, 20
{
	Offset 10, 35
	Patch "WPNSHEET", -140, -60
	{
		Blend "#FFFFFF", 0.3
	}
	Patch "WPPKUPL3", 18, 4
	{
		Blend "#FFFFFF", 0.3
	}
}

Sprite "PSTNG0", 20, 20
{
	Offset 10, 35
	Patch "WPNSHEET", -140, -60
	Patch "WPPKUPL4", 18, 4
}

Sprite "PSTNH0", 20, 20
{
	Offset 10, 35
	Patch "WPNSHEET", -140, -60
	{
		Blend "#FFFFFF", 0.3
	}
	Patch "WPPKUPL4", 18, 4
	{
		Blend "#FFFFFF", 0.3
	}
}

//SUPPORT
//Dogfighter Missile
Sprite "PCSMA0", 20, 20
{
	Offset 10, 35
	Patch "WPNSHEET", 0, -80
	Patch "WPPKUPL1", 18, 4
}

Sprite "PCSMB0", 20, 20
{
	Offset 10, 35
	Patch "WPNSHEET", 0, -80
	{
		Blend "#FFFFFF", 0.3
	}
	Patch "WPPKUPL1", 18, 4
	{
		Blend "#FFFFFF", 0.3
	}
}

Sprite "PCSMC0", 20, 20
{
	Offset 10, 35
	Patch "WPNSHEET", 0, -80
	Patch "WPPKUPL2", 18, 4
}

Sprite "PCSMD0", 20, 20
{
	Offset 10, 35
	Patch "WPNSHEET", 0, -80
	{
		Blend "#FFFFFF", 0.3
	}
	Patch "WPPKUPL2", 18, 4
	{
		Blend "#FFFFFF", 0.3
	}
}

Sprite "PCSME0", 20, 20
{
	Offset 10, 35
	Patch "WPNSHEET", 0, -80
	Patch "WPPKUPL3", 18, 4
}

Sprite "PCSMF0", 20, 20
{
	Offset 10, 35
	Patch "WPNSHEET", 0, -80
	{
		Blend "#FFFFFF", 0.3
	}
	Patch "WPPKUPL3", 18, 4
	{
		Blend "#FFFFFF", 0.3
	}
}

Sprite "PCSMG0", 20, 20
{
	Offset 10, 35
	Patch "WPNSHEET", 0, -80
	Patch "WPPKUPL4", 18, 4
}

Sprite "PCSMH0", 20, 20
{
	Offset 10, 35
	Patch "WPNSHEET", 0, -80
	{
		Blend "#FFFFFF", 0.3
	}
	Patch "WPPKUPL4", 18, 4
	{
		Blend "#FFFFFF", 0.3
	}
}

//Vampiric Gauntlets
Sprite "PVMGA0", 20, 20
{
	Offset 10, 35
	Patch "WPNSHEET", -20, -80
	Patch "WPPKUPL1", 18, 4
}

Sprite "PVMGB0", 20, 20
{
	Offset 10, 35
	Patch "WPNSHEET", -20, -80
	{
		Blend "#FFFFFF", 0.3
	}
	Patch "WPPKUPL1", 18, 4
	{
		Blend "#FFFFFF", 0.3
	}
}

Sprite "PVMGC0", 20, 20
{
	Offset 10, 35
	Patch "WPNSHEET", -20, -80
	Patch "WPPKUPL2", 18, 4
}

Sprite "PVMGD0", 20, 20
{
	Offset 10, 35
	Patch "WPNSHEET", -20, -80
	{
		Blend "#FFFFFF", 0.3
	}
	Patch "WPPKUPL2", 18, 4
	{
		Blend "#FFFFFF", 0.3
	}
}

Sprite "PVMGE0", 20, 20
{
	Offset 10, 35
	Patch "WPNSHEET", -20, -80
	Patch "WPPKUPL3", 18, 4
}

Sprite "PVMGF0", 20, 20
{
	Offset 10, 35
	Patch "WPNSHEET", -20, -80
	{
		Blend "#FFFFFF", 0.3
	}
	Patch "WPPKUPL3", 18, 4
	{
		Blend "#FFFFFF", 0.3
	}
}

Sprite "PVMGG0", 20, 20
{
	Offset 10, 35
	Patch "WPNSHEET", -20, -80
	Patch "WPPKUPL4", 18, 4
}

Sprite "PVMGH0", 20, 20
{
	Offset 10, 35
	Patch "WPNSHEET", -20, -80
	{
		Blend "#FFFFFF", 0.3
	}
	Patch "WPPKUPL4", 18, 4
	{
		Blend "#FFFFFF", 0.3
	}
}

//Plasma Spiders
Sprite "PPSPA0", 20, 20
{
	Offset 10, 35
	Patch "WPNSHEET", -40, -80
	Patch "WPPKUPL1", 18, 4
}

Sprite "PPSPB0", 20, 20
{
	Offset 10, 35
	Patch "WPNSHEET", -40, -80
	{
		Blend "#FFFFFF", 0.3
	}
	Patch "WPPKUPL1", 18, 4
	{
		Blend "#FFFFFF", 0.3
	}
}

Sprite "PPSPC0", 20, 20
{
	Offset 10, 35
	Patch "WPNSHEET", -40, -80
	Patch "WPPKUPL2", 18, 4
}

Sprite "PPSPD0", 20, 20
{
	Offset 10, 35
	Patch "WPNSHEET", -40, -80
	{
		Blend "#FFFFFF", 0.3
	}
	Patch "WPPKUPL2", 18, 4
	{
		Blend "#FFFFFF", 0.3
	}
}

Sprite "PPSPE0", 20, 20
{
	Offset 10, 35
	Patch "WPNSHEET", -40, -80
	Patch "WPPKUPL3", 18, 4
}

Sprite "PPSPF0", 20, 20
{
	Offset 10, 35
	Patch "WPNSHEET", -40, -80
	{
		Blend "#FFFFFF", 0.3
	}
	Patch "WPPKUPL3", 18, 4
	{
		Blend "#FFFFFF", 0.3
	}
}

Sprite "PPSPG0", 20, 20
{
	Offset 10, 35
	Patch "WPNSHEET", -40, -80
	Patch "WPPKUPL4", 18, 4
}

Sprite "PPSPH0", 20, 20
{
	Offset 10, 35
	Patch "WPNSHEET", -40, -80
	{
		Blend "#FFFFFF", 0.3
	}
	Patch "WPPKUPL4", 18, 4
	{
		Blend "#FFFFFF", 0.3
	}
}

//Flame Bloom Darts
Sprite "PFBDA0", 20, 20
{
	Offset 10, 35
	Patch "WPNSHEET", -60, -80
	Patch "WPPKUPL1", 18, 4
}

Sprite "PFBDB0", 20, 20
{
	Offset 10, 35
	Patch "WPNSHEET", -60, -80
	{
		Blend "#FFFFFF", 0.3
	}
	Patch "WPPKUPL1", 18, 4
	{
		Blend "#FFFFFF", 0.3
	}
}

Sprite "PFBDC0", 20, 20
{
	Offset 10, 35
	Patch "WPNSHEET", -60, -80
	Patch "WPPKUPL2", 18, 4
}

Sprite "PFBDD0", 20, 20
{
	Offset 10, 35
	Patch "WPNSHEET", -60, -80
	{
		Blend "#FFFFFF", 0.3
	}
	Patch "WPPKUPL2", 18, 4
	{
		Blend "#FFFFFF", 0.3
	}
}

Sprite "PFBDE0", 20, 20
{
	Offset 10, 35
	Patch "WPNSHEET", -60, -80
	Patch "WPPKUPL3", 18, 4
}

Sprite "PFBDF0", 20, 20
{
	Offset 10, 35
	Patch "WPNSHEET", -60, -80
	{
		Blend "#FFFFFF", 0.3
	}
	Patch "WPPKUPL3", 18, 4
	{
		Blend "#FFFFFF", 0.3
	}
}

Sprite "PFBDG0", 20, 20
{
	Offset 10, 35
	Patch "WPNSHEET", -60, -80
	Patch "WPPKUPL4", 18, 4
}

Sprite "PFBDH0", 20, 20
{
	Offset 10, 35
	Patch "WPNSHEET", -60, -80
	{
		Blend "#FFFFFF", 0.3
	}
	Patch "WPPKUPL4", 18, 4
	{
		Blend "#FFFFFF", 0.3
	}
}

//Force Wave
Sprite "PFWVA0", 20, 20
{
	Offset 10, 35
	Patch "WPNSHEET", -80, -80
	Patch "WPPKUPL1", 18, 4
}

Sprite "PFWVB0", 20, 20
{
	Offset 10, 35
	Patch "WPNSHEET", -80, -80
	{
		Blend "#FFFFFF", 0.3
	}
	Patch "WPPKUPL1", 18, 4
	{
		Blend "#FFFFFF", 0.3
	}
}

Sprite "PFWVC0", 20, 20
{
	Offset 10, 35
	Patch "WPNSHEET", -80, -80
	Patch "WPPKUPL2", 18, 4
}

Sprite "PFWVD0", 20, 20
{
	Offset 10, 35
	Patch "WPNSHEET", -80, -80
	{
		Blend "#FFFFFF", 0.3
	}
	Patch "WPPKUPL2", 18, 4
	{
		Blend "#FFFFFF", 0.3
	}
}

Sprite "PFWVE0", 20, 20
{
	Offset 10, 35
	Patch "WPNSHEET", -80, -80
	Patch "WPPKUPL3", 18, 4
}

Sprite "PFWVF0", 20, 20
{
	Offset 10, 35
	Patch "WPNSHEET", -80, -80
	{
		Blend "#FFFFFF", 0.3
	}
	Patch "WPPKUPL3", 18, 4
	{
		Blend "#FFFFFF", 0.3
	}
}

Sprite "PFWVG0", 20, 20
{
	Offset 10, 35
	Patch "WPNSHEET", -80, -80
	Patch "WPPKUPL4", 18, 4
}

Sprite "PFWVH0", 20, 20
{
	Offset 10, 35
	Patch "WPNSHEET", -80, -80
	{
		Blend "#FFFFFF", 0.3
	}
	Patch "WPPKUPL4", 18, 4
	{
		Blend "#FFFFFF", 0.3
	}
}

//MELEE
//Quick Strike
Sprite "PQSTA0", 20, 20
{
	Offset 10, 35
	Patch "WPNSHEET", 0, -100
	Patch "WPPKUPL1", 18, 4
}

Sprite "PQSTB0", 20, 20
{
	Offset 10, 35
	Patch "WPNSHEET", 0, -100
	{
		Blend "#FFFFFF", 0.3
	}
	Patch "WPPKUPL1", 18, 4
	{
		Blend "#FFFFFF", 0.3
	}
}

Sprite "PQSTC0", 20, 20
{
	Offset 10, 35
	Patch "WPNSHEET", 0, -100
	Patch "WPPKUPL2", 18, 4
}

Sprite "PQSTD0", 20, 20
{
	Offset 10, 35
	Patch "WPNSHEET", 0, -100
	{
		Blend "#FFFFFF", 0.3
	}
	Patch "WPPKUPL2", 18, 4
	{
		Blend "#FFFFFF", 0.3
	}
}

Sprite "PQSTE0", 20, 20
{
	Offset 10, 35
	Patch "WPNSHEET", 0, -100
	Patch "WPPKUPL3", 18, 4
}

Sprite "PQSTF0", 20, 20
{
	Offset 10, 35
	Patch "WPNSHEET", 0, -100
	{
		Blend "#FFFFFF", 0.3
	}
	Patch "WPPKUPL3", 18, 4
	{
		Blend "#FFFFFF", 0.3
	}
}

Sprite "PQSTG0", 20, 20
{
	Offset 10, 35
	Patch "WPNSHEET", 0, -100
	Patch "WPPKUPL4", 18, 4
}

Sprite "PQSTH0", 20, 20
{
	Offset 10, 35
	Patch "WPNSHEET", 0, -100
	{
		Blend "#FFFFFF", 0.3
	}
	Patch "WPPKUPL4", 18, 4
	{
		Blend "#FFFFFF", 0.3
	}
}

//Grind Halberd
Sprite "PGRHA0", 20, 20
{
	Offset 10, 35
	Patch "WPNSHEET", -20, -100
	Patch "WPPKUPL1", 18, 4
}

Sprite "PGRHB0", 20, 20
{
	Offset 10, 35
	Patch "WPNSHEET", -20, -100
	{
		Blend "#FFFFFF", 0.3
	}
	Patch "WPPKUPL1", 18, 4
	{
		Blend "#FFFFFF", 0.3
	}
}

Sprite "PGRHC0", 20, 20
{
	Offset 10, 35
	Patch "WPNSHEET", -20, -100
	Patch "WPPKUPL2", 18, 4
}

Sprite "PGRHD0", 20, 20
{
	Offset 10, 35
	Patch "WPNSHEET", -20, -100
	{
		Blend "#FFFFFF", 0.3
	}
	Patch "WPPKUPL2", 18, 4
	{
		Blend "#FFFFFF", 0.3
	}
}

Sprite "PGRHE0", 20, 20
{
	Offset 10, 35
	Patch "WPNSHEET", -20, -100
	Patch "WPPKUPL3", 18, 4
}

Sprite "PGRHF0", 20, 20
{
	Offset 10, 35
	Patch "WPNSHEET", -20, -100
	{
		Blend "#FFFFFF", 0.3
	}
	Patch "WPPKUPL3", 18, 4
	{
		Blend "#FFFFFF", 0.3
	}
}

Sprite "PGRHG0", 20, 20
{
	Offset 10, 35
	Patch "WPNSHEET", -20, -100
	Patch "WPPKUPL4", 18, 4
}

Sprite "PGRHH0", 20, 20
{
	Offset 10, 35
	Patch "WPNSHEET", -20, -100
	{
		Blend "#FFFFFF", 0.3
	}
	Patch "WPPKUPL4", 18, 4
	{
		Blend "#FFFFFF", 0.3
	}
}

//Galaxy Slicer
Sprite "PGXSA0", 20, 20
{
	Offset 10, 35
	Patch "WPNSHEET", -40, -100
	Patch "WPPKUPL1", 18, 4
}

Sprite "PGXSB0", 20, 20
{
	Offset 10, 35
	Patch "WPNSHEET", -40, -100
	{
		Blend "#FFFFFF", 0.3
	}
	Patch "WPPKUPL1", 18, 4
	{
		Blend "#FFFFFF", 0.3
	}
}

Sprite "PGXSC0", 20, 20
{
	Offset 10, 35
	Patch "WPNSHEET", -40, -100
	Patch "WPPKUPL2", 18, 4
}

Sprite "PGXSD0", 20, 20
{
	Offset 10, 35
	Patch "WPNSHEET", -40, -100
	{
		Blend "#FFFFFF", 0.3
	}
	Patch "WPPKUPL2", 18, 4
	{
		Blend "#FFFFFF", 0.3
	}
}

Sprite "PGXSE0", 20, 20
{
	Offset 10, 35
	Patch "WPNSHEET", -40, -100
	Patch "WPPKUPL3", 18, 4
}

Sprite "PGXSF0", 20, 20
{
	Offset 10, 35
	Patch "WPNSHEET", -40, -100
	{
		Blend "#FFFFFF", 0.3
	}
	Patch "WPPKUPL3", 18, 4
	{
		Blend "#FFFFFF", 0.3
	}
}

Sprite "PGXSG0", 20, 20
{
	Offset 10, 35
	Patch "WPNSHEET", -40, -100
	Patch "WPPKUPL4", 18, 4
}

Sprite "PGXSH0", 20, 20
{
	Offset 10, 35
	Patch "WPNSHEET", -40, -100
	{
		Blend "#FFFFFF", 0.3
	}
	Patch "WPPKUPL4", 18, 4
	{
		Blend "#FFFFFF", 0.3
	}
}

//Glacial Lash
Sprite "PGLLA0", 20, 20
{
	Offset 10, 35
	Patch "WPNSHEET", -60, -100
	Patch "WPPKUPL1", 18, 4
}

Sprite "PGLLB0", 20, 20
{
	Offset 10, 35
	Patch "WPNSHEET", -60, -100
	{
		Blend "#FFFFFF", 0.3
	}
	Patch "WPPKUPL1", 18, 4
	{
		Blend "#FFFFFF", 0.3
	}
}

Sprite "PGLLC0", 20, 20
{
	Offset 10, 35
	Patch "WPNSHEET", -60, -100
	Patch "WPPKUPL2", 18, 4
}

Sprite "PGLLD0", 20, 20
{
	Offset 10, 35
	Patch "WPNSHEET", -60, -100
	{
		Blend "#FFFFFF", 0.3
	}
	Patch "WPPKUPL2", 18, 4
	{
		Blend "#FFFFFF", 0.3
	}
}

Sprite "PGLLE0", 20, 20
{
	Offset 10, 35
	Patch "WPNSHEET", -60, -100
	Patch "WPPKUPL3", 18, 4
}

Sprite "PGLLF0", 20, 20
{
	Offset 10, 35
	Patch "WPNSHEET", -60, -100
	{
		Blend "#FFFFFF", 0.3
	}
	Patch "WPPKUPL3", 18, 4
	{
		Blend "#FFFFFF", 0.3
	}
}

Sprite "PGLLG0", 20, 20
{
	Offset 10, 35
	Patch "WPNSHEET", -60, -100
	Patch "WPPKUPL4", 18, 4
}

Sprite "PGLLH0", 20, 20
{
	Offset 10, 35
	Patch "WPNSHEET", -60, -100
	{
		Blend "#FFFFFF", 0.3
	}
	Patch "WPPKUPL4", 18, 4
	{
		Blend "#FFFFFF", 0.3
	}
}

//Frenzy Ravagers
Sprite "PFRRA0", 20, 20
{
	Offset 10, 35
	Patch "WPNSHEET", -80, -100
	Patch "WPPKUPL1", 18, 4
}

Sprite "PFRRB0", 20, 20
{
	Offset 10, 35
	Patch "WPNSHEET", -80, -100
	{
		Blend "#FFFFFF", 0.3
	}
	Patch "WPPKUPL1", 18, 4
	{
		Blend "#FFFFFF", 0.3
	}
}

Sprite "PFRRC0", 20, 20
{
	Offset 10, 35
	Patch "WPNSHEET", -80, -100
	Patch "WPPKUPL2", 18, 4
}

Sprite "PFRRD0", 20, 20
{
	Offset 10, 35
	Patch "WPNSHEET", -80, -100
	{
		Blend "#FFFFFF", 0.3
	}
	Patch "WPPKUPL2", 18, 4
	{
		Blend "#FFFFFF", 0.3
	}
}

Sprite "PFRRE0", 20, 20
{
	Offset 10, 35
	Patch "WPNSHEET", -80, -100
	Patch "WPPKUPL3", 18, 4
}

Sprite "PFRRF0", 20, 20
{
	Offset 10, 35
	Patch "WPNSHEET", -80, -100
	{
		Blend "#FFFFFF", 0.3
	}
	Patch "WPPKUPL3", 18, 4
	{
		Blend "#FFFFFF", 0.3
	}
}

Sprite "PFRRG0", 20, 20
{
	Offset 10, 35
	Patch "WPNSHEET", -80, -100
	Patch "WPPKUPL4", 18, 4
}

Sprite "PFRRH0", 20, 20
{
	Offset 10, 35
	Patch "WPNSHEET", -80, -100
	{
		Blend "#FFFFFF", 0.3
	}
	Patch "WPPKUPL4", 18, 4
	{
		Blend "#FFFFFF", 0.3
	}
}