Gene,Class
flhC,Class 1
flhD,Class 1
flgA,Class 2
flgB,Class 2
flgC,Class 2
flgD,Class 2
flgE,Class 2
flgF,Class 2
flgG,Class 2
flgH,Class 2
flgI,Class 2
flgJ,Class 2
flhA,Class 2
flhB,Class 2
flhE,Class 2
fliA,Class 2
fliE,Class 2
fliF,Class 2
fliG,Class 2
fliH,Class 2
fliI,Class 2
fliJ,Class 2
fliL,Class 2
fliM,Class 2
fliN,Class 2
fliO,Class 2
fliP,Class 2
fliQ,Class 2
fliR,Class 2
flgK,Class 3
flgL,Class 3
flgM,Class 3
flgN,Class 3
motA,Class 3
motB,Class 3
cheA,Class 3
cheW,Class 3
cheR,Class 3
cheB,Class 3
cheY,Class 3
cheZ,Class 3
fliC,Class 3
fliD,Class 3
fliS,Class 3
fliT,Class 3
fljA,Class 3
fljB,Class 3
