Gene	Category
invA	SPI 1
invB	SPI 1
invC	SPI 1
invE	SPI 1
invG	SPI 1
invH	SPI 1
invI	SPI 1
invJ	SPI 1
spaO	SPI 1
spaP	SPI 1
spaR	SPI 1
spaS	SPI 1
sicA	SPI 1
sicP	SPI 1
sipA	SPI 1
sipB	SPI 1
sipC	SPI 1
sipD	SPI 1
prgH	SPI 1
prgI	SPI 1
prgJ	SPI 1
prgK	SPI 1
iacP	SPI 1
sptP	SPI 1
iagB	SPI 1
hilA	SPI 1
orgA	SPI 1
spaQ	SPI 1
ssaB	SPI 2
ssaC	SPI 2
ssaD	SPI 2
ssaE	SPI 2
ssaG	SPI 2
ssaH	SPI 2
ssaJ	SPI 2
ssaK	SPI 2
ssaL	SPI 2
ssaN	SPI 2
ssaO	SPI 2
ssaP	SPI 2
ssaQ	SPI 2
ssaS	SPI 2
ssaT	SPI 2
ssaU	SPI 2
ssaV	SPI 2
sscA	SPI 2
sscB	SPI 2
sseA	SPI 2
sseB	SPI 2
sseC	SPI 2
sseD	SPI 2
sseE	SPI 2
sseF	SPI 2
sseG	SPI 2
sseJ	SPI 2
ssrA	SPI 2
ssrB	SPI 2
phoP	SPI 2
phoQ	SPI 2
