kb4022727
kb3135173
kb3140743
kb3140768
kb3147458
kb3156421
kb3163018
kb3172985
kb3176493
kb3185614
kb3192441
kb3198586
kb3205386
kb3210721
kb4013198
kb4016636
kb4015219
kb4019473
kb4022714
kb4032693
kb4025344
kb4034660
kb4038783
kb4041689
kb4052232
kb4048952
kb4053578
kb4056888
kb4075200
kb4074591
kb4088779
kb4093109
windows10.0-kb3172729-x64_bb12a14ec3891ec0a9e24edb529632263783d389
windows10.0-kb3173428-x64_52fa3686737353fae20ab55fa9c924bd90558a31
windows10.0-kb4093110-x64_253a81268d68278e5701dd6c3cc3aec6bd338b34
kb4565551
kb4495611
kb4514355
kb4532934
kb4565629
windows10.0-kb4561600-x64_43cbe47c2971765142fbaff361731416b3e8c6e4
kb4016251
kb4015583
kb4016240
kb4016871
kb4020102
kb4022725
kb4022716
kb4025342
kb4032188
kb4034674
kb4038788
kb4040724
kb4041676
kb4049370
kb4048954
kb4055254
kb4053580
kb4056891
kb4057144
kb4074592
kb4077528
kb4092077
kb4088782
kb4088891
kb4093107
kb4093117
kb4103731
kb4103722
kb4284874
kb4284830
kb4338826
kb4345419
kb4338827
kb4343885
kb4343889
kb4457138
kb4457141
kb4462937
kb4462939
kb4467696
kb4467699
kb4471327
kb4483230
kb4480973
kb4480959
kb4487020
kb4487011
kb4489871
kb4489888
kb4493474
kb4493436
kb4502112
kb4499181
kb4505055
kb4499162
kb4503279
kb4503289
kb4509476
kb4507450
kb4507467
kb4512507
kb4512474
kb4516068
kb4522011
kb4516059
kb4524151
kb4520010
kb4525245
kb4530711
kb4534296
kb4537765
kb4540705
kb4550939
kb4556804
kb4561605
kb4567516
kb4565499
kb4087658
kb4093296
