kb4565552
kb4100347
kb4346084
kb4494451
kb4495616
kb4514357
kb4532936
kb4565631
windows10.0-kb4561600-x64_34484c3880d5586b365289e42553755b23df383c
windows10.0-kb4561600-x86_ba608644dedbd5ced4c1f1ebf5717efdfbd90ee2
kb4565489
