ndp3
ndp45-
ofc\
o2k\
oxp\
o2k3\
o2k7\
o2k10\
o2k13\
o2k16\
w2k\
wxp\
w2k3\
w60\
w61\
w62\
w63\
w100\
x86-glb\
o2k7-x64\
w2k3-x64\
w60-x64\
w61-x64\
w62-x64\
w100-x64\
dotnetfx35
MSEInstall
.au3
.cpp
