squash4: xzio gzio lzopio fshelp
search_fs_uuid:
legacycfg: gcry_md5 crypto password normal
date: datetime normal
bfs: fshelp
gcry_twofish: crypto
cpio_be: archelp
priority_queue:
gcry_rijndael: crypto
echo:
cpio: archelp
xzio: crypto
part_sun:
hfspluscomp: gzio hfsplus
gcry_sha512: crypto
gcry_cast5: crypto
ctz_test: functional_test
setjmp_test: setjmp functional_test
odc: archelp
ls: normal
gzio:
video:
test_blockarg: normal
gfxterm: video font
mul_test: functional_test
gcry_tiger: crypto
gcry_serpent: crypto
macbless: disk
gcry_blowfish: crypto
trig:
videoinfo: video
testspeed: normal
minix:
xnu_uuid: gcry_md5
reboot:
help: normal
part_msdos:
http: net
gcry_rsa: mpi verify
blocklist:
probe:
pbkdf2: crypto
gcry_rfc2268: crypto
ufs1_be:
gcry_camellia: crypto
fat: fshelp
exfctest: functional_test
parttool: normal
lzopio: crypto
linux: elf relocator file
gcry_md4: crypto
zfsinfo: zfs
gcry_md5: crypto
fshelp:
datetime: normal
bitmap_scale: bitmap
syslinuxcfg: normal
net: priority_queue datetime bufio
gcry_des: crypto
div_test: div functional_test
time:
reiserfs: fshelp
dm_nv: diskfilter
datehook: datetime normal
mdraid09_be: diskfilter
cmp_test: functional_test
backtrace:
kernel:
part_plan:
gcry_seed: crypto
minix_be:
crypto:
video_colors:
test:
terminal:
part_dvh:
jpeg: bufio bitmap
memdisk:
gfxmenu: video gfxterm trig bitmap_scale video_colors bitmap normal font
cmp:
xfs: fshelp
elf:
div:
cpuid:
affs: fshelp
videotest: video gfxmenu font
tr:
testload:
relocator:
gfxterm_menu: video_fb functional_test procfs normal font
cbfs: archelp
adler32: crypto
progress: normal
password: crypto normal
part_sunpc:
video_fb:
tftp: priority_queue net
sleep: normal
search_fs_file:
gcry_sha256: crypto
gcry_rmd160: crypto
exfat: fshelp
search: search_fs_uuid search_fs_file search_label
mdraid09: diskfilter
mpi: crypto
memrw:
password_pbkdf2: gcry_sha512 pbkdf2 crypto normal
mdraid1x: diskfilter
gcry_crc: crypto
configfile: normal
zfscrypt: gcry_rijndael pbkdf2 crypto zfs gcry_sha1
signature_test: functional_test procfs
raid5rec: diskfilter
gcry_arcfour: crypto
part_dfly:
minix2_be:
gettext:
pbkdf2_test: pbkdf2 gcry_sha1 functional_test
hello:
hashsum: crypto normal
xnu_uuid_test: functional_test
regexp: normal
part_gpt:
gptsync: disk
zfs: gzio
part_apple:
bufio:
btrfs: gzio lzopio
bitmap:
true:
romfs: fshelp
ntfscomp: ntfs
hfs: fshelp
gcry_dsa: mpi verify
cmdline_cat_test: video_fb functional_test procfs normal font
ufs1:
offsetio:
legacy_password_test: legacycfg functional_test
setjmp:
ufs2:
nilfs2: fshelp
lsmmap:
gcry_sha1: crypto
tar: archelp
png: bufio bitmap
hfsplus: fshelp
tga: bufio bitmap
minix2:
scsi:
minix3:
lvm: diskfilter
functional_test: video video_fb btrfs
eval: normal
lsxen:
iso9660: fshelp
crc64: crypto
udf: fshelp
search_label:
raid6rec: diskfilter
msdospart: parttool disk
archelp:
procfs: archelp
minix3_be:
halt:
read:
keystatus:
cryptodisk: crypto procfs
shift_test: functional_test
normal: crypto terminal gettext bufio
geli: gcry_sha512 pbkdf2 crypto gcry_sha256 cryptodisk
gcry_idea: crypto
bswap_test: functional_test
verify: crypto mpi gcry_sha1
sfs: fshelp
part_amiga:
luks: pbkdf2 crypto cryptodisk
loopback:
jfs:
gfxterm_background: gfxterm video bitmap_scale video_colors bitmap
part_acorn:
newc: archelp
macho:
cat:
afs: fshelp
sleep_test: datetime functional_test
ldm: part_msdos part_gpt diskfilter
hexdump:
disk:
minicmd:
loadenv: disk
gcry_whirlpool: crypto
part_bsd: part_msdos
font: video bufio
ext2: fshelp
diskfilter:
videotest_checksum: video_fb functional_test font
file: elf offsetio macho
ntfs: fshelp
all_video:
