[
  {
    "id": "dataset_1345",
    "score": 0.8532,
    "metadata": {
      "title": "ACMC",
      "description": "Average cloudiness midnight to midnight from 30-second ceilometer data (percent)",
      "url": "https://www1.ncdc.noaa.gov/pub/data/ghcn/daily/readme.txt",
      "keywords": [
        "Average",
        "cloudiness",
        "midnight",
        "to",
        "midnight",
        "from",
        "30-second",
        "ceilometer",
        "data"
      ],
      "provenance": {
        "source": "noaa.org"
      },
      "materialization": {
        "python_path": "noaa_materializer",
        "arguments": {
          "type": "ACMC",
          "token": "QoCwZxSlvRuUHcKhflbujnBSOFhHvZoS"
        }
      }
    },
    "augmentation": {
      "type": "join",
      "left_columns": [
        [0],
        [4, 5]
      ],
      "right_columns": [
        [0],
        [7]
      ]
    }
  }
]
