0.0014540546809761468
-0.0058287223975933555
0.001835000248303742
-0.004582273546149707
-0.00657102398894871
0.0013928563854245235
-0.0011295568667580858
-0.002215403634845403
0.003001877443477685
0.0020970061509260063
-0.0007061426135526183
-0.007665541974431922
0.002464310224911559
-0.005113151049781051
-0.000194031878856471
0.0039638485556076075
-0.009304459565069645
0.0011840256984285702
0.0038040767968623435
-0.00020912238485593093
