2.0013189069994897
2.002810092024173
2.004296941038143
2.0043164585439714
2.0029114727576607
1.9932585033618637
1.997788717889411
2.0063611377475756
2.0026312226732275
2.0083888507825574
1.9934964702594529
2.00859956841142
1.9930091650657238
2.007679646706623
2.0067577993094226
1.9924680179979979
2.00669453545098
1.9907517190850799
1.9940971045824107
1.9929712595059828
