1.992492e+00
1.998093e+00
2.002897e+00
1.997201e+00
2.005205e+00
2.007375e+00
1.990510e+00
2.005493e+00
2.004939e+00
2.005243e+00
2.009891e+00
2.003397e+00
1.999264e+00
1.998804e+00
2.008610e+00
2.007225e+00
1.991651e+00
2.006574e+00
1.990780e+00
1.996064e+00
