9.992969052321666323e-01 1.000000000000000000e+00
1.003805005995366484e+00 1.000833333333333242e+00
1.004416801904583378e+00 1.002499999999999947e+00
1.002316474140334090e+00 1.000000000000000000e+00
9.960475476923377203e-01 9.975000000000000533e-01
9.993848127891166166e-01 1.000000000000000000e+00
9.976596006059342825e-01 1.000000000000000000e+00
9.958947127845080294e-01 9.966666666666667007e-01
1.003005195337580480e+00 1.003333333333333410e+00
1.002617987717176140e+00 1.003333333333333410e+00
1.003941096544157530e+00 1.002499999999999947e+00
1.002604287562833818e+00 1.001666666666666705e+00
9.969449598211468366e-01 9.966666666666667007e-01
9.973143218626310258e-01 9.983333333333332948e-01
9.969050184308905216e-01 9.983333333333332948e-01
9.977553190790793280e-01 1.000833333333333242e+00
1.002721585464659837e+00 1.002499999999999947e+00
9.986199917795501868e-01 1.000833333333333242e+00
1.003927545006988886e+00 1.001666666666666705e+00
1.004463711909145740e+00 1.003333333333333410e+00
