-4.449782e-03
-1.496632e-03
-7.245035e-03
-4.040280e-03
-6.662690e-04
-1.778030e-03
6.599265e-03
7.395390e-03
-2.332490e-03
9.440805e-04
4.830854e-03
-3.729922e-03
2.203698e-03
-2.269549e-03
1.088479e-03
5.461450e-03
7.768995e-03
-7.031040e-03
4.570844e-03
2.519740e-03
