1.004282104877465054e+00 1.002499999999999947e+00
9.962051377488757575e-01 9.975000000000000533e-01
9.970162290117373649e-01 1.000833333333333242e+00
9.966004120244786879e-01 9.975000000000000533e-01
9.985054438167729751e-01 9.991666666666666474e-01
1.003622741507266491e+00 9.991666666666666474e-01
9.989372525432738126e-01 9.991666666666666474e-01
9.998928041833730074e-01 9.991666666666666474e-01
1.003699572209036051e+00 9.991666666666666474e-01
9.950895359962945719e-01 9.991666666666666474e-01
9.957462149149680641e-01 9.991666666666666474e-01
9.963979334294393864e-01 9.991666666666666474e-01
1.001275340072184772e+00 9.991666666666666474e-01
1.001370634750914812e+00 9.991666666666666474e-01
9.961226791415592752e-01 9.991666666666666474e-01
1.004950465672222126e+00 9.991666666666666474e-01
1.002767079833958519e+00 9.991666666666666474e-01
9.960155472762172169e-01 9.991666666666666474e-01
1.001863621329033505e+00 9.991666666666666474e-01
1.004682993575963801e+00 9.991666666666666474e-01
