0.000943207633479104
-0.0015554664483028446
-0.0036701150636997415
-0.0013475706725509795
-0.0050622012746434075
0.00411804751132927
0.004147058681762239
-0.008172326360325277
0.003954404098224451
0.002361127623492054
-0.0037747701203784123
-0.007631012896044065
0.003456101582972826
-0.0040506756979195035
0.0026057214205943424
0.004731805447140025
-0.00575029519299064
0.0014656109087054503
0.005999050993991117
-0.0016982828335310174
