0.005631287413965236
0.0016004889538676625
0.007534811370900174
-0.00010754120784262078
0.0048551280314619305
-0.0037625827433989123
0.002461925057586356
-0.007379571083750203
-0.001750241932047647
-0.00417928163839798
0.004418863472586021
-0.004390327803121874
0.0048554257898997255
0.005765325590655568
-0.0012067099037024187
-0.005466365992079503
-0.003086026225126881
-0.002797584709925083
-0.005473837407941606
0.003998947313393675
