9.982178e-01
1.004289e+00
9.972850e-01
1.001613e+00
1.002403e+00
1.000742e+00
9.990148e-01
9.965471e-01
1.001721e+00
1.002324e+00
1.003020e+00
1.002960e+00
9.995102e-01
9.986481e-01
9.992000e-01
9.962774e-01
9.960216e-01
9.972686e-01
9.990480e-01
1.004924e+00
