9.992571e-01
1.002260e+00
1.001437e+00
1.001802e+00
1.004255e+00
9.964571e-01
1.004703e+00
9.956775e-01
9.977927e-01
9.979054e-01
9.999595e-01
1.001197e+00
9.966919e-01
9.989005e-01
1.002625e+00
9.972782e-01
1.000146e+00
9.954732e-01
1.003824e+00
9.992448e-01
