1.0028928746149095
0.9997165676915254
0.9966634465631765
1.0022058127626068
0.9968827101581302
0.9971163158964372
1.0014584851952297
0.9998607299692754
0.9961190428991223
0.9957740377684061
0.9975452599799013
1.0020528499263188
1.0016211071595134
1.0002609647255278
1.002926445488767
1.0044069256503565
1.001773575352575
1.0006377370272281
1.0018715285704896
1.004763895120161
