1.994392e+00
1.997356e+00
2.002343e+00
1.997738e+00
1.991351e+00
1.992055e+00
1.999308e+00
1.999724e+00
2.005301e+00
1.990752e+00
1.994926e+00
1.990560e+00
2.001989e+00
2.000196e+00
1.991287e+00
2.008241e+00
2.006114e+00
1.990786e+00
2.003918e+00
1.992341e+00
