1.003602e+00
1.004888e+00
1.003614e+00
1.003085e+00
1.003615e+00
1.002297e+00
1.001019e+00
1.002989e+00
9.998488e-01
1.000446e+00
1.003333e+00
1.004750e+00
1.003979e+00
1.004771e+00
9.964876e-01
1.000706e+00
1.000813e+00
1.001006e+00
1.003240e+00
1.003516e+00
