9.982178256374766301e-01 9.983333333333332948e-01
1.004289016896487086e+00 1.004999999999999893e+00
9.972850029028724750e-01 9.991666666666666474e-01
1.001613218713315989e+00 1.002499999999999947e+00
1.002403499378925700e+00 1.002499999999999947e+00
1.000742453152114297e+00 1.002499999999999947e+00
9.990148346568169524e-01 1.002499999999999947e+00
9.965470757148569003e-01 1.002499999999999947e+00
1.001720603089731654e+00 1.002499999999999947e+00
1.002324398569347963e+00 1.002499999999999947e+00
1.003020001208135836e+00 1.002499999999999947e+00
1.002960118732650674e+00 1.002499999999999947e+00
9.995102328753863175e-01 1.002499999999999947e+00
9.986481199779978501e-01 1.002499999999999947e+00
9.992000392209609005e-01 1.002499999999999947e+00
9.962773685099726162e-01 1.002499999999999947e+00
9.960216010209420601e-01 1.002499999999999947e+00
9.972685676072853278e-01 1.002499999999999947e+00
9.990480397000871537e-01 1.002499999999999947e+00
1.004923547811924944e+00 1.002499999999999947e+00
