2.009055000000000035e+00 2.002223253250122070e+00
2.009945999999999788e+00 2.002324342727661133e+00
1.999624000000000068e+00 1.999964833259582520e+00
2.008542999999999967e+00 2.004209041595458984e+00
1.991408999999999985e+00 1.997562289237976074e+00
1.990456999999999921e+00 1.996968626976013184e+00
2.007067000000000156e+00 2.006449937820434570e+00
2.006266999999999801e+00 2.006786108016967773e+00
1.999130999999999991e+00 1.995861768722534180e+00
2.002975999999999868e+00 2.002471446990966797e+00
1.994893999999999945e+00 1.999483346939086914e+00
1.992153999999999980e+00 1.990136265754699707e+00
1.999532000000000087e+00 2.002407073974609375e+00
2.008462000000000192e+00 2.004993438720703125e+00
2.005411000000000055e+00 2.002549409866333008e+00
2.008176999999999879e+00 2.005364656448364258e+00
1.990358999999999989e+00 1.997340917587280273e+00
1.993344000000000005e+00 1.990385890007019043e+00
2.000939999999999941e+00 1.994516611099243164e+00
2.008521000000000001e+00 2.005529403686523438e+00
