2.005471e+00
1.997328e+00
2.009072e+00
2.007158e+00
1.990576e+00
1.996710e+00
2.006621e+00
1.993880e+00
1.998348e+00
1.991268e+00
1.995339e+00
1.997835e+00
1.994888e+00
2.008135e+00
1.996211e+00
2.008347e+00
1.994782e+00
2.007520e+00
1.994729e+00
1.991168e+00
