1.997675e+00
1.999086e+00
2.000290e+00
2.004665e+00
2.001564e+00
2.009384e+00
2.001761e+00
1.990917e+00
1.990714e+00
2.008476e+00
1.994681e+00
1.994428e+00
1.998128e+00
1.995723e+00
2.006070e+00
1.996823e+00
2.002105e+00
1.996339e+00
1.992963e+00
2.001579e+00
