9.969012762019803242e-01 9.974315166473388672e-01
9.957325678089432586e-01 9.974084496498107910e-01
1.000940842315775514e+00 1.001570105552673340e+00
1.001222058694385852e+00 1.000744700431823730e+00
1.003259183762185591e+00 1.002436518669128418e+00
1.003917568602344268e+00 1.000818133354187012e+00
1.003524946078513613e+00 1.004110217094421387e+00
9.978412726454511938e-01 9.985646009445190430e-01
9.953677161386740302e-01 9.978150129318237305e-01
1.001086978347347722e+00 1.001654148101806641e+00
9.956823121909667007e-01 9.966517686843872070e-01
1.001467916308289352e+00 1.002261757850646973e+00
1.000881730973899764e+00 1.000096678733825684e+00
9.951939006045357194e-01 9.956354498863220215e-01
1.003869914686393416e+00 1.003987669944763184e+00
9.978708059691044907e-01 9.976132512092590332e-01
9.996137393553924388e-01 9.978605508804321289e-01
1.004947495115746436e+00 1.004093527793884277e+00
9.956636514593223408e-01 9.967293739318847656e-01
1.004084543594693013e+00 1.002519607543945312e+00
