1.000778982694988439e+00 1.001921653747558594e+00
9.955970632090537231e-01 9.970358014106750488e-01
1.003357685991708159e+00 1.003759026527404785e+00
1.002704260396366065e+00 1.001605868339538574e+00
1.004647692067223597e+00 1.003736376762390137e+00
1.004688403632195470e+00 1.004680514335632324e+00
1.003667947353620082e+00 1.002949833869934082e+00
9.985561390201971310e-01 9.989500641822814941e-01
1.002910656026603009e+00 1.002179026603698730e+00
9.980172841743689682e-01 1.000814557075500488e+00
1.003447788161588194e+00 1.003597259521484375e+00
1.003721712080365647e+00 1.001619458198547363e+00
9.999240481244600076e-01 1.000681281089782715e+00
9.999822124540846957e-01 1.000833988189697266e+00
1.003930265356139495e+00 1.002889037132263184e+00
9.975894337818225210e-01 9.970004558563232422e-01
1.001285107318410361e+00 1.002463817596435547e+00
1.003639971687386279e+00 1.002756953239440918e+00
9.984840209118884813e-01 9.978709220886230469e-01
1.000799193385153441e+00 9.997481107711791992e-01
