0.0	0.9958333333333333	0.0	0.0	0.9991666666666666	0.0	0.0	0.0
0.9958333333333333	0.0	1.0025	0.0	0.0	1.0025	0.0	0.0
0.0	1.0025	0.0	1.0	0.0	0.0	0.9975	0.0
0.0	0.0	1.0	0.0	0.0	0.0	0.0	0.995
0.9991666666666666	0.0	0.0	0.0	0.0	1.0025	0.0	0.0
0.0	1.0025	0.0	0.0	1.0025	0.0	0.9991666666666666	0.0
0.0	0.0	0.9975	0.0	0.0	0.9991666666666666	0.0	0.9991666666666666
0.0	0.0	0.0	0.995	0.0	0.0	0.9991666666666666	0.0
