3.664230231058551723e-03 4.091308917850255966e-03
-3.262866375391304530e-03 -1.239350531250238419e-03
8.016550047850623528e-03 2.666384447365999222e-03
2.240845601234053852e-03 -1.830891706049442291e-04
4.728085579921215142e-03 -7.278010016307234764e-04
-8.293082668580087358e-04 -9.473293321207165718e-04
2.379687519807660578e-03 -1.657534856349229813e-03
-5.250889592869234512e-03 -6.280336994677782059e-03
-3.993851395134861981e-03 -3.508239518851041794e-03
-2.534446076728813502e-03 -2.868206938728690147e-04
3.760497609368917971e-03 4.106373526155948639e-04
-3.090905728897253013e-03 -2.916903235018253326e-03
2.968796325991784890e-03 -1.840991899371147156e-05
2.727583312827297490e-03 -4.145395476371049881e-03
-4.080068493300781363e-03 -2.416029106825590134e-03
-3.052064054677838811e-03 -4.295733757317066193e-03
-4.907188117609706524e-03 2.976976335048675537e-03
-6.371979102139158080e-03 3.682526759803295135e-03
-5.336094474818753319e-03 -8.693628478795289993e-05
3.521961411944163345e-03 5.818973295390605927e-04
