1.002088e+00
9.974164e-01
9.995351e-01
1.000877e+00
9.992309e-01
9.998294e-01
1.001462e+00
9.974860e-01
1.003610e+00
9.960684e-01
9.988246e-01
9.952681e-01
1.000210e+00
1.002183e+00
1.000645e+00
9.980553e-01
1.001788e+00
9.980444e-01
9.993541e-01
9.970813e-01
