9.962923043776558130e-01 9.949999999999999956e-01
1.003225120248709690e+00 1.004999999999999893e+00
9.962284288016878264e-01 9.983333333333332948e-01
1.000391884810865051e+00 1.002499999999999947e+00
9.958937369449446519e-01 9.949999999999999956e-01
9.951198435831635214e-01 9.949999999999999956e-01
9.965183085068020086e-01 9.949999999999999956e-01
1.001114756798423100e+00 1.000833333333333242e+00
9.984106045772092042e-01 9.991666666666666474e-01
9.973641544713123253e-01 9.966666666666667007e-01
1.001812445454299372e+00 1.004166666666666652e+00
9.965166224487133073e-01 9.966666666666667007e-01
1.004870986273781019e+00 1.004166666666666652e+00
1.004249534037298108e+00 1.003333333333333410e+00
9.959873508630351369e-01 9.958333333333333481e-01
1.004398710183798560e+00 1.002499999999999947e+00
1.001753100918603590e+00 1.000833333333333242e+00
1.003706423112669555e+00 1.001666666666666705e+00
9.979009619678368415e-01 9.983333333333332948e-01
1.004651598908206100e+00 1.004999999999999893e+00
