2.000627550232438
1.9944241172792145
1.9948961933627845
1.995106973835875
2.0092373548668534
2.0087683407629244
1.9932783938657113
2.0031158923805306
2.0081891469444773
1.998135676098898
1.990949506961434
2.0053875047875462
2.0030821690288656
1.9917653994682794
2.0029113665973926
1.9958614279379923
2.0092802596000734
1.9913276147075236
2.0003067390508837
2.0097813614405347
