1.9934037545780423
2.002977883241606
1.9953014328474612
1.9980306523151043
2.008818255770826
1.998794889759511
1.9911917465122122
2.0086350300849474
1.9961580264357552
1.9939642632352823
1.9960555759662817
1.9960853832819576
2.006300463616599
1.9958221275649293
2.0018371002023474
2.0072079798175815
2.0042221915893017
2.00319001786977
1.9976832285533959
1.9938590369075961
