1.000689704895224352e+00 1.000000000000000000e+00
9.971337758954167407e-01 9.983333333333332948e-01
1.001409449663038576e+00 1.001666666666666705e+00
9.993566453799149762e-01 9.966666666666667007e-01
1.004527277981881017e+00 1.003333333333333410e+00
1.003398456177746256e+00 1.003333333333333410e+00
9.986998110499279990e-01 9.983333333333332948e-01
1.002073046447885085e+00 1.000833333333333242e+00
1.001735188376533525e+00 1.000833333333333242e+00
9.987590113757400800e-01 9.991666666666666474e-01
1.000308952877445368e+00 1.001666666666666705e+00
1.001257813429193178e+00 9.991666666666666474e-01
9.995557553595508793e-01 1.000000000000000000e+00
1.003641682978098082e+00 1.001666666666666705e+00
9.984294941711449045e-01 1.000833333333333242e+00
9.973880628797274772e-01 9.975000000000000533e-01
1.004450421553030326e+00 1.004999999999999893e+00
9.989194344651536328e-01 9.983333333333332948e-01
1.000211378326314904e+00 1.000833333333333242e+00
1.004597715282235182e+00 1.004999999999999893e+00
