[
  	{
  		"_key": "1",
		"_from": "1",
		"_to": "1"
	},
	{
		"_key": "2",
		"_from": "2",
		"_to": "2"
	},
	{
		"_key": "3",
		"_from": "3",
		"_to": "3"
	},
	{
		"_key": "4",
		"_from": "4",
		"_to": "4"
	},
	{
		"_key": "5",
		"_from": "5",
		"_to": "5"
	},
	{
		"_key": "6",
		"_from": "6",
		"_to": "6"
	},
	{
		"_key": "7",
		"_from": "7",
		"_to": "7"
	},
	{
		"_key": "8",
		"_from": "8",
		"_to": "8"
	},
	{
		"_key": "9",
		"_from": "9",
		"_to": "9"
	},
	{
		"_key": "10",
		"_from": "10",
		"_to": "10"
	}
]