{
  "id": 215482920,
  "user": {
    "id": 2352120,
    "name": "Sylvain Desbureaux",
    "username": "sylvainOL",
    "state": "active",
    "avatar_url": "https://secure.gravatar.com/avatar/1642ef2bb4f0e481a4146b6445571cf1?s=80\u0026d=identicon",
    "web_url": "https://gitlab.com/sylvainOL",
    "status_tooltip_html": null,
    "path": "/sylvainOL"
  },
  "active": false,
  "coverage": null,
  "source": "trigger",
  "created_at": "2020-11-12T22:29:48.049Z",
  "updated_at": "2020-11-12T23:20:01.255Z",
  "path": "/Orange-OpenSource/lfn/onap/xtesting-onap/-/pipelines/215482920",
  "flags": {
    "stuck": false,
    "auto_devops": false,
    "merge_request": false,
    "yaml_errors": false,
    "retryable": false,
    "cancelable": false,
    "failure_reason": false,
    "detached_merge_request_pipeline": false,
    "merge_request_pipeline": false,
    "latest": true
  },
  "details": {
    "status": {
      "icon": "status_success",
      "text": "passed",
      "label": "passed",
      "group": "passed",
      "tooltip": "passed",
      "has_details": true,
      "details_path": "/Orange-OpenSource/lfn/onap/xtesting-onap/-/pipelines/215482920",
      "illustration": null,
      "favicon": "https://gitlab.com/assets/ci_favicons/favicon_status_failed-41304d7f7e3828808b0c26771f0309e55296819a9beea3ea9fbf6689d9857c12.png"
    },
    "stages": [
      {
        "name": "prepare",
        "title": "prepare: passed",
        "groups": [
          {
            "name": "prepare",
            "size": 1,
            "status": {
              "icon": "status_success",
              "text": "passed",
              "label": "passed",
              "group": "success",
              "tooltip": "passed",
              "has_details": true,
              "details_path": "/Orange-OpenSource/lfn/onap/xtesting-onap/-/jobs/846752609",
              "illustration": {
                "image": "https://assets.gitlab-static.net/assets/illustrations/skipped-job_empty-29a8a37d8a61d1b6f68cf3484f9024e53cd6eb95e28eae3554f8011a1146bf27.svg",
                "size": "svg-430",
                "title": "This job does not have a trace."
              },
              "favicon": "https://gitlab.com/assets/ci_favicons/favicon_status_success-8451333011eee8ce9f2ab25dc487fe24a8758c694827a582f17f42b0a90446a2.png"
            },
            "jobs": [
              {
                "id": 846752609,
                "name": "prepare",
                "started": "2020-11-12T22:29:51.328Z",
                "archived": false,
                "build_path": "/Orange-OpenSource/lfn/onap/xtesting-onap/-/jobs/846752609",
                "playable": false,
                "scheduled": false,
                "created_at": "2020-11-12T22:29:48.068Z",
                "updated_at": "2020-11-12T22:30:55.965Z",
                "status": {
                  "icon": "status_success",
                  "text": "passed",
                  "label": "passed",
                  "group": "success",
                  "tooltip": "passed",
                  "has_details": true,
                  "details_path": "/Orange-OpenSource/lfn/onap/xtesting-onap/-/jobs/846752609",
                  "illustration": {
                    "image": "https://assets.gitlab-static.net/assets/illustrations/skipped-job_empty-29a8a37d8a61d1b6f68cf3484f9024e53cd6eb95e28eae3554f8011a1146bf27.svg",
                    "size": "svg-430",
                    "title": "This job does not have a trace."
                  },
                  "favicon": "https://gitlab.com/assets/ci_favicons/favicon_status_success-8451333011eee8ce9f2ab25dc487fe24a8758c694827a582f17f42b0a90446a2.png"
                }
              }
            ]
          }
        ],
        "status": {
          "icon": "status_success",
          "text": "passed",
          "label": "passed",
          "group": "success",
          "tooltip": "passed",
          "has_details": true,
          "details_path": "/Orange-OpenSource/lfn/onap/xtesting-onap/-/pipelines/215482920#prepare",
          "illustration": null,
          "favicon": "https://gitlab.com/assets/ci_favicons/favicon_status_success-8451333011eee8ce9f2ab25dc487fe24a8758c694827a582f17f42b0a90446a2.png"
        },
        "path": "/Orange-OpenSource/lfn/onap/xtesting-onap/-/pipelines/215482920#prepare",
        "dropdown_path": "/Orange-OpenSource/lfn/onap/xtesting-onap/-/pipelines/215482920/stage.json?stage=prepare"
      },
      {
        "name": "infrastructure-healthcheck",
        "title": "infrastructure-healthcheck: passed with warnings",
        "groups": [
          {
            "name": "infrastructure_healthcheck",
            "size": 1,
            "status": {
              "icon": "status_warning",
              "text": "failed",
              "label": "failed (allowed to fail)",
              "group": "failed-with-warnings",
              "tooltip": "failed - (script failure) (allowed to fail)",
              "has_details": true,
              "details_path": "/Orange-OpenSource/lfn/onap/xtesting-onap/-/jobs/846752612",
              "illustration": {
                "image": "https://assets.gitlab-static.net/assets/illustrations/skipped-job_empty-29a8a37d8a61d1b6f68cf3484f9024e53cd6eb95e28eae3554f8011a1146bf27.svg",
                "size": "svg-430",
                "title": "This job does not have a trace."
              },
              "favicon": "https://gitlab.com/assets/ci_favicons/favicon_status_failed-41304d7f7e3828808b0c26771f0309e55296819a9beea3ea9fbf6689d9857c12.png"
            },
            "jobs": [
              {
                "id": 846752612,
                "name": "infrastructure_healthcheck",
                "started": "2020-11-12T22:30:59.967Z",
                "archived": false,
                "build_path": "/Orange-OpenSource/lfn/onap/xtesting-onap/-/jobs/846752612",
                "playable": false,
                "scheduled": false,
                "created_at": "2020-11-12T22:29:48.094Z",
                "updated_at": "2020-11-12T22:33:32.121Z",
                "status": {
                  "icon": "status_warning",
                  "text": "failed",
                  "label": "failed (allowed to fail)",
                  "group": "failed-with-warnings",
                  "tooltip": "failed - (script failure) (allowed to fail)",
                  "has_details": true,
                  "details_path": "/Orange-OpenSource/lfn/onap/xtesting-onap/-/jobs/846752612",
                  "illustration": {
                    "image": "https://assets.gitlab-static.net/assets/illustrations/skipped-job_empty-29a8a37d8a61d1b6f68cf3484f9024e53cd6eb95e28eae3554f8011a1146bf27.svg",
                    "size": "svg-430",
                    "title": "This job does not have a trace."
                  },
                  "favicon": "https://gitlab.com/assets/ci_favicons/favicon_status_failed-41304d7f7e3828808b0c26771f0309e55296819a9beea3ea9fbf6689d9857c12.png"
                },
                "recoverable": false
              }
            ]
          }
        ],
        "status": {
          "icon": "status_warning",
          "text": "passed",
          "label": "passed with warnings",
          "group": "success-with-warnings",
          "tooltip": "passed",
          "has_details": true,
          "details_path": "/Orange-OpenSource/lfn/onap/xtesting-onap/-/pipelines/215482920#infrastructure-healthcheck",
          "illustration": null,
          "favicon": "https://gitlab.com/assets/ci_favicons/favicon_status_success-8451333011eee8ce9f2ab25dc487fe24a8758c694827a582f17f42b0a90446a2.png"
        },
        "path": "/Orange-OpenSource/lfn/onap/xtesting-onap/-/pipelines/215482920#infrastructure-healthcheck",
        "dropdown_path": "/Orange-OpenSource/lfn/onap/xtesting-onap/-/pipelines/215482920/stage.json?stage=infrastructure-healthcheck"
      },
      {
        "name": "healthcheck",
        "title": "healthcheck: passed with warnings",
        "groups": [
          {
            "name": "core",
            "size": 1,
            "status": {
              "icon": "status_warning",
              "text": "failed",
              "label": "failed (allowed to fail)",
              "group": "failed-with-warnings",
              "tooltip": "failed - (script failure) (allowed to fail)",
              "has_details": true,
              "details_path": "/Orange-OpenSource/lfn/onap/xtesting-onap/-/jobs/846752615",
              "illustration": {
                "image": "https://assets.gitlab-static.net/assets/illustrations/skipped-job_empty-29a8a37d8a61d1b6f68cf3484f9024e53cd6eb95e28eae3554f8011a1146bf27.svg",
                "size": "svg-430",
                "title": "This job does not have a trace."
              },
              "favicon": "https://gitlab.com/assets/ci_favicons/favicon_status_failed-41304d7f7e3828808b0c26771f0309e55296819a9beea3ea9fbf6689d9857c12.png"
            },
            "jobs": [
              {
                "id": 846752615,
                "name": "core",
                "started": "2020-11-12T22:33:34.013Z",
                "archived": false,
                "build_path": "/Orange-OpenSource/lfn/onap/xtesting-onap/-/jobs/846752615",
                "playable": false,
                "scheduled": false,
                "created_at": "2020-11-12T22:29:48.124Z",
                "updated_at": "2020-11-12T22:35:46.497Z",
                "status": {
                  "icon": "status_warning",
                  "text": "failed",
                  "label": "failed (allowed to fail)",
                  "group": "failed-with-warnings",
                  "tooltip": "failed - (script failure) (allowed to fail)",
                  "has_details": true,
                  "details_path": "/Orange-OpenSource/lfn/onap/xtesting-onap/-/jobs/846752615",
                  "illustration": {
                    "image": "https://assets.gitlab-static.net/assets/illustrations/skipped-job_empty-29a8a37d8a61d1b6f68cf3484f9024e53cd6eb95e28eae3554f8011a1146bf27.svg",
                    "size": "svg-430",
                    "title": "This job does not have a trace."
                  },
                  "favicon": "https://gitlab.com/assets/ci_favicons/favicon_status_failed-41304d7f7e3828808b0c26771f0309e55296819a9beea3ea9fbf6689d9857c12.png"
                },
                "recoverable": false
              }
            ]
          },
          {
            "name": "full",
            "size": 1,
            "status": {
              "icon": "status_warning",
              "text": "failed",
              "label": "failed (allowed to fail)",
              "group": "failed-with-warnings",
              "tooltip": "failed - (script failure) (allowed to fail)",
              "has_details": true,
              "details_path": "/Orange-OpenSource/lfn/onap/xtesting-onap/-/jobs/846752617",
              "illustration": {
                "image": "https://assets.gitlab-static.net/assets/illustrations/skipped-job_empty-29a8a37d8a61d1b6f68cf3484f9024e53cd6eb95e28eae3554f8011a1146bf27.svg",
                "size": "svg-430",
                "title": "This job does not have a trace."
              },
              "favicon": "https://gitlab.com/assets/ci_favicons/favicon_status_failed-41304d7f7e3828808b0c26771f0309e55296819a9beea3ea9fbf6689d9857c12.png"
            },
            "jobs": [
              {
                "id": 846752617,
                "name": "full",
                "started": "2020-11-12T22:33:35.289Z",
                "archived": false,
                "build_path": "/Orange-OpenSource/lfn/onap/xtesting-onap/-/jobs/846752617",
                "playable": false,
                "scheduled": false,
                "created_at": "2020-11-12T22:29:48.146Z",
                "updated_at": "2020-11-12T22:38:13.353Z",
                "status": {
                  "icon": "status_warning",
                  "text": "failed",
                  "label": "failed (allowed to fail)",
                  "group": "failed-with-warnings",
                  "tooltip": "failed - (script failure) (allowed to fail)",
                  "has_details": true,
                  "details_path": "/Orange-OpenSource/lfn/onap/xtesting-onap/-/jobs/846752617",
                  "illustration": {
                    "image": "https://assets.gitlab-static.net/assets/illustrations/skipped-job_empty-29a8a37d8a61d1b6f68cf3484f9024e53cd6eb95e28eae3554f8011a1146bf27.svg",
                    "size": "svg-430",
                    "title": "This job does not have a trace."
                  },
                  "favicon": "https://gitlab.com/assets/ci_favicons/favicon_status_failed-41304d7f7e3828808b0c26771f0309e55296819a9beea3ea9fbf6689d9857c12.png"
                },
                "recoverable": false
              }
            ]
          },
          {
            "name": "healthdist",
            "size": 1,
            "status": {
              "icon": "status_warning",
              "text": "failed",
              "label": "failed (allowed to fail)",
              "group": "failed-with-warnings",
              "tooltip": "failed - (script failure) (allowed to fail)",
              "has_details": true,
              "details_path": "/Orange-OpenSource/lfn/onap/xtesting-onap/-/jobs/846752620",
              "illustration": {
                "image": "https://assets.gitlab-static.net/assets/illustrations/skipped-job_empty-29a8a37d8a61d1b6f68cf3484f9024e53cd6eb95e28eae3554f8011a1146bf27.svg",
                "size": "svg-430",
                "title": "This job does not have a trace."
              },
              "favicon": "https://gitlab.com/assets/ci_favicons/favicon_status_failed-41304d7f7e3828808b0c26771f0309e55296819a9beea3ea9fbf6689d9857c12.png"
            },
            "jobs": [
              {
                "id": 846752620,
                "name": "healthdist",
                "started": "2020-11-12T22:33:35.912Z",
                "archived": false,
                "build_path": "/Orange-OpenSource/lfn/onap/xtesting-onap/-/jobs/846752620",
                "playable": false,
                "scheduled": false,
                "created_at": "2020-11-12T22:29:48.171Z",
                "updated_at": "2020-11-12T22:36:22.863Z",
                "status": {
                  "icon": "status_warning",
                  "text": "failed",
                  "label": "failed (allowed to fail)",
                  "group": "failed-with-warnings",
                  "tooltip": "failed - (script failure) (allowed to fail)",
                  "has_details": true,
                  "details_path": "/Orange-OpenSource/lfn/onap/xtesting-onap/-/jobs/846752620",
                  "illustration": {
                    "image": "https://assets.gitlab-static.net/assets/illustrations/skipped-job_empty-29a8a37d8a61d1b6f68cf3484f9024e53cd6eb95e28eae3554f8011a1146bf27.svg",
                    "size": "svg-430",
                    "title": "This job does not have a trace."
                  },
                  "favicon": "https://gitlab.com/assets/ci_favicons/favicon_status_failed-41304d7f7e3828808b0c26771f0309e55296819a9beea3ea9fbf6689d9857c12.png"
                },
                "recoverable": false
              }
            ]
          },
          {
            "name": "postinstall",
            "size": 1,
            "status": {
              "icon": "status_success",
              "text": "passed",
              "label": "passed",
              "group": "success",
              "tooltip": "passed",
              "has_details": true,
              "details_path": "/Orange-OpenSource/lfn/onap/xtesting-onap/-/jobs/846752621",
              "illustration": {
                "image": "https://assets.gitlab-static.net/assets/illustrations/skipped-job_empty-29a8a37d8a61d1b6f68cf3484f9024e53cd6eb95e28eae3554f8011a1146bf27.svg",
                "size": "svg-430",
                "title": "This job does not have a trace."
              },
              "favicon": "https://gitlab.com/assets/ci_favicons/favicon_status_success-8451333011eee8ce9f2ab25dc487fe24a8758c694827a582f17f42b0a90446a2.png"
            },
            "jobs": [
              {
                "id": 846752621,
                "name": "postinstall",
                "started": "2020-11-12T22:33:36.195Z",
                "archived": false,
                "build_path": "/Orange-OpenSource/lfn/onap/xtesting-onap/-/jobs/846752621",
                "playable": false,
                "scheduled": false,
                "created_at": "2020-11-12T22:29:48.192Z",
                "updated_at": "2020-11-12T22:42:22.007Z",
                "status": {
                  "icon": "status_success",
                  "text": "passed",
                  "label": "passed",
                  "group": "success",
                  "tooltip": "passed",
                  "has_details": true,
                  "details_path": "/Orange-OpenSource/lfn/onap/xtesting-onap/-/jobs/846752621",
                  "illustration": {
                    "image": "https://assets.gitlab-static.net/assets/illustrations/skipped-job_empty-29a8a37d8a61d1b6f68cf3484f9024e53cd6eb95e28eae3554f8011a1146bf27.svg",
                    "size": "svg-430",
                    "title": "This job does not have a trace."
                  },
                  "favicon": "https://gitlab.com/assets/ci_favicons/favicon_status_success-8451333011eee8ce9f2ab25dc487fe24a8758c694827a582f17f42b0a90446a2.png"
                }
              }
            ]
          }
        ],
        "status": {
          "icon": "status_warning",
          "text": "passed",
          "label": "passed with warnings",
          "group": "success-with-warnings",
          "tooltip": "passed",
          "has_details": true,
          "details_path": "/Orange-OpenSource/lfn/onap/xtesting-onap/-/pipelines/215482920#healthcheck",
          "illustration": null,
          "favicon": "https://gitlab.com/assets/ci_favicons/favicon_status_success-8451333011eee8ce9f2ab25dc487fe24a8758c694827a582f17f42b0a90446a2.png"
        },
        "path": "/Orange-OpenSource/lfn/onap/xtesting-onap/-/pipelines/215482920#healthcheck",
        "dropdown_path": "/Orange-OpenSource/lfn/onap/xtesting-onap/-/pipelines/215482920/stage.json?stage=healthcheck"
      },
      {
        "name": "smoke-usecases",
        "title": "smoke-usecases: failed",
        "groups": [
          {
            "name": "5gbulkpm",
            "size": 1,
            "status": {
              "icon": "status_success",
              "text": "passed",
              "label": "passed",
              "group": "success",
              "tooltip": "passed",
              "has_details": true,
              "details_path": "/Orange-OpenSource/lfn/onap/xtesting-onap/-/jobs/846752626",
              "illustration": {
                "image": "https://assets.gitlab-static.net/assets/illustrations/skipped-job_empty-29a8a37d8a61d1b6f68cf3484f9024e53cd6eb95e28eae3554f8011a1146bf27.svg",
                "size": "svg-430",
                "title": "This job does not have a trace."
              },
              "favicon": "https://gitlab.com/assets/ci_favicons/favicon_status_success-8451333011eee8ce9f2ab25dc487fe24a8758c694827a582f17f42b0a90446a2.png"
            },
            "jobs": [
              {
                "id": 846752626,
                "name": "5gbulkpm",
                "started": "2020-11-12T22:42:25.899Z",
                "archived": false,
                "build_path": "/Orange-OpenSource/lfn/onap/xtesting-onap/-/jobs/846752626",
                "playable": false,
                "scheduled": false,
                "created_at": "2020-11-12T22:29:48.320Z",
                "updated_at": "2020-11-12T22:50:37.017Z",
                "status": {
                  "icon": "status_success",
                  "text": "passed",
                  "label": "passed",
                  "group": "success",
                  "tooltip": "passed",
                  "has_details": true,
                  "details_path": "/Orange-OpenSource/lfn/onap/xtesting-onap/-/jobs/846752626",
                  "illustration": {
                    "image": "https://assets.gitlab-static.net/assets/illustrations/skipped-job_empty-29a8a37d8a61d1b6f68cf3484f9024e53cd6eb95e28eae3554f8011a1146bf27.svg",
                    "size": "svg-430",
                    "title": "This job does not have a trace."
                  },
                  "favicon": "https://gitlab.com/assets/ci_favicons/favicon_status_success-8451333011eee8ce9f2ab25dc487fe24a8758c694827a582f17f42b0a90446a2.png"
                }
              }
            ]
          },
          {
            "name": "basic_cnf",
            "size": 1,
            "status": {
              "icon": "status_success",
              "text": "passed",
              "label": "passed",
              "group": "success",
              "tooltip": "passed",
              "has_details": true,
              "details_path": "/Orange-OpenSource/lfn/onap/xtesting-onap/-/jobs/846752624",
              "illustration": {
                "image": "https://assets.gitlab-static.net/assets/illustrations/skipped-job_empty-29a8a37d8a61d1b6f68cf3484f9024e53cd6eb95e28eae3554f8011a1146bf27.svg",
                "size": "svg-430",
                "title": "This job does not have a trace."
              },
              "favicon": "https://gitlab.com/assets/ci_favicons/favicon_status_failed-41304d7f7e3828808b0c26771f0309e55296819a9beea3ea9fbf6689d9857c12.png"
            },
            "jobs": [
              {
                "id": 846752624,
                "name": "basic_cnf",
                "started": "2020-11-12T22:42:24.532Z",
                "archived": false,
                "build_path": "/Orange-OpenSource/lfn/onap/xtesting-onap/-/jobs/846752624",
                "playable": false,
                "scheduled": false,
                "created_at": "2020-11-12T22:29:48.277Z",
                "updated_at": "2020-11-12T22:43:16.651Z",
                "status": {
                  "icon": "status_success",
                  "text": "passed",
                  "label": "passed",
                  "group": "success",
                  "tooltip": "passed",
                  "has_details": true,
                  "details_path": "/Orange-OpenSource/lfn/onap/xtesting-onap/-/jobs/846752624",
                  "illustration": {
                    "image": "https://assets.gitlab-static.net/assets/illustrations/skipped-job_empty-29a8a37d8a61d1b6f68cf3484f9024e53cd6eb95e28eae3554f8011a1146bf27.svg",
                    "size": "svg-430",
                    "title": "This job does not have a trace."
                  },
                  "favicon": "https://gitlab.com/assets/ci_favicons/favicon_status_failed-41304d7f7e3828808b0c26771f0309e55296819a9beea3ea9fbf6689d9857c12.png"
                },
                "recoverable": false
              }
            ]
          },
          {
            "name": "basic_network",
            "size": 1,
            "status": {
              "icon": "status_success",
              "text": "passed",
              "label": "passed",
              "group": "success",
              "tooltip": "passed",
              "has_details": true,
              "details_path": "/Orange-OpenSource/lfn/onap/xtesting-onap/-/jobs/846752623",
              "illustration": {
                "image": "https://assets.gitlab-static.net/assets/illustrations/skipped-job_empty-29a8a37d8a61d1b6f68cf3484f9024e53cd6eb95e28eae3554f8011a1146bf27.svg",
                "size": "svg-430",
                "title": "This job does not have a trace."
              },
              "favicon": "https://gitlab.com/assets/ci_favicons/favicon_status_failed-41304d7f7e3828808b0c26771f0309e55296819a9beea3ea9fbf6689d9857c12.png"
            },
            "jobs": [
              {
                "id": 846752623,
                "name": "basic_network",
                "started": "2020-11-12T22:42:24.489Z",
                "archived": false,
                "build_path": "/Orange-OpenSource/lfn/onap/xtesting-onap/-/jobs/846752623",
                "playable": false,
                "scheduled": false,
                "created_at": "2020-11-12T22:29:48.249Z",
                "updated_at": "2020-11-12T22:52:19.117Z",
                "status": {
                  "icon": "status_success",
                  "text": "passed",
                  "label": "passed",
                  "group": "success",
                  "tooltip": "passed",
                  "has_details": true,
                  "details_path": "/Orange-OpenSource/lfn/onap/xtesting-onap/-/jobs/846752623",
                  "illustration": {
                    "image": "https://assets.gitlab-static.net/assets/illustrations/skipped-job_empty-29a8a37d8a61d1b6f68cf3484f9024e53cd6eb95e28eae3554f8011a1146bf27.svg",
                    "size": "svg-430",
                    "title": "This job does not have a trace."
                  },
                  "favicon": "https://gitlab.com/assets/ci_favicons/favicon_status_failed-41304d7f7e3828808b0c26771f0309e55296819a9beea3ea9fbf6689d9857c12.png"
                },
                "recoverable": false
              }
            ]
          },
          {
            "name": "cmpv2",
            "size": 1,
            "status": {
              "icon": "status_success",
              "text": "passed",
              "label": "passed",
              "group": "success",
              "tooltip": "passed",
              "has_details": true,
              "details_path": "/Orange-OpenSource/lfn/onap/xtesting-onap/-/jobs/846752629",
              "illustration": {
                "image": "https://assets.gitlab-static.net/assets/illustrations/skipped-job_empty-29a8a37d8a61d1b6f68cf3484f9024e53cd6eb95e28eae3554f8011a1146bf27.svg",
                "size": "svg-430",
                "title": "This job does not have a trace."
              },
              "favicon": "https://gitlab.com/assets/ci_favicons/favicon_status_success-8451333011eee8ce9f2ab25dc487fe24a8758c694827a582f17f42b0a90446a2.png"
            },
            "jobs": [
              {
                "id": 846752629,
                "name": "cmpv2",
                "started": "2020-11-12T22:42:27.376Z",
                "archived": false,
                "build_path": "/Orange-OpenSource/lfn/onap/xtesting-onap/-/jobs/846752629",
                "playable": false,
                "scheduled": false,
                "created_at": "2020-11-12T22:29:48.384Z",
                "updated_at": "2020-11-12T22:58:42.028Z",
                "status": {
                  "icon": "status_success",
                  "text": "passed",
                  "label": "passed",
                  "group": "success",
                  "tooltip": "passed",
                  "has_details": true,
                  "details_path": "/Orange-OpenSource/lfn/onap/xtesting-onap/-/jobs/846752629",
                  "illustration": {
                    "image": "https://assets.gitlab-static.net/assets/illustrations/skipped-job_empty-29a8a37d8a61d1b6f68cf3484f9024e53cd6eb95e28eae3554f8011a1146bf27.svg",
                    "size": "svg-430",
                    "title": "This job does not have a trace."
                  },
                  "favicon": "https://gitlab.com/assets/ci_favicons/favicon_status_success-8451333011eee8ce9f2ab25dc487fe24a8758c694827a582f17f42b0a90446a2.png"
                }
              }
            ]
          },
          {
            "name": "hvves",
            "size": 1,
            "status": {
              "icon": "status_warning",
              "text": "failed",
              "label": "failed (allowed to fail)",
              "group": "failed-with-warnings",
              "tooltip": "failed - (script failure) (allowed to fail)",
              "has_details": true,
              "details_path": "/Orange-OpenSource/lfn/onap/xtesting-onap/-/jobs/846752628",
              "illustration": {
                "image": "https://assets.gitlab-static.net/assets/illustrations/skipped-job_empty-29a8a37d8a61d1b6f68cf3484f9024e53cd6eb95e28eae3554f8011a1146bf27.svg",
                "size": "svg-430",
                "title": "This job does not have a trace."
              },
              "favicon": "https://gitlab.com/assets/ci_favicons/favicon_status_failed-41304d7f7e3828808b0c26771f0309e55296819a9beea3ea9fbf6689d9857c12.png"
            },
            "jobs": [
              {
                "id": 846752628,
                "name": "hvves",
                "started": "2020-11-12T22:42:27.190Z",
                "archived": false,
                "build_path": "/Orange-OpenSource/lfn/onap/xtesting-onap/-/jobs/846752628",
                "playable": false,
                "scheduled": false,
                "created_at": "2020-11-12T22:29:48.363Z",
                "updated_at": "2020-11-12T22:45:26.337Z",
                "status": {
                  "icon": "status_warning",
                  "text": "failed",
                  "label": "failed (allowed to fail)",
                  "group": "failed-with-warnings",
                  "tooltip": "failed - (script failure) (allowed to fail)",
                  "has_details": true,
                  "details_path": "/Orange-OpenSource/lfn/onap/xtesting-onap/-/jobs/846752628",
                  "illustration": {
                    "image": "https://assets.gitlab-static.net/assets/illustrations/skipped-job_empty-29a8a37d8a61d1b6f68cf3484f9024e53cd6eb95e28eae3554f8011a1146bf27.svg",
                    "size": "svg-430",
                    "title": "This job does not have a trace."
                  },
                  "favicon": "https://gitlab.com/assets/ci_favicons/favicon_status_failed-41304d7f7e3828808b0c26771f0309e55296819a9beea3ea9fbf6689d9857c12.png"
                },
                "recoverable": false
              }
            ]
          },
          {
            "name": "pnf_registrate",
            "size": 1,
            "status": {
              "icon": "status_warning",
              "text": "failed",
              "label": "failed (allowed to fail)",
              "group": "failed-with-warnings",
              "tooltip": "failed - (script failure) (allowed to fail)",
              "has_details": true,
              "details_path": "/Orange-OpenSource/lfn/onap/xtesting-onap/-/jobs/846752625",
              "illustration": {
                "image": "https://assets.gitlab-static.net/assets/illustrations/skipped-job_empty-29a8a37d8a61d1b6f68cf3484f9024e53cd6eb95e28eae3554f8011a1146bf27.svg",
                "size": "svg-430",
                "title": "This job does not have a trace."
              },
              "favicon": "https://gitlab.com/assets/ci_favicons/favicon_status_failed-41304d7f7e3828808b0c26771f0309e55296819a9beea3ea9fbf6689d9857c12.png"
            },
            "jobs": [
              {
                "id": 846752625,
                "name": "pnf_registrate",
                "started": "2020-11-12T22:42:25.642Z",
                "archived": false,
                "build_path": "/Orange-OpenSource/lfn/onap/xtesting-onap/-/jobs/846752625",
                "playable": false,
                "scheduled": false,
                "created_at": "2020-11-12T22:29:48.299Z",
                "updated_at": "2020-11-12T22:47:32.604Z",
                "status": {
                  "icon": "status_warning",
                  "text": "failed",
                  "label": "failed (allowed to fail)",
                  "group": "failed-with-warnings",
                  "tooltip": "failed - (script failure) (allowed to fail)",
                  "has_details": true,
                  "details_path": "/Orange-OpenSource/lfn/onap/xtesting-onap/-/jobs/846752625",
                  "illustration": {
                    "image": "https://assets.gitlab-static.net/assets/illustrations/skipped-job_empty-29a8a37d8a61d1b6f68cf3484f9024e53cd6eb95e28eae3554f8011a1146bf27.svg",
                    "size": "svg-430",
                    "title": "This job does not have a trace."
                  },
                  "favicon": "https://gitlab.com/assets/ci_favicons/favicon_status_failed-41304d7f7e3828808b0c26771f0309e55296819a9beea3ea9fbf6689d9857c12.png"
                },
                "recoverable": false
              }
            ]
          },
          {
            "name": "vescollector",
            "size": 1,
            "status": {
              "icon": "status_success",
              "text": "passed",
              "label": "passed",
              "group": "success",
              "tooltip": "passed",
              "has_details": true,
              "details_path": "/Orange-OpenSource/lfn/onap/xtesting-onap/-/jobs/846752627",
              "illustration": {
                "image": "https://assets.gitlab-static.net/assets/illustrations/skipped-job_empty-29a8a37d8a61d1b6f68cf3484f9024e53cd6eb95e28eae3554f8011a1146bf27.svg",
                "size": "svg-430",
                "title": "This job does not have a trace."
              },
              "favicon": "https://gitlab.com/assets/ci_favicons/favicon_status_success-8451333011eee8ce9f2ab25dc487fe24a8758c694827a582f17f42b0a90446a2.png"
            },
            "jobs": [
              {
                "id": 846752627,
                "name": "vescollector",
                "started": "2020-11-12T22:42:26.039Z",
                "archived": false,
                "build_path": "/Orange-OpenSource/lfn/onap/xtesting-onap/-/jobs/846752627",
                "playable": false,
                "scheduled": false,
                "created_at": "2020-11-12T22:29:48.341Z",
                "updated_at": "2020-11-12T22:53:08.013Z",
                "status": {
                  "icon": "status_success",
                  "text": "passed",
                  "label": "passed",
                  "group": "success",
                  "tooltip": "passed",
                  "has_details": true,
                  "details_path": "/Orange-OpenSource/lfn/onap/xtesting-onap/-/jobs/846752627",
                  "illustration": {
                    "image": "https://assets.gitlab-static.net/assets/illustrations/skipped-job_empty-29a8a37d8a61d1b6f68cf3484f9024e53cd6eb95e28eae3554f8011a1146bf27.svg",
                    "size": "svg-430",
                    "title": "This job does not have a trace."
                  },
                  "favicon": "https://gitlab.com/assets/ci_favicons/favicon_status_success-8451333011eee8ce9f2ab25dc487fe24a8758c694827a582f17f42b0a90446a2.png"
                }
              }
            ]
          },
          {
            "name": "vnf_basic_vm",
            "size": 1,
            "status": {
              "icon": "status_success",
              "text": "passed",
              "label": "passed",
              "group": "success",
              "tooltip": "passed",
              "has_details": true,
              "details_path": "/Orange-OpenSource/lfn/onap/xtesting-onap/-/jobs/846752622",
              "illustration": {
                "image": "https://assets.gitlab-static.net/assets/illustrations/skipped-job_empty-29a8a37d8a61d1b6f68cf3484f9024e53cd6eb95e28eae3554f8011a1146bf27.svg",
                "size": "svg-430",
                "title": "This job does not have a trace."
              },
              "favicon": "https://gitlab.com/assets/ci_favicons/favicon_status_failed-41304d7f7e3828808b0c26771f0309e55296819a9beea3ea9fbf6689d9857c12.png"
            },
            "jobs": [
              {
                "id": 846752622,
                "name": "vnf_basic_vm",
                "started": "2020-11-12T22:42:24.069Z",
                "archived": false,
                "build_path": "/Orange-OpenSource/lfn/onap/xtesting-onap/-/jobs/846752622",
                "playable": false,
                "scheduled": false,
                "created_at": "2020-11-12T22:29:48.224Z",
                "updated_at": "2020-11-12T23:00:20.362Z",
                "status": {
                  "icon": "status_success",
                  "text": "passed",
                  "label": "passed",
                  "group": "success",
                  "tooltip": "passed",
                  "has_details": true,
                  "details_path": "/Orange-OpenSource/lfn/onap/xtesting-onap/-/jobs/846752622",
                  "illustration": {
                    "image": "https://assets.gitlab-static.net/assets/illustrations/skipped-job_empty-29a8a37d8a61d1b6f68cf3484f9024e53cd6eb95e28eae3554f8011a1146bf27.svg",
                    "size": "svg-430",
                    "title": "This job does not have a trace."
                  },
                  "favicon": "https://gitlab.com/assets/ci_favicons/favicon_status_failed-41304d7f7e3828808b0c26771f0309e55296819a9beea3ea9fbf6689d9857c12.png"
                },
                "recoverable": false
              }
            ]
          }
        ],
        "status": {
          "icon": "status_warning",
          "text": "passed",
          "label": "passed with warnings",
          "group": "success-with-warnings",
          "tooltip": "passed",
          "has_details": true,
          "details_path": "/Orange-OpenSource/lfn/onap/xtesting-onap/-/pipelines/215482920#smoke-usecases",
          "illustration": null,
          "favicon": "https://gitlab.com/assets/ci_favicons/favicon_status_failed-41304d7f7e3828808b0c26771f0309e55296819a9beea3ea9fbf6689d9857c12.png"
        },
        "path": "/Orange-OpenSource/lfn/onap/xtesting-onap/-/pipelines/215482920#smoke-usecases",
        "dropdown_path": "/Orange-OpenSource/lfn/onap/xtesting-onap/-/pipelines/215482920/stage.json?stage=smoke-usecases"
      },
      {
        "name": "onap-security",
        "title": "onap-security: failed",
        "groups": [
          {
            "name": "infrastructure_healthcheck_teardown",
            "size": 1,
            "status": {
              "icon": "status_warning",
              "text": "failed",
              "label": "failed (allowed to fail)",
              "group": "failed-with-warnings",
              "tooltip": "failed - (script failure) (allowed to fail)",
              "has_details": true,
              "details_path": "/Orange-OpenSource/lfn/onap/xtesting-onap/-/jobs/846752639",
              "illustration": {
                "image": "https://assets.gitlab-static.net/assets/illustrations/skipped-job_empty-29a8a37d8a61d1b6f68cf3484f9024e53cd6eb95e28eae3554f8011a1146bf27.svg",
                "size": "svg-430",
                "title": "This job does not have a trace."
              },
              "favicon": "https://gitlab.com/assets/ci_favicons/favicon_status_failed-41304d7f7e3828808b0c26771f0309e55296819a9beea3ea9fbf6689d9857c12.png"
            },
            "jobs": [
              {
                "id": 846752639,
                "name": "infrastructure_healthcheck_teardown",
                "started": "2020-11-12T23:00:26.050Z",
                "archived": false,
                "build_path": "/Orange-OpenSource/lfn/onap/xtesting-onap/-/jobs/846752639",
                "playable": false,
                "scheduled": false,
                "created_at": "2020-11-12T22:29:48.570Z",
                "updated_at": "2020-11-12T23:04:31.461Z",
                "status": {
                  "icon": "status_warning",
                  "text": "failed",
                  "label": "failed (allowed to fail)",
                  "group": "failed-with-warnings",
                  "tooltip": "failed - (script failure) (allowed to fail)",
                  "has_details": true,
                  "details_path": "/Orange-OpenSource/lfn/onap/xtesting-onap/-/jobs/846752639",
                  "illustration": {
                    "image": "https://assets.gitlab-static.net/assets/illustrations/skipped-job_empty-29a8a37d8a61d1b6f68cf3484f9024e53cd6eb95e28eae3554f8011a1146bf27.svg",
                    "size": "svg-430",
                    "title": "This job does not have a trace."
                  },
                  "favicon": "https://gitlab.com/assets/ci_favicons/favicon_status_failed-41304d7f7e3828808b0c26771f0309e55296819a9beea3ea9fbf6689d9857c12.png"
                },
                "recoverable": false
              }
            ]
          },
          {
            "name": "security_cis_kubernetes",
            "size": 1,
            "status": {
              "icon": "status_success",
              "text": "passed",
              "label": "passed",
              "group": "success",
              "tooltip": "passed",
              "has_details": true,
              "details_path": "/Orange-OpenSource/lfn/onap/xtesting-onap/-/jobs/846752633",
              "illustration": {
                "image": "https://assets.gitlab-static.net/assets/illustrations/skipped-job_empty-29a8a37d8a61d1b6f68cf3484f9024e53cd6eb95e28eae3554f8011a1146bf27.svg",
                "size": "svg-430",
                "title": "This job does not have a trace."
              },
              "favicon": "https://gitlab.com/assets/ci_favicons/favicon_status_success-8451333011eee8ce9f2ab25dc487fe24a8758c694827a582f17f42b0a90446a2.png"
            },
            "jobs": [
              {
                "id": 846752633,
                "name": "security_cis_kubernetes",
                "started": "2020-11-12T23:00:24.494Z",
                "archived": false,
                "build_path": "/Orange-OpenSource/lfn/onap/xtesting-onap/-/jobs/846752633",
                "playable": false,
                "scheduled": false,
                "created_at": "2020-11-12T22:29:48.462Z",
                "updated_at": "2020-11-12T23:02:06.216Z",
                "status": {
                  "icon": "status_success",
                  "text": "passed",
                  "label": "passed",
                  "group": "success",
                  "tooltip": "passed",
                  "has_details": true,
                  "details_path": "/Orange-OpenSource/lfn/onap/xtesting-onap/-/jobs/846752633",
                  "illustration": {
                    "image": "https://assets.gitlab-static.net/assets/illustrations/skipped-job_empty-29a8a37d8a61d1b6f68cf3484f9024e53cd6eb95e28eae3554f8011a1146bf27.svg",
                    "size": "svg-430",
                    "title": "This job does not have a trace."
                  },
                  "favicon": "https://gitlab.com/assets/ci_favicons/favicon_status_success-8451333011eee8ce9f2ab25dc487fe24a8758c694827a582f17f42b0a90446a2.png"
                }
              }
            ]
          },
          {
            "name": "security_jdpw_ports",
            "size": 1,
            "status": {
              "icon": "status_success",
              "text": "passed",
              "label": "passed",
              "group": "success",
              "tooltip": "passed",
              "has_details": true,
              "details_path": "/Orange-OpenSource/lfn/onap/xtesting-onap/-/jobs/846752634",
              "illustration": {
                "image": "https://assets.gitlab-static.net/assets/illustrations/skipped-job_empty-29a8a37d8a61d1b6f68cf3484f9024e53cd6eb95e28eae3554f8011a1146bf27.svg",
                "size": "svg-430",
                "title": "This job does not have a trace."
              },
              "favicon": "https://gitlab.com/assets/ci_favicons/favicon_status_failed-41304d7f7e3828808b0c26771f0309e55296819a9beea3ea9fbf6689d9857c12.png"
            },
            "jobs": [
              {
                "id": 846752634,
                "name": "security_jdpw_ports",
                "started": "2020-11-12T23:00:24.758Z",
                "archived": false,
                "build_path": "/Orange-OpenSource/lfn/onap/xtesting-onap/-/jobs/846752634",
                "playable": false,
                "scheduled": false,
                "created_at": "2020-11-12T22:29:48.501Z",
                "updated_at": "2020-11-12T23:13:51.577Z",
                "status": {
                  "icon": "status_success",
                  "text": "passed",
                  "label": "passed",
                  "group": "success",
                  "tooltip": "passed",
                  "has_details": true,
                  "details_path": "/Orange-OpenSource/lfn/onap/xtesting-onap/-/jobs/846752634",
                  "illustration": {
                    "image": "https://assets.gitlab-static.net/assets/illustrations/skipped-job_empty-29a8a37d8a61d1b6f68cf3484f9024e53cd6eb95e28eae3554f8011a1146bf27.svg",
                    "size": "svg-430",
                    "title": "This job does not have a trace."
                  },
                  "favicon": "https://gitlab.com/assets/ci_favicons/favicon_status_failed-41304d7f7e3828808b0c26771f0309e55296819a9beea3ea9fbf6689d9857c12.png"
                },
                "recoverable": false
              }
            ]
          },
          {
            "name": "security_kube_hunter",
            "size": 1,
            "status": {
              "icon": "status_success",
              "text": "passed",
              "label": "passed",
              "group": "success",
              "tooltip": "passed",
              "has_details": true,
              "details_path": "/Orange-OpenSource/lfn/onap/xtesting-onap/-/jobs/846752635",
              "illustration": {
                "image": "https://assets.gitlab-static.net/assets/illustrations/skipped-job_empty-29a8a37d8a61d1b6f68cf3484f9024e53cd6eb95e28eae3554f8011a1146bf27.svg",
                "size": "svg-430",
                "title": "This job does not have a trace."
              },
              "favicon": "https://gitlab.com/assets/ci_favicons/favicon_status_failed-41304d7f7e3828808b0c26771f0309e55296819a9beea3ea9fbf6689d9857c12.png"
            },
            "jobs": [
              {
                "id": 846752635,
                "name": "security_kube_hunter",
                "started": "2020-11-12T23:00:25.163Z",
                "archived": false,
                "build_path": "/Orange-OpenSource/lfn/onap/xtesting-onap/-/jobs/846752635",
                "playable": false,
                "scheduled": false,
                "created_at": "2020-11-12T22:29:48.528Z",
                "updated_at": "2020-11-12T23:01:18.798Z",
                "status": {
                  "icon": "status_success",
                  "text": "passed",
                  "label": "passed",
                  "group": "success",
                  "tooltip": "passed",
                  "has_details": true,
                  "details_path": "/Orange-OpenSource/lfn/onap/xtesting-onap/-/jobs/846752635",
                  "illustration": {
                    "image": "https://assets.gitlab-static.net/assets/illustrations/skipped-job_empty-29a8a37d8a61d1b6f68cf3484f9024e53cd6eb95e28eae3554f8011a1146bf27.svg",
                    "size": "svg-430",
                    "title": "This job does not have a trace."
                  },
                  "favicon": "https://gitlab.com/assets/ci_favicons/favicon_status_failed-41304d7f7e3828808b0c26771f0309e55296819a9beea3ea9fbf6689d9857c12.png"
                },
                "recoverable": false
              }
            ]
          },
          {
            "name": "security_nonssl_endpoints",
            "size": 1,
            "status": {
              "icon": "status_success",
              "text": "passed",
              "label": "passed",
              "group": "success",
              "tooltip": "passed",
              "has_details": true,
              "details_path": "/Orange-OpenSource/lfn/onap/xtesting-onap/-/jobs/846752637",
              "illustration": {
                "image": "https://assets.gitlab-static.net/assets/illustrations/skipped-job_empty-29a8a37d8a61d1b6f68cf3484f9024e53cd6eb95e28eae3554f8011a1146bf27.svg",
                "size": "svg-430",
                "title": "This job does not have a trace."
              },
              "favicon": "https://gitlab.com/assets/ci_favicons/favicon_status_failed-41304d7f7e3828808b0c26771f0309e55296819a9beea3ea9fbf6689d9857c12.png"
            },
            "jobs": [
              {
                "id": 846752637,
                "name": "security_nonssl_endpoints",
                "started": "2020-11-12T23:00:25.745Z",
                "archived": false,
                "build_path": "/Orange-OpenSource/lfn/onap/xtesting-onap/-/jobs/846752637",
                "playable": false,
                "scheduled": false,
                "created_at": "2020-11-12T22:29:48.550Z",
                "updated_at": "2020-11-12T23:03:26.117Z",
                "status": {
                  "icon": "status_success",
                  "text": "passed",
                  "label": "passed",
                  "group": "success",
                  "tooltip": "passed",
                  "has_details": true,
                  "details_path": "/Orange-OpenSource/lfn/onap/xtesting-onap/-/jobs/846752637",
                  "illustration": {
                    "image": "https://assets.gitlab-static.net/assets/illustrations/skipped-job_empty-29a8a37d8a61d1b6f68cf3484f9024e53cd6eb95e28eae3554f8011a1146bf27.svg",
                    "size": "svg-430",
                    "title": "This job does not have a trace."
                  },
                  "favicon": "https://gitlab.com/assets/ci_favicons/favicon_status_failed-41304d7f7e3828808b0c26771f0309e55296819a9beea3ea9fbf6689d9857c12.png"
                },
                "recoverable": false
              }
            ]
          },
          {
            "name": "security_root_pods",
            "size": 1,
            "status": {
              "icon": "status_success",
              "text": "passed",
              "label": "passed",
              "group": "success",
              "tooltip": "passed",
              "has_details": true,
              "details_path": "/Orange-OpenSource/lfn/onap/xtesting-onap/-/jobs/846752630",
              "illustration": {
                "image": "https://assets.gitlab-static.net/assets/illustrations/skipped-job_empty-29a8a37d8a61d1b6f68cf3484f9024e53cd6eb95e28eae3554f8011a1146bf27.svg",
                "size": "svg-430",
                "title": "This job does not have a trace."
              },
              "favicon": "https://gitlab.com/assets/ci_favicons/favicon_status_failed-41304d7f7e3828808b0c26771f0309e55296819a9beea3ea9fbf6689d9857c12.png"
            },
            "jobs": [
              {
                "id": 846752630,
                "name": "security_root_pods",
                "started": "2020-11-12T23:00:23.552Z",
                "archived": false,
                "build_path": "/Orange-OpenSource/lfn/onap/xtesting-onap/-/jobs/846752630",
                "playable": false,
                "scheduled": false,
                "created_at": "2020-11-12T22:29:48.417Z",
                "updated_at": "2020-11-12T23:12:26.858Z",
                "status": {
                  "icon": "status_success",
                  "text": "passed",
                  "label": "passed",
                  "group": "success",
                  "tooltip": "passed",
                  "has_details": true,
                  "details_path": "/Orange-OpenSource/lfn/onap/xtesting-onap/-/jobs/846752630",
                  "illustration": {
                    "image": "https://assets.gitlab-static.net/assets/illustrations/skipped-job_empty-29a8a37d8a61d1b6f68cf3484f9024e53cd6eb95e28eae3554f8011a1146bf27.svg",
                    "size": "svg-430",
                    "title": "This job does not have a trace."
                  },
                  "favicon": "https://gitlab.com/assets/ci_favicons/favicon_status_failed-41304d7f7e3828808b0c26771f0309e55296819a9beea3ea9fbf6689d9857c12.png"
                },
                "recoverable": false
              }
            ]
          },
          {
            "name": "security_unlimitted_pods",
            "size": 1,
            "status": {
              "icon": "status_success",
              "text": "passed",
              "label": "passed",
              "group": "success",
              "tooltip": "passed",
              "has_details": true,
              "details_path": "/Orange-OpenSource/lfn/onap/xtesting-onap/-/jobs/846752631",
              "illustration": {
                "image": "https://assets.gitlab-static.net/assets/illustrations/skipped-job_empty-29a8a37d8a61d1b6f68cf3484f9024e53cd6eb95e28eae3554f8011a1146bf27.svg",
                "size": "svg-430",
                "title": "This job does not have a trace."
              },
              "favicon": "https://gitlab.com/assets/ci_favicons/favicon_status_failed-41304d7f7e3828808b0c26771f0309e55296819a9beea3ea9fbf6689d9857c12.png"
            },
            "jobs": [
              {
                "id": 846752631,
                "name": "security_unlimitted_pods",
                "started": "2020-11-12T23:00:24.035Z",
                "archived": false,
                "build_path": "/Orange-OpenSource/lfn/onap/xtesting-onap/-/jobs/846752631",
                "playable": false,
                "scheduled": false,
                "created_at": "2020-11-12T22:29:48.441Z",
                "updated_at": "2020-11-12T23:02:08.480Z",
                "status": {
                  "icon": "status_success",
                  "text": "passed",
                  "label": "passed",
                  "group": "success",
                  "tooltip": "passed",
                  "has_details": true,
                  "details_path": "/Orange-OpenSource/lfn/onap/xtesting-onap/-/jobs/846752631",
                  "illustration": {
                    "image": "https://assets.gitlab-static.net/assets/illustrations/skipped-job_empty-29a8a37d8a61d1b6f68cf3484f9024e53cd6eb95e28eae3554f8011a1146bf27.svg",
                    "size": "svg-430",
                    "title": "This job does not have a trace."
                  },
                  "favicon": "https://gitlab.com/assets/ci_favicons/favicon_status_failed-41304d7f7e3828808b0c26771f0309e55296819a9beea3ea9fbf6689d9857c12.png"
                },
                "recoverable": false
              }
            ]
          }
        ],
        "status": {
          "icon": "status_success",
          "text": "passed",
          "label": "passed",
          "group": "success",
          "tooltip": "passed",
          "has_details": true,
          "details_path": "/Orange-OpenSource/lfn/onap/xtesting-onap/-/pipelines/215482920#onap-security",
          "illustration": null,
          "favicon": "https://gitlab.com/assets/ci_favicons/favicon_status_failed-41304d7f7e3828808b0c26771f0309e55296819a9beea3ea9fbf6689d9857c12.png"
        },
        "path": "/Orange-OpenSource/lfn/onap/xtesting-onap/-/pipelines/215482920#onap-security",
        "dropdown_path": "/Orange-OpenSource/lfn/onap/xtesting-onap/-/pipelines/215482920/stage.json?stage=onap-security"
      },
      {
        "name": "deploy",
        "title": "deploy: passed",
        "groups": [
          {
            "name": "pages",
            "size": 1,
            "status": {
              "icon": "status_success",
              "text": "passed",
              "label": "passed",
              "group": "success",
              "tooltip": "passed",
              "has_details": true,
              "details_path": "/Orange-OpenSource/lfn/onap/xtesting-onap/-/jobs/846752640",
              "illustration": {
                "image": "https://assets.gitlab-static.net/assets/illustrations/skipped-job_empty-29a8a37d8a61d1b6f68cf3484f9024e53cd6eb95e28eae3554f8011a1146bf27.svg",
                "size": "svg-430",
                "title": "This job does not have a trace."
              },
              "favicon": "https://gitlab.com/assets/ci_favicons/favicon_status_success-8451333011eee8ce9f2ab25dc487fe24a8758c694827a582f17f42b0a90446a2.png"
            },
            "jobs": [
              {
                "id": 846752640,
                "name": "pages",
                "started": "2020-11-12T23:13:55.725Z",
                "archived": false,
                "build_path": "/Orange-OpenSource/lfn/onap/xtesting-onap/-/jobs/846752640",
                "playable": false,
                "scheduled": false,
                "created_at": "2020-11-12T22:29:48.598Z",
                "updated_at": "2020-11-12T23:19:18.927Z",
                "status": {
                  "icon": "status_success",
                  "text": "passed",
                  "label": "passed",
                  "group": "success",
                  "tooltip": "passed",
                  "has_details": true,
                  "details_path": "/Orange-OpenSource/lfn/onap/xtesting-onap/-/jobs/846752640",
                  "illustration": {
                    "image": "https://assets.gitlab-static.net/assets/illustrations/skipped-job_empty-29a8a37d8a61d1b6f68cf3484f9024e53cd6eb95e28eae3554f8011a1146bf27.svg",
                    "size": "svg-430",
                    "title": "This job does not have a trace."
                  },
                  "favicon": "https://gitlab.com/assets/ci_favicons/favicon_status_success-8451333011eee8ce9f2ab25dc487fe24a8758c694827a582f17f42b0a90446a2.png"
                }
              }
            ]
          },
          {
            "name": "pages:deploy",
            "size": 1,
            "status": {
              "icon": "status_success",
              "text": "passed",
              "label": "passed",
              "group": "success",
              "tooltip": "passed",
              "has_details": false,
              "details_path": null,
              "illustration": null,
              "favicon": "https://gitlab.com/assets/ci_favicons/favicon_status_success-8451333011eee8ce9f2ab25dc487fe24a8758c694827a582f17f42b0a90446a2.png"
            },
            "jobs": [
              {
                "id": 846815528,
                "name": "pages:deploy",
                "started": "2020-11-12T23:19:18.991Z",
                "archived": false,
                "build_path": "/Orange-OpenSource/lfn/onap/xtesting-onap/-/jobs/846815528",
                "playable": false,
                "scheduled": false,
                "created_at": "2020-11-12T23:19:18.974Z",
                "updated_at": "2020-11-12T23:20:01.209Z",
                "status": {
                  "icon": "status_success",
                  "text": "passed",
                  "label": "passed",
                  "group": "success",
                  "tooltip": "passed",
                  "has_details": false,
                  "details_path": null,
                  "illustration": null,
                  "favicon": "https://gitlab.com/assets/ci_favicons/favicon_status_success-8451333011eee8ce9f2ab25dc487fe24a8758c694827a582f17f42b0a90446a2.png"
                }
              }
            ]
          }
        ],
        "status": {
          "icon": "status_success",
          "text": "passed",
          "label": "passed",
          "group": "success",
          "tooltip": "passed",
          "has_details": true,
          "details_path": "/Orange-OpenSource/lfn/onap/xtesting-onap/-/pipelines/215482920#deploy",
          "illustration": null,
          "favicon": "https://gitlab.com/assets/ci_favicons/favicon_status_success-8451333011eee8ce9f2ab25dc487fe24a8758c694827a582f17f42b0a90446a2.png"
        },
        "path": "/Orange-OpenSource/lfn/onap/xtesting-onap/-/pipelines/215482920#deploy",
        "dropdown_path": "/Orange-OpenSource/lfn/onap/xtesting-onap/-/pipelines/215482920/stage.json?stage=deploy"
      }
    ],
    "duration": 2952,
    "finished_at": "2020-11-12T23:20:01.247Z",
    "name": "Pipeline",
    "artifacts": [
      {
        "name": "pages:archive",
        "expire_at": "2020-12-12T23:19:15.359Z",
        "expired": false,
        "path": "/Orange-OpenSource/lfn/onap/xtesting-onap/-/jobs/846752640/artifacts/download?file_type=archive",
        "keep_path": "/Orange-OpenSource/lfn/onap/xtesting-onap/-/jobs/846752640/artifacts/keep",
        "browse_path": "/Orange-OpenSource/lfn/onap/xtesting-onap/-/jobs/846752640/artifacts/browse"
      },
      {
        "name": "security_jdpw_ports:archive",
        "expire_at": "2020-12-12T23:13:48.174Z",
        "expired": false,
        "path": "/Orange-OpenSource/lfn/onap/xtesting-onap/-/jobs/846752634/artifacts/download?file_type=archive",
        "keep_path": "/Orange-OpenSource/lfn/onap/xtesting-onap/-/jobs/846752634/artifacts/keep",
        "browse_path": "/Orange-OpenSource/lfn/onap/xtesting-onap/-/jobs/846752634/artifacts/browse"
      },
      {
        "name": "security_root_pods:archive",
        "expire_at": "2020-12-12T23:12:23.517Z",
        "expired": false,
        "path": "/Orange-OpenSource/lfn/onap/xtesting-onap/-/jobs/846752630/artifacts/download?file_type=archive",
        "keep_path": "/Orange-OpenSource/lfn/onap/xtesting-onap/-/jobs/846752630/artifacts/keep",
        "browse_path": "/Orange-OpenSource/lfn/onap/xtesting-onap/-/jobs/846752630/artifacts/browse"
      },
      {
        "name": "infrastructure_healthcheck_teardown:archive",
        "expire_at": "2020-12-12T23:04:28.114Z",
        "expired": false,
        "path": "/Orange-OpenSource/lfn/onap/xtesting-onap/-/jobs/846752639/artifacts/download?file_type=archive",
        "keep_path": "/Orange-OpenSource/lfn/onap/xtesting-onap/-/jobs/846752639/artifacts/keep",
        "browse_path": "/Orange-OpenSource/lfn/onap/xtesting-onap/-/jobs/846752639/artifacts/browse"
      },
      {
        "name": "security_nonssl_endpoints:archive",
        "expire_at": "2020-12-12T23:03:22.842Z",
        "expired": false,
        "path": "/Orange-OpenSource/lfn/onap/xtesting-onap/-/jobs/846752637/artifacts/download?file_type=archive",
        "keep_path": "/Orange-OpenSource/lfn/onap/xtesting-onap/-/jobs/846752637/artifacts/keep",
        "browse_path": "/Orange-OpenSource/lfn/onap/xtesting-onap/-/jobs/846752637/artifacts/browse"
      },
      {
        "name": "vnf_basic_vm:archive",
        "expire_at": "2020-12-12T23:00:17.012Z",
        "expired": false,
        "path": "/Orange-OpenSource/lfn/onap/xtesting-onap/-/jobs/846752622/artifacts/download?file_type=archive",
        "keep_path": "/Orange-OpenSource/lfn/onap/xtesting-onap/-/jobs/846752622/artifacts/keep",
        "browse_path": "/Orange-OpenSource/lfn/onap/xtesting-onap/-/jobs/846752622/artifacts/browse"
      },
      {
        "name": "cmpv2:archive",
        "expire_at": "2020-12-12T22:58:38.609Z",
        "expired": false,
        "path": "/Orange-OpenSource/lfn/onap/xtesting-onap/-/jobs/846752629/artifacts/download?file_type=archive",
        "keep_path": "/Orange-OpenSource/lfn/onap/xtesting-onap/-/jobs/846752629/artifacts/keep",
        "browse_path": "/Orange-OpenSource/lfn/onap/xtesting-onap/-/jobs/846752629/artifacts/browse"
      },
      {
        "name": "vescollector:archive",
        "expire_at": "2020-12-12T22:53:04.368Z",
        "expired": false,
        "path": "/Orange-OpenSource/lfn/onap/xtesting-onap/-/jobs/846752627/artifacts/download?file_type=archive",
        "keep_path": "/Orange-OpenSource/lfn/onap/xtesting-onap/-/jobs/846752627/artifacts/keep",
        "browse_path": "/Orange-OpenSource/lfn/onap/xtesting-onap/-/jobs/846752627/artifacts/browse"
      },
      {
        "name": "basic_network:archive",
        "expire_at": "2020-12-12T22:52:15.760Z",
        "expired": false,
        "path": "/Orange-OpenSource/lfn/onap/xtesting-onap/-/jobs/846752623/artifacts/download?file_type=archive",
        "keep_path": "/Orange-OpenSource/lfn/onap/xtesting-onap/-/jobs/846752623/artifacts/keep",
        "browse_path": "/Orange-OpenSource/lfn/onap/xtesting-onap/-/jobs/846752623/artifacts/browse"
      },
      {
        "name": "5gbulkpm:archive",
        "expire_at": "2020-12-12T22:50:33.675Z",
        "expired": false,
        "path": "/Orange-OpenSource/lfn/onap/xtesting-onap/-/jobs/846752626/artifacts/download?file_type=archive",
        "keep_path": "/Orange-OpenSource/lfn/onap/xtesting-onap/-/jobs/846752626/artifacts/keep",
        "browse_path": "/Orange-OpenSource/lfn/onap/xtesting-onap/-/jobs/846752626/artifacts/browse"
      },
      {
        "name": "pnf_registrate:archive",
        "expire_at": "2020-12-12T22:47:29.169Z",
        "expired": false,
        "path": "/Orange-OpenSource/lfn/onap/xtesting-onap/-/jobs/846752625/artifacts/download?file_type=archive",
        "keep_path": "/Orange-OpenSource/lfn/onap/xtesting-onap/-/jobs/846752625/artifacts/keep",
        "browse_path": "/Orange-OpenSource/lfn/onap/xtesting-onap/-/jobs/846752625/artifacts/browse"
      },
      {
        "name": "hvves:archive",
        "expire_at": "2020-12-12T22:45:22.954Z",
        "expired": false,
        "path": "/Orange-OpenSource/lfn/onap/xtesting-onap/-/jobs/846752628/artifacts/download?file_type=archive",
        "keep_path": "/Orange-OpenSource/lfn/onap/xtesting-onap/-/jobs/846752628/artifacts/keep",
        "browse_path": "/Orange-OpenSource/lfn/onap/xtesting-onap/-/jobs/846752628/artifacts/browse"
      },
      {
        "name": "postinstall:archive",
        "expire_at": "2020-12-12T22:42:18.678Z",
        "expired": false,
        "path": "/Orange-OpenSource/lfn/onap/xtesting-onap/-/jobs/846752621/artifacts/download?file_type=archive",
        "keep_path": "/Orange-OpenSource/lfn/onap/xtesting-onap/-/jobs/846752621/artifacts/keep",
        "browse_path": "/Orange-OpenSource/lfn/onap/xtesting-onap/-/jobs/846752621/artifacts/browse"
      },
      {
        "name": "full:archive",
        "expire_at": "2020-12-12T22:38:10.038Z",
        "expired": false,
        "path": "/Orange-OpenSource/lfn/onap/xtesting-onap/-/jobs/846752617/artifacts/download?file_type=archive",
        "keep_path": "/Orange-OpenSource/lfn/onap/xtesting-onap/-/jobs/846752617/artifacts/keep",
        "browse_path": "/Orange-OpenSource/lfn/onap/xtesting-onap/-/jobs/846752617/artifacts/browse"
      },
      {
        "name": "healthdist:archive",
        "expire_at": "2020-12-12T22:36:19.615Z",
        "expired": false,
        "path": "/Orange-OpenSource/lfn/onap/xtesting-onap/-/jobs/846752620/artifacts/download?file_type=archive",
        "keep_path": "/Orange-OpenSource/lfn/onap/xtesting-onap/-/jobs/846752620/artifacts/keep",
        "browse_path": "/Orange-OpenSource/lfn/onap/xtesting-onap/-/jobs/846752620/artifacts/browse"
      },
      {
        "name": "core:archive",
        "expire_at": "2020-12-12T22:35:43.156Z",
        "expired": false,
        "path": "/Orange-OpenSource/lfn/onap/xtesting-onap/-/jobs/846752615/artifacts/download?file_type=archive",
        "keep_path": "/Orange-OpenSource/lfn/onap/xtesting-onap/-/jobs/846752615/artifacts/keep",
        "browse_path": "/Orange-OpenSource/lfn/onap/xtesting-onap/-/jobs/846752615/artifacts/browse"
      },
      {
        "name": "infrastructure_healthcheck:archive",
        "expire_at": "2020-12-12T22:33:26.581Z",
        "expired": false,
        "path": "/Orange-OpenSource/lfn/onap/xtesting-onap/-/jobs/846752612/artifacts/download?file_type=archive",
        "keep_path": "/Orange-OpenSource/lfn/onap/xtesting-onap/-/jobs/846752612/artifacts/keep",
        "browse_path": "/Orange-OpenSource/lfn/onap/xtesting-onap/-/jobs/846752612/artifacts/browse"
      },
      {
        "name": "security_unlimitted_pods:archive",
        "expire_at": "2020-12-12T23:02:05.151Z",
        "expired": false,
        "path": "/Orange-OpenSource/lfn/onap/xtesting-onap/-/jobs/846752631/artifacts/download?file_type=archive",
        "keep_path": "/Orange-OpenSource/lfn/onap/xtesting-onap/-/jobs/846752631/artifacts/keep",
        "browse_path": "/Orange-OpenSource/lfn/onap/xtesting-onap/-/jobs/846752631/artifacts/browse"
      },
      {
        "name": "security_cis_kubernetes:archive",
        "expire_at": "2020-12-12T23:02:02.275Z",
        "expired": false,
        "path": "/Orange-OpenSource/lfn/onap/xtesting-onap/-/jobs/846752633/artifacts/download?file_type=archive",
        "keep_path": "/Orange-OpenSource/lfn/onap/xtesting-onap/-/jobs/846752633/artifacts/keep",
        "browse_path": "/Orange-OpenSource/lfn/onap/xtesting-onap/-/jobs/846752633/artifacts/browse"
      },
      {
        "name": "security_kube_hunter:archive",
        "expire_at": "2020-12-12T23:01:15.433Z",
        "expired": false,
        "path": "/Orange-OpenSource/lfn/onap/xtesting-onap/-/jobs/846752635/artifacts/download?file_type=archive",
        "keep_path": "/Orange-OpenSource/lfn/onap/xtesting-onap/-/jobs/846752635/artifacts/keep",
        "browse_path": "/Orange-OpenSource/lfn/onap/xtesting-onap/-/jobs/846752635/artifacts/browse"
      }
    ],
    "manual_actions": [],
    "scheduled_actions": []
  },
  "ref": {
    "name": "master",
    "path": "/Orange-OpenSource/lfn/onap/xtesting-onap/-/commits/master",
    "tag": false,
    "branch": true,
    "merge_request": false
  },
  "commit": {
    "id": "4d17b601571c90f471d12b43fda3f0f4e45d1e19",
    "short_id": "4d17b601",
    "created_at": "2020-11-09T12:22:34.000+00:00",
    "parent_ids": [
      "2f572f118f07718f8fc86d3ef91aa0eee0814584"
    ],
    "title": "we can now have an experimental gating",
    "message": "we can now have an experimental gating",
    "author_name": "Sylvain Desbureaux",
    "author_email": "sylvain.desbureaux@orange.com",
    "authored_date": "2020-11-09T12:22:34.000+00:00",
    "committer_name": "Sylvain Desbureaux",
    "committer_email": "sylvain.desbureaux@orange.com",
    "committed_date": "2020-11-09T12:22:34.000+00:00",
    "web_url": "https://gitlab.com/Orange-OpenSource/lfn/onap/xtesting-onap/-/commit/4d17b601571c90f471d12b43fda3f0f4e45d1e19",
    "author": {
      "id": 2352120,
      "name": "Sylvain Desbureaux",
      "username": "sylvainOL",
      "state": "active",
      "avatar_url": "https://secure.gravatar.com/avatar/1642ef2bb4f0e481a4146b6445571cf1?s=80\u0026d=identicon",
      "web_url": "https://gitlab.com/sylvainOL",
      "status_tooltip_html": null,
      "path": "/sylvainOL"
    },
    "author_gravatar_url": "https://secure.gravatar.com/avatar/1642ef2bb4f0e481a4146b6445571cf1?s=80\u0026d=identicon",
    "commit_url": "https://gitlab.com/Orange-OpenSource/lfn/onap/xtesting-onap/-/commit/4d17b601571c90f471d12b43fda3f0f4e45d1e19",
    "commit_path": "/Orange-OpenSource/lfn/onap/xtesting-onap/-/commit/4d17b601571c90f471d12b43fda3f0f4e45d1e19"
  },
  "project": {
    "id": 10614465,
    "name": "xtesting-onap",
    "full_path": "/Orange-OpenSource/lfn/onap/xtesting-onap",
    "full_name": "Orange-OpenSource / lfn / onap / xtesting-onap"
  },
  "triggered_by": null,
  "triggered": []
}