Gear_name,Gear_code,Activity_(s/m2/d),Plough_rate_(m2/s)
Pelagic_Trawl+Seine,PTS,0.00E+00,0
Sandeel+sprat_trawl(Otter30-70mm+TR3),SST,0.00E+00,8.8
Longline_mackerel,LLm,0.00E+00,0
Beam_Trawl_BT1+BT2,BTf,0.00E+00,54.1
Demersal_Seine,DS,0.00E+00,22.4
Demersal_Otter_Trawl_TR1,OT,0.00E+00,17.1
Gill_Nets+Longline_demersal,LLd,0.00E+00,0
Beam_Trawl_shrimp,BTs,0.00E+00,13.5
Nephrops_Trawl_TR2,NT,0.00E+00,78.9
Creels,CR,0.00E+00,0
Mollusc_Dredge,MD,0.00E+00,22.4
Whaler,Wh,0.00E+00,0
