{
  "id": "wfrp4e-ja-jp",
  "title": "日本語 WFRP4e(MRyas私家版)",
  "description": "WFRP4eシステムの日本語化",
  "version": "4.6.1",
  "scripts": [
    "src/wfrp4e-ja-jp.js"
  ],
  "styles": [
    "css/styles.css"
  ],
  "packs": [
    {
      "name": "macros",
      "label": "WFRP4e-ja-JP Macros",
      "path": "packs/macros",
      "type": "Macro",
      "module": "wfrp4e-ja-jp",
      "system": "wfrp4e",
      "ownership": {
        "PLAYER": "OBSERVER",
        "ASSISTANT": "OWNER"
      },
      "flags": {}
    }
  ],
  "url": "https://gitlab.com/MRyas.jp/wfrp4e-ja-jp",
  "download": "https://gitlab.com/MRyas.jp/wfrp4e-ja-jp/-/archive/v4.6.1/wfrp4e-ja-jp-main.zip",
  "manifest": "https://gitlab.com/MRyas.jp/wfrp4e-ja-jp/-/raw/main/module.json",
  "authors": [
    {
      "name": "MRyas.jp",
      "discord": "mryasjp",
      "flags": {}
    }
  ],
  "relationships": {
    "requires": [
      {
        "id": "babele",
        "type": "module",
        "compatibility": {}
      },
      {
        "id": "lib-wrapper",
        "type": "module",
        "compatibility": {}
      }
    ],
    "systems": [
      {
        "id": "wfrp4e",
        "type": "system",
        "compatibility": {
          "minimum": "8.0.0",
          "verified": "8.0.4"
        }
      }
    ]
  },
  "compatibility": {
    "minimum": "12",
    "verified": "12.331"
  }
}