{
    "font_info": {
        "font-name": "Meta Paustian",
        "font-id": "meta-paustian",
        "author-name": "luuse",
        "author-email": "contact@luuse.io",
        "licence": "SIL Open Font License",
        "height": "32",
        "ascent": "22",
        "descent": "10"
    },
    "variables": {
        "guide": {
            "grid": {
                "type": "range",
                "range": [
                    0,
                    1,
                    1
                ],
                "description": "grid",
                "name": "grid",
                "value": "1",
                "unity": ""
            },
            "dot_label": {
                "type": "range",
                "range": [
                    0,
                    1,
                    1
                ],
                "description": "dot label",
                "name": "dot_label",
                "value": "1",
                "unity": ""
            },
            "hints": {
                "type": "range",
                "range": [
                    0,
                    1,
                    1
                ],
                "description": "hints",
                "name": "hints",
                "value": "1",
                "unity": ""
            }
        },
        "dimensions": {
            "outputtemplate": "\"projects/meta-paustian/output-svg/%c.svg\"",
            "outputformat": "\"svg\"",
            "u": {
                "type": "range",
                "range": [
                    0,
                    50,
                    0.05
                ],
                "description": "global unity",
                "name": "u",
                "value": "26",
                "unity": "pt"
            },
            "ux": {
                "type": "range",
                "range": [
                    0,
                    3,
                    0.05
                ],
                "description": "X Unity",
                "name": "ux",
                "value": "1",
                "unity": "u"
            },
            "uy": {
                "type": "range",
                "range": [
                    0,
                    3,
                    0.05
                ],
                "description": "Y Unity",
                "name": "uy",
                "value": "1",
                "unity": "u"
            },
            "s": {
                "type": "range",
                "range": [
                    0,
                    5,
                    0.05
                ],
                "description": "Stroke Unity",
                "name": "s",
                "value": "3.15",
                "unity": "u"
            }
        },
        "graisse": {
            "Variation": {
                "type": "range",
                "range": [
                    0.5,
                    1.5,
                    0.05
                ],
                "description": "Changer Graisse",
                "name": "CG",
                "value": "1",
                "unity": "u"
            }
        },
        "bas de casse": {
            "bdc_droite_vertical": {
                "type": "range",
                "range": [
                    0,
                    5,
                    0.1
                ],
                "description": "Droite Vertical Minuscule",
                "name": "DVM",
                "value": "2.8",
                "unity": "CG"
            },
            "bdc_droite_transversale": {
                "type": "range",
                "range": [
                    0,
                    5,
                    0.1
                ],
                "description": "Droite Transversale Minuscule",
                "name": "DTM",
                "value": "3",
                "unity": "CG"
            },
            "bdc_droite_horizontal": {
                "type": "range",
                "range": [
                    0,
                    5,
                    0.1
                ],
                "description": "Droite Horizontal Minuscule",
                "name": "DHM",
                "value": "1.9",
                "unity": "CG"
            },
            "bdc_arrondie_vertical": {
                "type": "range",
                "range": [
                    0,
                    5,
                    0.1
                ],
                "description": "Arrondie Vertical Minuscule",
                "name": "AVM",
                "value": "3",
                "unity": "CG"
            },
            "bdc_arrondie_transversale": {
                "type": "range",
                "range": [
                    0,
                    5,
                    0.1
                ],
                "description": "Arrondie Transversale Minuscule",
                "name": "ATM",
                "value": "3.2",
                "unity": "CG"
            },
            "bdc_arrondie_horizontal": {
                "type": "range",
                "range": [
                    0,
                    5,
                    0.1
                ],
                "description": "Arrondie Horizontal Minuscule",
                "name": "AHM",
                "value": "2.5",
                "unity": "CG"
            }
        },
        "capitale": {
            "caps_droite_vertical": {
                "type": "range",
                "range": [
                    0,
                    5,
                    0.1
                ],
                "description": "Droite Vertical Capitale",
                "name": "DVC",
                "value": "3",
                "unity": "CG"
            },
            "caps_droite_horizontal": {
                "type": "range",
                "range": [
                    0,
                    5,
                    0.1
                ],
                "description": "Droite Horizontal Capitale",
                "name": "DHC",
                "value": "2.8",
                "unity": "CG"
            },
            "caps_droite_transversale": {
                "type": "range",
                "range": [
                    0,
                    5,
                    0.1
                ],
                "description": "Droite Transversale Capitale",
                "name": "DTC",
                "value": "3.3",
                "unity": "CG"
            },
            "caps_arrondie_vertical": {
                "type": "range",
                "range": [
                    0,
                    5,
                    0.1
                ],
                "description": "Arrondie Vertical Capitale",
                "name": "AVC",
                "value": "3.2",
                "unity": "CG"
            },
            "caps_arrondie_horizontal": {
                "type": "range",
                "range": [
                    0,
                    5,
                    0.1
                ],
                "description": "Arrondie Horizontal Capitale",
                "name": "AHC",
                "value": "3",
                "unity": "CG"
            }
        }
    }
}