{
    "dblp": { 
        "gzfile": "dblp.xml.gz",
        "dtdfile": "dblp.dtd",
        "url": "https://dblp.uni-trier.de/xml/",
        "synonims_filename": "author_synonims.json"
        },
    "neo4j": {
        "url": "bolt://127.0.0.1:7687",
        "host": "localhost",
        "username":"neo4j",
        "password":"scisynergy"
        },
    "repo": {
        "root":"tmp"
        }
    
}
